{"text_format":"1","workbook":"xlsx","n_sheets":3,"sheets":["Home","Shape Limits","Image"],"not_rendered":{"charts":0,"images":74,"macros":1,"external_links":0,"defined_names":135,"comments":0,"pivot_tables":0},"unopened":[],"bounds":{"document_bytes":16777216,"sheet_cells":100000,"rows_first":2000,"rows_last":500,"rows_between":2000,"halvings":0,"cell_chars":16384,"cell_head_chars":4096},"cells_cut":0,"cells_raw":0,"read":"whole","date_system":"1900"}

{"sheet":"Home","index":0,"n_rows":21,"n_cols":15,"rows_kept":21,"cut":false,"hidden":false,"merged":[[0,12,1,14],[12,2,20,4],[12,5,20,9]]}
[null,null,null,null,null,null,null,null,null,null,null,null,"Manufacturing Data"]
[null,null,"Shapes Limitation"]
[null,null,null,"Brickmould",null,"Extrusion",null,"Model No.",null,null,null,1,{"$f":"VLOOKUP($L3,'Shape Limits'!$S:$U,2,FALSE)","v":{"$error":"#N/A"}},{"$f":"VLOOKUP($L3,'Shape Limits'!$S:$U,3,FALSE)","v":{"$error":"#N/A"}},{"$f":"IF((VLOOKUP($L3,'Shape Limits'!$S:$V,4,FALSE))=1,\"Z\",\"\")","v":{"$error":"#N/A"}}]
[null,null,null,null,null,null,null,null,null,null,null,2,{"$f":"VLOOKUP($L4,'Shape Limits'!$S:$U,2,FALSE)","v":{"$error":"#N/A"}},{"$f":"VLOOKUP($L4,'Shape Limits'!$S:$U,3,FALSE)","v":{"$error":"#N/A"}},{"$f":"IF((VLOOKUP($L4,'Shape Limits'!$S:$V,4,FALSE))=1,\"Z\",\"\")","v":{"$error":"#N/A"}}]
[null,null,null,null,"Width","Height",{"$f":"IF(SHAPE=140,\"Leg\",\"Dim. 3\")","v":"Dim. 3"},{"$f":"IF(SHAPE=140,\"CMR\",\"Dim. 4\")","v":"Dim. 4"},null,null,null,3,{"$f":"VLOOKUP($L5,'Shape Limits'!$S:$U,2,FALSE)","v":{"$error":"#N/A"}},{"$f":"VLOOKUP($L5,'Shape Limits'!$S:$U,3,FALSE)","v":{"$error":"#N/A"}},{"$f":"IF((VLOOKUP($L5,'Shape Limits'!$S:$V,4,FALSE))=1,\"Z\",\"\")","v":{"$error":"#N/A"}}]
[null,null,null,null,null,null,null,null,null,null,null,4,{"$f":"VLOOKUP($L6,'Shape Limits'!$S:$U,2,FALSE)","v":{"$error":"#N/A"}},{"$f":"VLOOKUP($L6,'Shape Limits'!$S:$U,3,FALSE)","v":{"$error":"#N/A"}},{"$f":"IF((VLOOKUP($L6,'Shape Limits'!$S:$V,4,FALSE))=1,\"Z\",\"\")","v":{"$error":"#N/A"}}]
[null,null,null,null,{"$f":"IF(AND(SHAPE=120,SHAPEW>0),\"Width is measured diagonally\",\"\")","v":""},null,null,null,null,null,null,5,{"$f":"VLOOKUP($L7,'Shape Limits'!$S:$U,2,FALSE)","v":{"$error":"#N/A"}},{"$f":"VLOOKUP($L7,'Shape Limits'!$S:$U,3,FALSE)","v":{"$error":"#N/A"}},{"$f":"IF((VLOOKUP($L7,'Shape Limits'!$S:$V,4,FALSE))=1,\"Z\",\"\")","v":{"$error":"#N/A"}}]
[null,null,null,{"$f":"IF(AND(SHAPELINK>1,EXTLINK=2,BM_SELECT>1),\"BRICKMOULD NOT AVAILABLE FOR REGENCY\",\"\")","v":""},null,null,null,null,null,null,null,6,{"$f":"VLOOKUP($L8,'Shape Limits'!$S:$U,2,FALSE)","v":{"$error":"#N/A"}},{"$f":"VLOOKUP($L8,'Shape Limits'!$S:$U,3,FALSE)","v":{"$error":"#N/A"}},{"$f":"IF((VLOOKUP($L8,'Shape Limits'!$S:$V,4,FALSE))=1,\"Z\",\"\")","v":{"$error":"#N/A"}}]
[null,null,null,{"$f":"IF(AND(SHAPEW>0,SHAPELIMIT>0,EXT>1),\"SIZE IS OUTSIDE LIMITATION\",\"\")","v":""},null,null,null,null,null,null,null,7,{"$f":"VLOOKUP($L9,'Shape Limits'!$S:$U,2,FALSE)","v":{"$error":"#N/A"}},{"$f":"VLOOKUP($L9,'Shape Limits'!$S:$U,3,FALSE)","v":{"$error":"#N/A"}},{"$f":"IF((VLOOKUP($L9,'Shape Limits'!$S:$V,4,FALSE))=1,\"Z\",\"\")","v":{"$error":"#N/A"}}]
[null,null,null,{"$f":"IF(ISERROR(VLOOKUP(SHAPE,IMAGE_MODEL,3,FALSE)),\"\",VLOOKUP(SHAPE,IMAGE_MODEL,3,FALSE))","v":""},null,null,null,null,null,null,null,8,{"$f":"VLOOKUP($L10,'Shape Limits'!$S:$U,2,FALSE)","v":{"$error":"#N/A"}},{"$f":"VLOOKUP($L10,'Shape Limits'!$S:$U,3,FALSE)","v":{"$error":"#N/A"}},{"$f":"IF((VLOOKUP($L10,'Shape Limits'!$S:$V,4,FALSE))=1,\"Z\",\"\")","v":{"$error":"#N/A"}}]
[null,null,null,{"$f":"IF(AND(SHAPELINK>1,EXTLINK=1),\"Please Select Extrusion and/or BM\",\"\")","v":""},null,null,null,null,null,null,null,9,{"$f":"VLOOKUP($L11,'Shape Limits'!$S:$U,2,FALSE)","v":{"$error":"#N/A"}},{"$f":"VLOOKUP($L11,'Shape Limits'!$S:$U,3,FALSE)","v":{"$error":"#N/A"}},{"$f":"IF((VLOOKUP($L11,'Shape Limits'!$S:$V,4,FALSE))=1,\"Z\",\"\")","v":{"$error":"#N/A"}}]
[null,null,null,null,null,null,null,null,null,null,null,10,{"$f":"VLOOKUP($L12,'Shape Limits'!$S:$U,2,FALSE)","v":{"$error":"#N/A"}},{"$f":"VLOOKUP($L12,'Shape Limits'!$S:$U,3,FALSE)","v":{"$error":"#N/A"}},{"$f":"IF((VLOOKUP($L12,'Shape Limits'!$S:$V,4,FALSE))=1,\"Z\",\"\")","v":{"$error":"#N/A"}}]
[null,null,{"$f":"IF(ISERROR(VLOOKUP(SHAPE,IMAGE_MODEL,2,FALSE)),\"\",VLOOKUP(SHAPE,IMAGE_MODEL,2,FALSE))","v":""},null,null,{"$f":"IF(ISERROR(VLOOKUP(IMAGE,IMAGE_BM,2,FALSE)),\"\",VLOOKUP(IMAGE,IMAGE_BM,2,FALSE))","v":""},null,null,null,null,null,11,{"$f":"VLOOKUP($L13,'Shape Limits'!$S:$U,2,FALSE)","v":{"$error":"#N/A"}},{"$f":"VLOOKUP($L13,'Shape Limits'!$S:$U,3,FALSE)","v":{"$error":"#N/A"}},{"$f":"IF((VLOOKUP($L13,'Shape Limits'!$S:$V,4,FALSE))=1,\"Z\",\"\")","v":{"$error":"#N/A"}}]
[null,null,null,null,null,null,null,null,null,null,null,12,{"$f":"VLOOKUP($L14,'Shape Limits'!$S:$U,2,FALSE)","v":{"$error":"#N/A"}},{"$f":"VLOOKUP($L14,'Shape Limits'!$S:$U,3,FALSE)","v":{"$error":"#N/A"}},{"$f":"IF((VLOOKUP($L14,'Shape Limits'!$S:$V,4,FALSE))=1,\"Z\",\"\")","v":{"$error":"#N/A"}}]
[null,null,null,null,null,null,null,null,null,null,null,13,{"$f":"VLOOKUP($L15,'Shape Limits'!$S:$U,2,FALSE)","v":{"$error":"#N/A"}},{"$f":"VLOOKUP($L15,'Shape Limits'!$S:$U,3,FALSE)","v":{"$error":"#N/A"}},{"$f":"IF((VLOOKUP($L15,'Shape Limits'!$S:$V,4,FALSE))=1,\"Z\",\"\")","v":{"$error":"#N/A"}}]
{"$rows_left_out":7}
{"sheet":"Shape Limits","index":1,"n_rows":352,"n_cols":67,"rows_kept":352,"cut":false,"hidden":true,"merged":[[2,26,2,27],[0,1,0,2],[0,3,0,10],[0,11,0,12],[9,14,17,14],[19,14,26,14],[2,11,6,12],[29,14,36,14],[39,14,45,14],[47,14,55,14],[59,14,66,14],[71,14,79,14],[83,14,91,14],[94,14,99,14],[103,14,111,14],[114,14,120,14],[123,14,131,14],[134,14,140,14],[145,14,151,14],[157,14,165,14],[228,14,235,14],[238,14,246,14],[248,14,256,14],[168,14,176,14],[180,14,188,14],[192,14,200,14],[204,14,212,14],[216,14,224,14]]}
[null,{"$f":"MAX(D5,D13,D23,D32,D43,D51,D61,D74,D87,D97,D106,D118,D126,D138,D146,D161,D171,D183,D195,D207,D219,D231,D242,D252)","v":0},null,"Shapes Min. Max. Limitations",null,null,null,null,null,null,null,{"$f":"IF(O1>\"\",O1,IF(O2>\"\",O2,IF(O3>\"\",O3,IF(O4>\"\",O4,\"\"))))","v":""},null,null,{"$f":"IF($F$5>\"\",$F$5,IF($F$13>\"\",$F$13,IF($F$23>\"\",$F$23,IF($F$32>\"\",$F$32,IF($F$43>\"\",$F$43,IF($G$51>\"\",$G$51,\"\"))))))","v":""}]
[null,105,"Min R","Max W","Max UI","Max Sq.ft",null,"Frame Height:",{"$f":"IF(AND(SHAPEW>0,SHAPE=B2),SHAPEW/2,0)","v":0},null,null,null,null,null,{"$f":"IF(F61>\"\",F61,IF(G74>\"\",G74,IF(F87>\"\",F87,IF(F97>\"\",F97,IF(F106>\"\",F106,IF(F118>\"\",F118,\"\"))))))","v":""},null,null,null,null,null,null,null,null,null,null,null,null,null,null,null,null,null,null,null,null,null,null,null,null,null,null,null,null,null,null,null,null,null,null,null,null,null,null,null,null,null,"Min. W","Min. H 113","Min. H 115","Max. W","Max. H","Max. UI","Max. SF","Min. R","Min. Leg","CutLength","Min. Angle"]
[null,{"$f":"EXT","v":1},{"$f":"MIN_R","v":""},{"$f":"MAX_W","v":""},{"$f":"MAX_UI","v":""},{"$f":"MAX_SF","v":""},null,"Glass R:",{"$f":"IF(AND(SHAPEW>0,OFFSET>0,SHAPE=B2),I2-OFFSET,0)","v":0},"BM R:",{"$f":"IF(AND(SHAPEW>0,SHAPE=B2),I2+(BM-BM_DEDUCT),0)","v":0},{"$f":"VLOOKUP(B2,IMAGE_MODEL,2,FALSE)","v":{"$error":"#VALUE!"}},null,null,{"$f":"IF(F126>\"\",F126,IF(F138>\"\",F138,IF(G146>\"\",G146,IF(F161>\"\",F161,IF(F195>\"\",F195,IF(G207>\"\",G207,\"\"))))))","v":""},null,null,null,null,null,null,null,null,null,null,null,"Shapes",null,null,null,null,null,null,"DYE#","OFFSET","EXTOFFSET",null,null,null,null,"Model","Width","Height","Area",null,null,"SS (2.2)","DS (3.2)","4 mm","TS (5.0)",null,null,null,null,null,7627,12,{"$f":"(TRUNC(SQRT(SHAPEW+5.75)*16+0.5)/16)+(OFFSET*2)","v":2.375},{"$f":"(TRUNC(SQRT(SHAPEW+5.75)*16+0.5)/16)+(OFFSET*2)","v":2.375},108,108,162,56,13,6,10,8.5]
[null,{"$f":"BM_DYE","v":0},{"$f":"IF(AND(SHAPEW>0,SHAPE=B2,(SHAPEW/2)<C3),1,0)","v":0},{"$f":"IF(AND(SHAPEW>0,EXTLINK>1,SHAPE=B2,SHAPEW>D3),1,0)","v":0},{"$f":"IF(AND(SHAPEW>0,EXTLINK>1,SHAPE=B2,(SHAPEW+SHAPEH)>E3),1,0)","v":0},{"$f":"IF(AND(SHAPEW>0,EXTLINK>1,SHAPE=B2,((SHAPEW*SHAPEH)/144)>F3),1,0)","v":0},null,"Glass H:",{"$f":"IF(AND(SHAPEW>0,SHAPE=B2),I2-(OFFSET*2),0)","v":0},"BM H:",{"$f":"IF(AND(SHAPEW>0,SHAPE=B2),I2+((BM-BM_DEDUCT)*2),0)","v":0},null,null,null,{"$f":"IF(G171>\"\",G171,IF(G183>\"\",G183,IF(G219>\"\",G219,IF(G231>\"\",G231,IF(G242>\"\",G242,IF(G252>\"\",G252,\"\"))))))","v":""},null,null,null,null,null,null,null,null,null,null,1,"Select","Select",null,"<< Cut Angle",null,1,"Select",1,0,0,null,null,null,null,105,{"$f":"GW_105","v":0},{"$f":"GH_105","v":0},{"$f":"(AP4*AQ4)/144","v":0},null,"Max. Short",{"$f":"IF(OR($AP$29>41,$AP$43>41),0,41)","v":41},{"$f":"IF(OR($AP$29>56,$AP$43>56),0,56)","v":56},{"$f":"IF(OR($AP$29>76,$AP$43>76),0,76)","v":76},{"$f":"IF(OR($AP$29>76,$AP$43>76),0,76)","v":76},"Annealed",null,null,null,null,7631,12,{"$f":"(TRUNC(SQRT(SHAPEW+7.3125)*16+0.5)/16)+(OFFSET*2)","v":2.6875},{"$f":"(TRUNC(SQRT(SHAPEW+7.3125)*16+0.5)/16)+(OFFSET*2)","v":2.6875},108,108,162,56,13.5,6,10,8.5]
[null,null,{"$f":"MAX(C4:F4)","v":0},{"$f":"IF(AND(SHAPE=B2,C5=1),1,0)","v":0},{"$f":"IF(AND(SHAPEW>0,SHAPEH>0,SHAPE=B2,SHAPEH<>(SHAPEW/2)),1,0)","v":0},{"$f":"IF(AND(SHAPE=105,E5=1),\"HEIGHT MUST BE 1/2 THE WIDTH\",IF(AND(SHAPE=105,SHAPEW>0,C4>0),\"RADIUS MUST BE GREATER THAN \"&C3,IF(AND(SHAPE=105,I5>0,I5<GlassMinW),\"Glass Width is Under Minimum\",IF(AND(SHAPE=105,I4>0,I4<GlassMinH),\"Glass Height is Under Minimum\",\"\"))))","v":""},null,"Glass W:",{"$f":"IF(AND(SHAPEW>0,SHAPE=B2,EXTRUSION=\"Mezzo\"),(2*(SQRT(I4*((2*((SHAPEW/2)-OFFSET))-I4))))-0.1875,IF(AND(SHAPEW>0,SHAPE=B2),2*(SQRT(I4*((2*((SHAPEW/2)-OFFSET))-I4))),0))","v":0},"BM W:",{"$f":"IF(AND(SHAPEW>0,SHAPE=B2),SHAPEW+((BM-BM_DEDUCT)*2),0)","v":0},null,null,null,null,null,null,105,{"$f":"IF(SHAPE=R5,1,0)","v":0},{"$f":"IF(S5>0,\"Frame Width:\",0)","v":0},{"$f":"IF(S5>0,SHAPEW,0)","v":0},{"$f":"IF(AND(S5>0,SHAPEW>0,D4>0),1,0)","v":0},null,null,null,2,105,"105 (Circle Top)",null,null,null,2,"Regency","PI7301",1.4375,1.86,null,null,null,null,110,{"$f":"GW_110","v":0},{"$f":"GH_110","v":0},{"$f":"(AP5*AQ5)/144","v":0},null,"Max. Long",{"$f":"IF(OR($AQ$29>62,$AQ$43>62),0,62)","v":62},{"$f":"IF(OR($AQ$29>76,$AQ$43>76),0,76)","v":76},{"$f":"IF(OR($AQ$29>110,$AQ$43>110),0,110)","v":110},{"$f":"IF(OR($AQ$29>110,$AQ$43>110),0,110)","v":110},"Annealed",null,null,null,null,"PI7301",10,{"$f":"(TRUNC(SQRT(SHAPEW+5.75)*16+0.5)/16)+(OFFSET*2)","v":2.375},{"$f":"(TRUNC(SQRT(SHAPEW+5.75)*16+0.5)/16)+(OFFSET*2)","v":2.375},95,95,154,56,13,6,10,8.5]
[null,null,null,null,null,null,null,null,null,"BM Leg:",{"$f":"IF(AND(SHAPEW>0,SHAPE=B2),BM,0)","v":0},null,null,null,null,null,null,105,{"$f":"IF(SHAPE=R6,2,0)","v":0},{"$f":"IF(S6>0,\"Frame Height:\",0)","v":0},{"$f":"IF(S6>0,I2,0)","v":0},null,null,null,null,3,110,"110 (Circle Top w/Ex Leg)",null,null,null,3,"3000 Series",7627,1.25,1.871,null,null,null,null,111,{"$f":"GW_111","v":0},{"$f":"GW_111","v":0},0,null,"Max Sq.Ft.",{"$f":"IF(OR($AR$29>12,$AR$43>12),0,12)","v":12},{"$f":"IF(OR($AR$29>22,$AR$43>22),0,22)","v":22},{"$f":"IF(OR($AR$29>42,$AR$43>42),0,42)","v":42},{"$f":"IF(OR($AR$29>42,$AR$43>42),0,42)","v":42},"Annealed",null,null,null,null,"1556A",12,12,12,108,108,162,56,13,6,10,8.5]
[null,null,null,null,null,null,null,null,null,null,null,null,null,null,null,null,null,105,{"$f":"IF(SHAPE=R7,3,0)","v":0},{"$f":"IF(S7>0,\"Frame Radius:\",0)","v":0},{"$f":"IF(S7>0,I2,0)","v":0},{"$f":"IF(AND(S7>0,SHAPEW>0,C4>0),1,0)","v":0},null,null,null,4,111,"111 (Quarter Arch)",null,null,null,4,"4000 Series",7631,1.7849999999999999,2.3386,null,null,null,null,112,{"$f":"GW_112","v":0},{"$f":"GH_112","v":0},0,null,"Max. Short",0,{"$f":"IF(OR($AP$29>42,$AP$43>42),0,42)","v":42},{"$f":"IF(OR($AP$29>70,$AP$43>70),0,70)","v":70},{"$f":"IF(OR($AP$29>70,$AP$43>70),0,70)","v":70},"Tempered",null,null,null,null,1556,12,12,12,108,108,162,56,13,6,10,8.5]
[null,null,null,null,null,null,null,null,null,null,null,null,null,null,null,null,null,105,{"$f":"IF(SHAPE=R8,4,0)","v":0},{"$f":"IF(S8>0,\"Glass Radius:\",0)","v":0},{"$f":"IF(S8>0,I3,0)","v":0},null,null,null,null,5,112,"112 (Quarter Arch w/Ex Leg)",null,null,null,1,{"$f":"VLOOKUP(EXTLINK,EXTCHART,2,FALSE)","v":"Select"},{"$f":"VLOOKUP(EXTLINK,EXTCHART,3,FALSE)","v":1},{"$f":"VLOOKUP(EXTLINK,EXTCHART,4,FALSE)","v":0},{"$f":"VLOOKUP(EXTLINK,EXTCHART,5,FALSE)","v":0},null,null,null,null,113,{"$f":"GW_113","v":0},{"$f":"GH_113","v":0},0,null,"Max. Long",0,{"$f":"IF(OR($AQ$29>84,$AQ$43>84),0,84)","v":84},{"$f":"IF(OR($AQ$29>129,$AQ$43>129),0,129)","v":129},{"$f":"IF(OR($AQ$29>129,$AQ$43>129),0,129)","v":129},"Tempered",null,null,null,null,6184,12,12,12,108,108,162,56,13,6,10,8.5]
[null,null,null,null,null,null,null,null,null,null,null,null,null,null,null,null,null,105,{"$f":"IF(SHAPE=R9,5,0)","v":0},{"$f":"IF(S9>0,\"Glass Width:\",0)","v":0},{"$f":"IF(S9>0,I5,0)","v":0},{"$f":"IF(AND(U9>0,SHAPEW>0,GW_105<GlassMinW),1,0)","v":0},null,null,null,6,113,"113 (Eyebrow)",null,null,null,null,null,null,null,null,null,null,null,null,114,{"$f":"GW_114","v":0},{"$f":"GH_114","v":0},0,null,"Max Sq.Ft.",0,{"$f":"IF(OR($AR$29>24.5,$AR$43>24.5),0,24.5)","v":24.5},{"$f":"IF(OR($AR$29>42,$AR$43>42),0,42)","v":42},{"$f":"IF(OR($AR$29>42,$AR$43>42),0,42)","v":42},"Tempered",null,null,null,null,7634,12,12,12,108,108,162,56,16,6,10,8.5]
[null,110,"Min R","Max W","Max UI","Max H","Min Leg",null,"Frame Height:",{"$f":"IF(AND(SHAPEW>0,SHAPEH>0,SHAPE=110),SHAPEH,0)","v":0},null,null,null,null,{"$f":"VLOOKUP(B10,IMAGE_MODEL,2,FALSE)","v":{"$error":"#VALUE!"}},null,null,105,{"$f":"IF(SHAPE=R10,6,0)","v":0},{"$f":"IF(S10>0,\"Glass Height:\",0)","v":0},{"$f":"IF(S10>0,I4,0)","v":0},{"$f":"IF(AND(U10>0,SHAPEW>0,GH_105<GlassMinH),1,0)","v":0},null,null,null,7,114,"114 (Eyebrow w/Ex Leg)",null,null,null,{"$f":"EXTLINK&\"-\"&BM_SELECT","v":"1-1"},"Image Selection",null,null,null,null,null,null,null,115,{"$f":"GW_115","v":0},{"$f":"GH_115","v":0},0,null,null,{"$f":"IF(AND(AU4>0,AU5>0,AU6>0),1,0)","v":1},{"$f":"IF(AND(AV4>0,AV5>0,AV6>0),1,0)","v":1},{"$f":"IF(AND(AW4>0,AW5>0,AW6>0),1,0)","v":1},{"$f":"IF(AND(AX4>0,AX5>0,AX6>0),1,0)","v":1},{"$f":"IF(AU10>0,\"≥SS Annealed\",IF(AV10>0,\"≥DS Annealed\",IF(AX10>0,\"TS Annealed\",\"\")))","v":"≥SS Annealed"},null,null,null,null,7635,12,12,12,108,108,162,56,13,6,10,8.5]
[null,{"$f":"EXT","v":1},{"$f":"MIN_R","v":""},{"$f":"MAX_W","v":""},{"$f":"MAX_UI","v":""},{"$f":"MAX_H","v":""},6.25E-2,null,"Glass W:",{"$f":"IF(AND(SHAPEW>0,SHAPEH>0,OFFSET>0,SHAPE=110),SHAPEW-(OFFSET*2),0)","v":0},null,null,null,null,null,null,null,105,{"$f":"IF(SHAPE=R11,7,0)","v":0},{"$f":"IF(S11>0,\"Max Width:\",0)","v":0},{"$f":"IF(S11>0,D3,0)","v":0},{"$f":"IF(AND(S11>0,SHAPEW>0,I2>U11),1,0)","v":0},null,null,null,8,115,"115 (Half Eyebrow)",null,null,null,null,null,null,null,null,null,null,null,null,116,{"$f":"GW_116","v":0},{"$f":"GH_116","v":0},0,null,null,null,{"$f":"IF(AND(AV7>0,AV8>0,AV9>0),1,0)","v":1},{"$f":"IF(AND(AW7>0,AW8>0,AW9>0),1,0)","v":1},{"$f":"IF(AND(AX7>0,AX8>0,AX9>0),1,0)","v":1},{"$f":"IF(AV11>0,\"≥DS Tempered\",IF(AX11>0,\"TS Tempered\",\"\"))","v":"≥DS Tempered"},null,null,null,null,"15182A",12,12,12,108,108,162,56,13,6,10,8.5]
[null,{"$f":"BM_DYE","v":0},{"$f":"IF(AND(SHAPEW>0,SHAPE=B10,(SHAPEW/2)<C11),1,0)","v":0},{"$f":"IF(AND(SHAPEW>0,EXTLINK>1,SHAPE=B10,SHAPEW>D11),1,0)","v":0},{"$f":"IF(AND(SHAPEW>0,EXTLINK>1,SHAPE=B10,(SHAPEW+SHAPEH)>E11),1,0)","v":0},{"$f":"IF(AND(SHAPEW>0,EXTLINK>1,SHAPE=B10,SHAPEH>F11),1,0)","v":0},{"$f":"IF(AND(SHAPEW>0,SHAPEH>0,SHAPE=110,(SHAPEH-SHAPEW/2)<G11),1,0)","v":0},null,"Glass H:",{"$f":"IF(AND(SHAPEW>0,SHAPEH>0,OFFSET>0,SHAPE=110),SHAPEH-(OFFSET*2),0)","v":0},null,null,null,null,null,null,null,105,{"$f":"IF(SHAPE=R12,8,0)","v":0},{"$f":"IF(S12>0,\"Max UI:\",0)","v":0},{"$f":"IF(S12>0,E3,0)","v":0},{"$f":"IF(AND(S12>0,SHAPEW>0,E4>0),1,0)","v":0},null,null,null,9,116,"116 (Half Eyebrow w/Ex Leg)",null,null,null,null,"Brickmould Description","Dye","BM_THICK","BM_3000","BM_4000",null,null,null,117,{"$f":"GW_117","v":0},{"$f":"GH_117","v":0},0,null,null,"2.5 mm","3.2 mm","4 mm","5 mm",null,null,null,null,null,15182,12,12,12,108,108,162,56,13,6,10,8.5]
[null,null,{"$f":"MAX(C12:G12)","v":0},{"$f":"IF(AND(SHAPE=B10,C13=1),1,0)","v":0},{"$f":"IF(AND(SHAPEW>0,OFFSET>0,DIM_4>0,SHAPEH>0,SHAPE=B10,(SHAPEH-DIM_4)<>(SHAPEW/2)),1,0)","v":0},{"$f":"IF(AND(SHAPE=110,E13=1),\"HEIGHT MUST BE 1/2 THE WIDTH + Leg\",IF(AND(SHAPE=110,SHAPEW>0,C12>0),\"RADIUS MUST BE GREATER THAN \"&C11,IF(AND(SHAPE=110,J13>0,J13<GlassMinW),\"Glass Width is Under Minimum\",IF(AND(SHAPE=110,J14>0,J14<GlassMinH),\"Glass Height is Under Minimum\",\"\"))))","v":""},null,null,"Glass Leg H:",{"$f":"IF(AND(SHAPEW>0,SHAPEH>0,OFFSET>0,SHAPE=110,((SHAPEH-SHAPEW/2)-OFFSET)>0),(SHAPEH-SHAPEW/2)-OFFSET,0)","v":0},null,null,null,null,null,null,null,105,{"$f":"IF(SHAPE=R13,9,0)","v":0},{"$f":"IF(S13>0,\"Max Sq.ft:\",0)","v":0},{"$f":"IF(S13>0,F3,0)","v":0},{"$f":"IF(AND(S13>0,SHAPEW>0,F4>0),1,0)","v":0},null,null,null,10,117,"117 (Ellipse)",null,null,null,1,"No Brickmould",0,0,0,0,null,null,null,118,{"$f":"GW_118","v":0},{"$f":"GH_118","v":0},0,null,"Max. Short",{"$f":"IF(OR($AQ$29>41,$AQ$43>41),0,41)","v":41},{"$f":"IF(OR($AQ$29>56,$AQ$43>56),0,56)","v":56},{"$f":"IF(OR($AQ$29>76,$AQ$43>76),0,76)","v":76},{"$f":"IF(OR($AQ$29>76,$AQ$43>76),0,76)","v":76},"Annealed",null,null,null,null,"15184A",12,12,12,108,108,162,56,13,6,10,8.5]
[null,null,null,null,null,null,null,null,"Glass R:",{"$f":"IF(AND(SHAPEW>0,SHAPEH>0,OFFSET>0,SHAPE=B10),(SHAPEW/2)-OFFSET,0)","v":0},null,null,null,null,null,null,null,105,{"$f":"IF(AND(BM_SELECT>1,SHAPE=R14),10,0)","v":0},{"$f":"IF(S14>0,\"Brickmould Width:\",0)","v":0},{"$f":"IF(S14>0,K5,0)","v":0},null,null,null,null,11,118,"118 (Full Circle)",null,null,null,2,"Slope Sill - No Nail Fin","1556A",0.92400000000000004,1.133,1.6679999999999999,null,null,null,119,{"$f":"GW_119","v":0},{"$f":"GH_119","v":0},0,null,"Max. Long",{"$f":"IF(OR($AP$29>62,$AP$43>62),0,62)","v":62},{"$f":"IF(OR($AP$29>76,$AP$43>76),0,76)","v":76},{"$f":"IF(OR($AP$29>110,$AP$43>110),0,110)","v":110},{"$f":"IF(OR($AP$29>110,$AP$43>110),0,110)","v":110},"Annealed",null,null,null,null,15184,12,12,12,108,108,162,56,13,6,10,8.5]
[null,null,null,null,null,null,null,null,"BM Leg H:",{"$f":"IF(AND(SHAPEW>0,SHAPEH>0,SHAPE=110),(SHAPEH-SHAPEW/2)+(BM-BM_DEDUCT),0)","v":0},null,null,null,null,null,null,null,105,{"$f":"IF(AND(BM_SELECT>1,SHAPE=R15),11,0)","v":0},{"$f":"IF(S15>0,\"Brickmould Height:\",0)","v":0},{"$f":"IF(S15>0,K4,0)","v":0},null,null,null,null,12,119,"119 (Oval)",null,null,null,3,"Slope Sill - Nail Fin",1556,2.7989999999999999,1.133,1.6679999999999999,null,null,null,120,{"$f":"GW_120","v":0},{"$f":"GH_120","v":0},0,null,"Max Sq.Ft.",{"$f":"IF(OR($AR$29>12,$AR$43>12),0,12)","v":12},{"$f":"IF(OR($AR$29>22,$AR$43>22),0,22)","v":22},{"$f":"IF(OR($AR$29>42,$AR$43>42),0,42)","v":42},{"$f":"IF(OR($AR$29>42,$AR$43>42),0,42)","v":42},"Annealed",null,null,null,null,"15184B",12,12,12,108,108,162,56,13,6,10,8.5]
{"$rows_left_out":338}
{"sheet":"Image","index":2,"n_rows":28,"n_cols":9,"rows_kept":28,"cut":false,"hidden":true,"merged":[]}
[]
[null,105,{"$error":"#VALUE!"},{"$f":"LIMIT_105","v":""},null,null,"2-1",{"$error":"#VALUE!"},"Regency"]
[null,110,{"$error":"#VALUE!"},{"$f":"LIMIT_110","v":""},null,null,"3-1",{"$error":"#VALUE!"},3000]
[null,111,{"$error":"#VALUE!"},{"$f":"LIMIT_111","v":""},null,null,"4-1",{"$error":"#VALUE!"},4000]
[null,112,{"$error":"#VALUE!"},{"$f":"LIMIT_112","v":""},null,null,"3-2",{"$error":"#VALUE!"},"1556A"]
[null,113,{"$error":"#VALUE!"},{"$f":"LIMIT_113","v":""},null,null,"3-3",{"$error":"#VALUE!"},1556]
[null,114,{"$error":"#VALUE!"},{"$f":"LIMIT_114","v":""},null,null,"3-4",{"$error":"#VALUE!"},6184]
[null,115,{"$error":"#VALUE!"},{"$f":"LIMIT_115","v":""},null,null,"3-5",{"$error":"#VALUE!"},7634]
[null,116,{"$error":"#VALUE!"},{"$f":"LIMIT_116","v":""},null,null,"3-6",{"$error":"#VALUE!"},7635]
[null,117,{"$error":"#VALUE!"},{"$f":"LIMIT_117","v":""},null,null,"3-7",{"$error":"#VALUE!"},"15182A"]
[null,118,{"$error":"#VALUE!"},{"$f":"LIMIT_118","v":""},null,null,"3-8",{"$error":"#VALUE!"},15182]
[null,119,{"$error":"#VALUE!"},{"$f":"LIMIT_119","v":""},null,null,"3-9",{"$error":"#VALUE!"},"15184A"]
[null,120,{"$error":"#VALUE!"},{"$f":"LIMIT_120","v":""},null,null,"3-10",{"$error":"#VALUE!"},15184]
[null,121,{"$error":"#VALUE!"},{"$f":"LIMIT_121","v":""},null,null,"3-11",{"$error":"#VALUE!"},"15184B"]
[null,122,{"$error":"#VALUE!"},{"$f":"LIMIT_122","v":""},null,null,"3-12",{"$error":"#VALUE!"},"15368A"]
{"$rows_left_out":13}