{"text_format":"1","workbook":"xlsx","n_sheets":4,"sheets":["Form","Balance","CMR","Data"],"not_rendered":{"charts":0,"images":1,"macros":1,"external_links":0,"defined_names":218,"comments":0,"pivot_tables":0},"unopened":[],"bounds":{"document_bytes":16777216,"sheet_cells":100000,"rows_first":2000,"rows_last":500,"rows_between":2000,"halvings":0,"cell_chars":16384,"cell_head_chars":4096},"cells_cut":0,"cells_raw":0,"read":"whole","date_system":"1900"}

{"sheet":"Form","index":0,"n_rows":24,"n_cols":16,"rows_kept":24,"cut":false,"hidden":false,"merged":[[17,9,17,10],[3,1,3,7],[2,9,2,12],[2,13,2,14],[3,9,3,12],[3,13,3,14],[2,6,2,7],[2,1,2,5],[17,13,18,15]]}
[null,{"$f":"IF(AND(TIGMODEL>\"\",TIG=\"\"),\"TIG with 4mm glass ONLY (Special order, contact CS)\",IF(AND(TIGMODEL>\"\",TIGBAL=1),\"TIG is NOT Available\",IF(TIG_NOTE>\"\",TIG_NOTE,\"\")))","v":""}]
[null,{"$f":"IF(AND(WSIZE>0,HSIZE>0),\"Only Available At\"&\"  \"&WSIZE&\" x \"&HSIZE&IF(HCONTROL=1,\" or \"&HSIZE2,\"\"),\"\")","v":""},null,null,null,null,null,"Select a Model",null,{"$f":"IF(SHATERROR=1,\"Adjust CMR to Increase Egress Height\",IF(SHAT_MIN_R=1,SHAT_MESSAGE,\"\"))","v":{"$error":"#N/A"}}]
[null,{"$f":"IF(Model_Select=\"Select Model\",\"\",\"(Model\"&\" \"&ModelNo&\")\")","v":""},null,null,null,null,"Select Model",null,null,{"$f":"\"Min. W:\"&\" \"&MINW","v":"Min. W: 0"},null,null,null,{"$f":"\"Max W:\"&\" \"&MAXW","v":"Max W: 0"}]
[null,{"$f":"Description","v":0},null,null,null,null,null,null,null,{"$f":"\"Min. H:\"&\" \"&MINH","v":"Min. H: 0"},null,null,null,{"$f":"\"Max H:\"&\" \"&MAXH","v":"Max H: 0"},null,{"$f":"\"Max UI:\"&\" \"&MAXUI","v":"Max UI: 0"}]
[null,{"$f":"IF(AND(W>0,H>0),(IF(ISERROR(VLOOKUP(1,Data!$A:$D,3,FALSE)),\"\",VLOOKUP(1,Data!$A:$D,3,FALSE))),\"\")","v":""},null,null,null,null,null,{"$f":"IF(AND(W>0,H>0),(IF(ISERROR(VLOOKUP(1,Data!$A:$D,4,FALSE)),\"\",VLOOKUP(1,Data!$A:$D,4,FALSE))),\"\")","v":""},null,null,null,null,null,"Exact Size"]
[null,{"$f":"IF(AND(W>0,H>0),(IF(ISERROR(VLOOKUP(2,Data!$A:$D,3,FALSE)),\"\",VLOOKUP(2,Data!$A:$D,3,FALSE))),\"\")","v":""},null,null,null,null,null,{"$f":"IF(AND(W>0,H>0),(IF(ISERROR(VLOOKUP(2,Data!$A:$D,4,FALSE)),\"\",VLOOKUP(2,Data!$A:$D,4,FALSE))),\"\")","v":""},null,"Width:",null,null,null,{"$f":"IF(AND(RO=2,W>0),W-WCUTBACK,W)","v":0},{"$f":"IF(AND(W>0,WSIZE>0,W<>WSIZE),\"<< Width Not Available\",\"\")","v":""}]
[null,{"$f":"IF(AND(W>0,H>0),(IF(ISERROR(VLOOKUP(3,Data!$A:$D,3,FALSE)),\"\",VLOOKUP(3,Data!$A:$D,3,FALSE))),\"\")","v":""},null,null,null,null,null,{"$f":"IF(AND(W>0,H>0),(IF(ISERROR(VLOOKUP(3,Data!$A:$D,4,FALSE)),\"\",VLOOKUP(3,Data!$A:$D,4,FALSE))),\"\")","v":""},null,"Height:",null,null,null,{"$f":"IF(AND(RO=2,H>0),H-HCUTBACK,H)","v":0},{"$f":"IF(AND(H>0,HSIZE>0,H<>HSIZE),\"<< Height Not Available\",\"\")","v":""}]
[null,{"$f":"IF(AND(W>0,H>0),(IF(ISERROR(VLOOKUP(4,Data!$A:$D,3,FALSE)),\"\",VLOOKUP(4,Data!$A:$D,3,FALSE))),\"\")","v":""},null,null,null,null,null,{"$f":"IF(AND(W>0,H>0),(IF(ISERROR(VLOOKUP(4,Data!$A:$D,4,FALSE)),\"\",VLOOKUP(4,Data!$A:$D,4,FALSE))),\"\")","v":""},null,{"$f":"IF(OR(ModelNo=\"S140\",ModelNo=\"S144\",ModelNo=\"S146\",ModelNo=\"S140 (HP)\",ModelNo=\"S144 (HP)\",ModelNo=\"S146 (HP)\"),\"Leg:\",\"\")","v":""},null,null,null,{"$f":"LEG_MESSAGE","v":""}]
[null,{"$f":"IF(AND(W>0,H>0),(IF(ISERROR(VLOOKUP(5,Data!$A:$D,3,FALSE)),\"\",VLOOKUP(5,Data!$A:$D,3,FALSE))),\"\")","v":""},null,null,null,null,null,{"$f":"IF(AND(W>0,H>0),(IF(ISERROR(VLOOKUP(5,Data!$A:$D,4,FALSE)),\"\",VLOOKUP(5,Data!$A:$D,4,FALSE))),\"\")","v":""},null,{"$f":"IF(BTYPE=\"Custom\",\"CMR:\",\"\")","v":""},null,null,null,{"$f":"IF(AND(W>0,H>0,BTYPE=\"Custom\",CMR=0),\"<< Enter CMR Location\",\"\")","v":""}]
[null,{"$f":"IF(AND(W>0,H>0),(IF(ISERROR(VLOOKUP(6,Data!$A:$D,3,FALSE)),\"\",VLOOKUP(6,Data!$A:$D,3,FALSE))),\"\")","v":""},null,null,null,null,null,{"$f":"IF(AND(W>0,H>0),(IF(ISERROR(VLOOKUP(6,Data!$A:$D,4,FALSE)),\"\",VLOOKUP(6,Data!$A:$D,4,FALSE))),\"\")","v":""},null,{"$f":"IF(SELECTEXT=\"Select Extrusion\",\"Ext.\",IF(SELECTEXT=\"Select Reinforcement\",\"Reinforce\",IF(SELECTEXT=\"Standard\",\"HP >>\",\"\")))","v":""},null,null,null,{"$f":"EXT_MESSAGE","v":""}]
[null,{"$f":"IF(AND(W>0,H>0),(IF(ISERROR(VLOOKUP(7,Data!$A:$D,3,FALSE)),\"\",VLOOKUP(7,Data!$A:$D,3,FALSE))),\"\")","v":""},null,null,null,null,null,{"$f":"IF(AND(W>0,H>0),(IF(ISERROR(VLOOKUP(7,Data!$A:$D,4,FALSE)),\"\",VLOOKUP(7,Data!$A:$D,4,FALSE))),\"\")","v":""},null,"Opening:",null,null,null,{"$f":"RO_OPTION","v":0}]
[null,{"$f":"IF(AND(W>0,H>0),(IF(ISERROR(VLOOKUP(8,Data!$A:$D,3,FALSE)),\"\",VLOOKUP(8,Data!$A:$D,3,FALSE))),\"\")","v":""},null,null,null,null,null,{"$f":"IF(AND(W>0,H>0),(IF(ISERROR(VLOOKUP(8,Data!$A:$D,4,FALSE)),\"\",VLOOKUP(8,Data!$A:$D,4,FALSE))),\"\")","v":""},null,"Type:"]
[null,{"$f":"IF(AND(W>0,H>0),(IF(ISERROR(VLOOKUP(9,Data!$A:$D,3,FALSE)),\"\",VLOOKUP(9,Data!$A:$D,3,FALSE))),\"\")","v":""},null,null,null,null,null,{"$f":"IF(AND(W>0,H>0),(IF(ISERROR(VLOOKUP(9,Data!$A:$D,4,FALSE)),\"\",VLOOKUP(9,Data!$A:$D,4,FALSE))),\"\")","v":""},null,"Screen:"]
[null,{"$f":"IF(AND(W>0,H>0),(IF(ISERROR(VLOOKUP(10,Data!$A:$D,3,FALSE)),\"\",VLOOKUP(10,Data!$A:$D,3,FALSE))),\"\")","v":""},null,null,null,null,null,{"$f":"IF(AND(W>0,H>0),(IF(ISERROR(VLOOKUP(10,Data!$A:$D,4,FALSE)),\"\",VLOOKUP(10,Data!$A:$D,4,FALSE))),\"\")","v":""},null,"Glass:",null,null,null,null,{"$f":"IF(AND(EXTTYPE=\"HP Package\",GT=\"S\"),\"<< Must Select DS\",\"\")","v":""}]
[]
[null,{"$f":"IF(AND(W>0,H>0),(IF(ISERROR(VLOOKUP(11,Data!$A:$D,3,FALSE)),\"\",VLOOKUP(11,Data!$A:$D,3,FALSE))),\"\")","v":""},null,null,null,null,null,{"$f":"IF(AND(W>0,H>0),(IF(ISERROR(VLOOKUP(11,Data!$A:$D,4,FALSE)),\"\",VLOOKUP(11,Data!$A:$D,4,FALSE))),\"\")","v":""}]
[null,{"$f":"IF(AND(W>0,H>0),(IF(ISERROR(VLOOKUP(12,Data!$A:$D,3,FALSE)),\"\",VLOOKUP(12,Data!$A:$D,3,FALSE))),\"\")","v":""},null,null,null,null,null,{"$f":"IF(AND(W>0,H>0),(IF(ISERROR(VLOOKUP(12,Data!$A:$D,4,FALSE)),\"\",VLOOKUP(12,Data!$A:$D,4,FALSE))),\"\")","v":""}]
[null,{"$f":"IF(AND(W>0,H>0),(IF(ISERROR(VLOOKUP(13,Data!$A:$D,3,FALSE)),\"\",VLOOKUP(13,Data!$A:$D,3,FALSE))),\"\")","v":""},null,null,null,null,null,{"$f":"IF(AND(W>0,H>0),(IF(ISERROR(VLOOKUP(13,Data!$A:$D,4,FALSE)),\"\",VLOOKUP(13,Data!$A:$D,4,FALSE))),\"\")","v":""},null,null,null,null,null,"A Designated AC Sash is Used to Replace BOTH Top and Bottom Sashes When AC is in the Window"]
[null,{"$f":"IF(AND(W>0,H>0),(IF(ISERROR(VLOOKUP(14,Data!$A:$D,3,FALSE)),\"\",VLOOKUP(14,Data!$A:$D,3,FALSE))),\"\")","v":""},null,null,null,null,null,{"$f":"IF(AND(W>0,H>0),(IF(ISERROR(VLOOKUP(14,Data!$A:$D,4,FALSE)),\"\",VLOOKUP(14,Data!$A:$D,4,FALSE))),\"\")","v":""}]
[null,{"$f":"IF(AND(W>0,H>0),(IF(ISERROR(VLOOKUP(15,Data!$A:$D,3,FALSE)),\"\",VLOOKUP(15,Data!$A:$D,3,FALSE))),\"\")","v":""},null,null,null,null,null,{"$f":"IF(AND(W>0,H>0),(IF(ISERROR(VLOOKUP(15,Data!$A:$D,4,FALSE)),\"\",VLOOKUP(15,Data!$A:$D,4,FALSE))),\"\")","v":""},null,"AC Width:"]
[null,{"$f":"IF(AND(W>0,H>0),(IF(ISERROR(VLOOKUP(16,Data!$A:$D,3,FALSE)),\"\",VLOOKUP(16,Data!$A:$D,3,FALSE))),\"\")","v":""},null,null,null,null,null,{"$f":"IF(AND(W>0,H>0),(IF(ISERROR(VLOOKUP(16,Data!$A:$D,4,FALSE)),\"\",VLOOKUP(16,Data!$A:$D,4,FALSE))),\"\")","v":""},null,"AC Height:",null,null,null,{"$f":"IF(AND(W>0,H>0,ACWIDTH>0,ACHEIGHT>0,ACCMR>0,ACLINK=TRUE),ACCMR,IF(AND(W>0,H>0,ACWIDTH>0,ACSASHW>0,ACLINK=TRUE),ACSASHW,\"\"))","v":""},{"$f":"IF(AND(W>0,H>0,ACWIDTH>0,ACHEIGHT>0,ACCMR>0,ACLINK=TRUE),\"<< CMR\",IF(AND(W>0,H>0,ACWIDTH>0,ACSASHW>0,ACLINK=TRUE),\"<< AC Sash Width\",\"\"))","v":""}]
[null,{"$f":"IF(AND(W>0,H>0),(IF(ISERROR(VLOOKUP(17,Data!$A:$D,3,FALSE)),\"\",VLOOKUP(17,Data!$A:$D,3,FALSE))),\"\")","v":""},null,null,null,null,null,{"$f":"IF(AND(W>0,H>0),(IF(ISERROR(VLOOKUP(17,Data!$A:$D,4,FALSE)),\"\",VLOOKUP(17,Data!$A:$D,4,FALSE))),\"\")","v":""},null,{"$f":"IF(ISERROR(TSH),\"\",IF(LIMIT1>\"\",LIMIT1&IF(LIMIT2>\"\",\" & \"&LIMIT2,\"\"),\"\"))","v":""},null,null,null,{"$f":"IF(AND(W>0,H>0,ACHEIGHT>0,ACSASHH>0,ACLINK=TRUE),ACSASHH,\"\")","v":""},{"$f":"IF(AND(ACCMR>0,ACLINK=TRUE),\"\",IF(AND(W>0,H>0,ACHEIGHT>0,ACSASHH>0,ACLINK=TRUE),\"<< AC Sash Height\",\"\"))","v":""}]
[null,{"$f":"IF(AND(W>0,H>0),(IF(ISERROR(VLOOKUP(18,Data!$A:$D,3,FALSE)),\"\",VLOOKUP(18,Data!$A:$D,3,FALSE))),\"\")","v":""},null,null,null,null,null,{"$f":"IF(AND(W>0,H>0),(IF(ISERROR(VLOOKUP(18,Data!$A:$D,4,FALSE)),\"\",VLOOKUP(18,Data!$A:$D,4,FALSE))),\"\")","v":""},null,null,null,{"$f":"IF(AND(W>0,H>0,ACWIDTH>ACSASHW,ACLINK=TRUE),\"AC Width is Larger Than The Sash Width\",\"\")","v":""}]
[null,{"$f":"IF(AND(W>0,H>0),(IF(ISERROR(VLOOKUP(19,Data!$A:$D,3,FALSE)),\"\",VLOOKUP(19,Data!$A:$D,3,FALSE))),\"\")","v":""},null,null,null,null,null,{"$f":"IF(AND(W>0,H>0),(IF(ISERROR(VLOOKUP(19,Data!$A:$D,4,FALSE)),\"\",VLOOKUP(19,Data!$A:$D,4,FALSE))),\"\")","v":""}]

{"sheet":"Balance","index":1,"n_rows":199,"n_cols":80,"rows_kept":199,"cut":false,"hidden":true,"merged":[[21,50,21,52],[0,41,0,45],[1,39,1,42],[1,44,1,47],[1,5,1,7],[1,1,1,3],[1,14,1,21],[1,24,1,25],[0,55,0,63],[1,55,1,58],[1,60,1,63]]}
[null,null,null,null,null,null,null,null,null,null,null,null,null,null,null,null,null,null,null,null,null,null,null,null,null,null,null,null,null,null,null,null,null,null,null,null,null,null,null,null,null,"BLOCK & TACKLE BALANCE CHART",null,null,null,null,null,null,null,null,null,null,null,null,null,"V-Series BLOCK & TACKLE BALANCE CHART"]
[null,"CFB",null,null,null,"Curve CFB",null,null,null,null,null,null,"Glass Strength",null,"Weight Calculation",null,null,null,null,null,null,null,null,null,"Egress Calculation",null,null,null,"* = Deduct 2.25 from 36 x 60 (RO) Frame to adjust for Egress",null,null,null,null,null,null,null,null,null,null,"TOP SASH",null,null,null,null,"BOTTOM SASH",null,null,null,null,null,null,null,null,null,null,"TOP SASH",null,null,null,null,"BOTTOM SASH"]
[null,4,3,"BN",null,4,3,"RD",null,1,{"$f":"IF(M3>\"\",VLOOKUP(M3,GLASSLOOKUP,2,FALSE),\"\")","v":""},{"$f":"IF(M3>\"\",VLOOKUP(K3,WEIGHTCHART,2,FALSE),\"\")","v":""},{"$f":"GLASS1","v":""},null,"Model","CDIM","Bott. Sash Height","Bottom Sash Weight","Top Sash Weight","Bal. Loc.","Head + Sill","Sill","EW",null,"# of Coils",{"$f":"IF(OR(ModelNo=\"3100\",ModelNo=\"i201\"),VLOOKUP(BTM_WGT,CURVE_W,3,FALSE),VLOOKUP(BTM_WGT,CFB_W,3,FALSE))","v":{"$error":"#N/A"}},null,null,"0100, 0700, 01HP, 07HP","Length","Weight/ft","Weight",null,"0901","Length","Weight/ft","Weight",null,null,"Sash Weight","Tube Length","Balance","Weight",null,"Sash Weight","Tube Length","Balance","Weight",null,null,null,null,null,null,null,"Sash Weight","Tube Length","Balance","Weight",null,"Sash Weight","Tube Length","Balance","Weight",null,null,null,null,null,"Caldwell Balance Chart"]
[null,{"$f":"B3+1","v":5},3,"BN",null,5,3,"RD",null,2,"","",{"$f":"GLASS2","v":""},null,{"$f":"ModelNo","v":"Select Model"},{"$f":"VLOOKUP(ModelNo,WEIGHTCALC,2,FALSE)","v":{"$error":"#N/A"}},{"$f":"VLOOKUP(ModelNo,WEIGHTCALC,3,FALSE)","v":{"$error":"#N/A"}},{"$f":"TRUNC(VLOOKUP(ModelNo,WEIGHTCALC,4,FALSE)+GRID)","v":{"$error":"#N/A"}},{"$f":"TRUNC(VLOOKUP(ModelNo,WEIGHTCALC,5,FALSE)+GRID)","v":{"$error":"#N/A"}},{"$f":"VLOOKUP(ModelNo,WEIGHTCALC,6,FALSE)","v":{"$error":"#N/A"}},{"$f":"VLOOKUP(ModelNo,WEIGHTCALC,7,FALSE)","v":{"$error":"#N/A"}},{"$f":"VLOOKUP(ModelNo,WEIGHTCALC,8,FALSE)","v":{"$error":"#N/A"}},{"$f":"VLOOKUP(ModelNo,WEIGHTCALC,9,FALSE)","v":{"$error":"#N/A"}},null,"Displacement",{"$f":"IF($Q$4>45,$Q$4-44,0)","v":{"$error":"#N/A"}},null,null,"Top Top Rail",0,0,{"$f":"AD4*AE4","v":0},null,"Top Top Rail",{"$f":"(Frame_Width-3.4375)/12","v":-0.28645833333333331},0.35199999999999998,{"$f":"AI4*AJ4","v":-0.10083333333333332},null,null,{"$f":"TRUNC(TOP_WGT)","v":{"$error":"#N/A"}},{"$f":"R59","v":{"$error":"#N/A"}},"Number","Range",null,{"$f":"TRUNC(BTM_WGT)","v":{"$error":"#N/A"}},{"$f":"Q59","v":{"$error":"#N/A"}},"Number","Range",null,null,null,null,null,null,null,{"$f":"TRUNC(TOP_WGT)","v":{"$error":"#N/A"}},{"$f":"TOPTUBELENGTH","v":{"$error":"#N/A"}},"Number","Range",null,{"$f":"TRUNC(BTM_WGT)","v":{"$error":"#N/A"}},{"$f":"BOTTUBELENGTH","v":{"$error":"#N/A"}},"Number","Range",null,null,null,null,null,{"$f":"IF(OR(ModelNo=\"1700\",ModelNo=\"1720\",ModelNo=\"1730\"),1,IF(OR(ModelNo=\"1900\",ModelNo=\"1920\",ModelNo=\"1930\"),2,3))","v":3},{"$f":"IF(OR(ModelNo=\"1700\",ModelNo=\"1720\",ModelNo=\"1730\"),4,IF(OR(ModelNo=\"1900\",ModelNo=\"1920\",ModelNo=\"1930\"),5,6))","v":6},"Bott.","Top",null,1,4,2,5,3,6]
[null,6,3,"BN",null,6,3,"RD",null,3,"","",{"$f":"GLASS3","v":""},null,"0100",{"$f":"CMR!$E$11","v":0},{"$f":"CMR!$E$11+0.125","v":0.125},{"$f":"$AF$23","v":0},{"$f":"$AF$22","v":0},1.03125,3.0739999999999998,1.5369999999999999,3.0625,null,"Coil Loc. From CMR",{"$f":"$Z$4+$T$4+1.75","v":{"$error":"#N/A"}},null,null,"Top Bottom Rail",0,0,{"$f":"AD5*AE5","v":0},null,"Top Bottom Rail",{"$f":"(Frame_Width-3.4375)/12","v":-0.28645833333333331},0.34399999999999997,-9.8541666666666652E-2,null,null,"Balance Size",{"$f":"IF(AND(AP5>0,AQ5>0),AP5,0)","v":{"$error":"#N/A"}},{"$f":"IF($AO$4<=6,6,0)","v":{"$error":"#N/A"}},{"$f":"IF(AND(AP5=6,$AN$4>=2,$AN$4<=5),AP5&\"A\",0)","v":{"$error":"#N/A"}},null,"Balance Size",{"$f":"IF(AND(AU5>0,AV5>0),AU5,0)","v":{"$error":"#N/A"}},{"$f":"IF($AT$4<=6,6,0)","v":{"$error":"#N/A"}},{"$f":"IF(AND(AU5=6,$AS$4>=2,$AS$4<=5),AU5&\"A\",0)","v":{"$error":"#N/A"}},null,null,null,null,null,null,null,"Balance Size",{"$f":"IF(AND(BF5>0,BG5>0),BF5,0)","v":{"$error":"#N/A"}},{"$f":"IF($BE$4<=8,8,0)","v":{"$error":"#N/A"}},{"$f":"IF(AND(BF5=8,$BD$4>=2,$BD$4<=6),BF5&\"A\",0)","v":{"$error":"#N/A"}},null,"Balance Size",{"$f":"IF(AND(BK5>0,BL5>0),BK5,0)","v":{"$error":"#N/A"}},{"$f":"IF($BJ$4<=8,8,0)","v":{"$error":"#N/A"}},{"$f":"IF(AND(BK5=8,$BI$4>=2,$BI$4<=6),BK5&\"A\",0)","v":{"$error":"#N/A"}},null,null,null,null,null,{"$f":"HLOOKUP($BR$4,CALDWELL_LOOKUP,2,FALSE)","v":9},{"$f":"HLOOKUP($BS$4,CALDWELL_LOOKUP,2,FALSE)","v":9.9994999999999994},8,7,null,9.7665000000000006,10.766,9.2185000000000006,10.218,9,9.9994999999999994]
[null,7,4,"RD",null,7,4,"GR",null,4,"","",{"$f":"GLASS4","v":""},null,"01HP",{"$f":"CMR!$L$11","v":0},{"$f":"CMR!$L$11+0.125","v":0.125},{"$f":"$AF$23","v":0},{"$f":"$AF$22","v":0},1.03125,3.1680000000000001,1.631,3.0625,null,"Sash H < 37.5",{"$f":"IF(OR(ModelNo=\"S140\",ModelNo=\"S144\",ModelNo=\"S146\",ModelNo=\"S140 (HP)\",ModelNo=\"S144 (HP)\",ModelNo=\"S146 (HP)\"),TRUNC((LEG-$Q$4-$U$4)*16+0.5)/16,TRUNC((Frame_Height-$Q$4-$U$4)*16+0.5)/16)","v":{"$error":"#N/A"}},null,null,"Top Stile",0,0,{"$f":"(AD6*AE6)/12","v":0},null,"Top Stile",{"$f":"(2*(CMR!$E$58-0.8125))/12","v":-0.13541666666666666},0.218,-2.9520833333333333E-2,null,null,{"$f":"VLOOKUP((MAX(AO5:AO168)),AO5:AQ168,3,FALSE)","v":{"$error":"#N/A"}},{"$f":"IF(AND(AP6>0,AQ6>0),AP6,0)","v":{"$error":"#N/A"}},{"$f":"IF($AO$4<=6,6,0)","v":{"$error":"#N/A"}},{"$f":"IF(AND(AP6=6,$AN$4>=6,$AN$4<=9),AP6&\"B\",0)","v":{"$error":"#N/A"}},null,{"$f":"VLOOKUP((MAX(AT5:AT168)),AT5:AV168,3,FALSE)","v":{"$error":"#N/A"}},{"$f":"IF(AND(AU6>0,AV6>0),AU6,0)","v":{"$error":"#N/A"}},{"$f":"IF($AT$4<=6,6,0)","v":{"$error":"#N/A"}},{"$f":"IF(AND(AU6=6,$AS$4>=6,$AS$4<=9),AU6&\"B\",0)","v":{"$error":"#N/A"}},null,null,null,null,null,null,null,{"$f":"VLOOKUP((MAX(BE5:BE229)),BE5:BG229,3,FALSE)","v":{"$error":"#N/A"}},{"$error":"#N/A"},{"$f":"IF($BE$4<=8,8,0)","v":{"$error":"#N/A"}},{"$f":"IF(AND(BF6=8,$BD$4>=7,$BD$4<=10),BF6&\"B\",0)","v":{"$error":"#N/A"}},null,{"$f":"VLOOKUP((MAX(BJ5:BJ149)),BJ5:BL149,3,FALSE)","v":{"$error":"#N/A"}},{"$error":"#N/A"},{"$f":"IF($BJ$4<=8,8,0)","v":{"$error":"#N/A"}},{"$f":"IF(AND(BK6=8,$BI$4>=7,$BI$4<=10),BK6&\"B\",0)","v":{"$error":"#N/A"}},null,null,null,null,null,{"$f":"HLOOKUP($BR$4,CALDWELL_LOOKUP,3,FALSE)","v":10},{"$f":"HLOOKUP($BS$4,CALDWELL_LOOKUP,3,FALSE)","v":10.999499999999999},9,8,null,10.766500000000001,11.766,10.218500000000001,11.218,10,10.999499999999999]
[null,8,4,"RD",null,8,4,"GR",null,5,"","",{"$f":"GLASS5","v":""},null,"0201",{"$f":"CMR!$E$27","v":0},{"$f":"CMR!$E$27-0.5625","v":-0.5625},{"$f":"$AF$45","v":0},{"$f":"$AF$44","v":0},1.3125,7.4375,1.75,4.4059999999999997,null,"Egress Height",{"$f":"IF(TYPE=1,TRUNC((Frame_Height-$P$4-$U$4)*16+0.5)/16,IF(CMR>(Frame_Height/2),TRUNC((Frame_Height-CMR-$U$4)*16+0.5)/16,IF(CMR<(Frame_Height/2),TRUNC((Frame_Height-$Q$4-$V$4)*16+0.5)/16)))","v":{"$error":"#N/A"}},null,null,"Top Rail Reinf.",0,0,0,null,"Top Rail Reinf.",{"$f":"(FLOOR(Frame_Width-13,2))/12","v":-1.1666666666666667},0.14599999999999999,-0.17033333333333334,null,null,null,{"$error":"#N/A"},{"$f":"IF($AO$4<=6,6,0)","v":{"$error":"#N/A"}},{"$f":"IF(AND(AP7=6,$AN$4>=10,$AN$4<=12),AP7&\"C\",0)","v":{"$error":"#N/A"}},null,null,{"$error":"#N/A"},{"$f":"IF($AT$4<=6,6,0)","v":{"$error":"#N/A"}},{"$f":"IF(AND(AU7=6,$AS$4>=10,$AS$4<=12),AU7&\"C\",0)","v":{"$error":"#N/A"}},null,null,null,null,null,null,null,null,{"$error":"#N/A"},{"$f":"IF($BE$4<=8,8,0)","v":{"$error":"#N/A"}},{"$f":"IF(AND(BF7=8,$BD$4>=11,$BD$4<=13),BF7&\"C\",0)","v":{"$error":"#N/A"}},null,null,{"$error":"#N/A"},{"$f":"IF($BJ$4<=8,8,0)","v":{"$error":"#N/A"}},{"$f":"IF(AND(BK7=8,$BI$4>=11,$BI$4<=13),BK7&\"C\",0)","v":{"$error":"#N/A"}},null,null,null,null,null,{"$f":"HLOOKUP($BR$4,CALDWELL_LOOKUP,4,FALSE)","v":11},{"$f":"HLOOKUP($BS$4,CALDWELL_LOOKUP,4,FALSE)","v":12.999499999999999},10,9,null,11.766500000000001,13.766,11.218500000000001,13.218,11,12.999499999999999]
[null,9,5,"BU",null,9,5,"BR",null,6,"","",{"$f":"GLASS6","v":""},null,"L201",{"$f":"CMR!$E$27","v":0},{"$f":"CMR!$E$27-0.5625","v":-0.5625},{"$f":"$AF$45","v":0},{"$f":"$AF$44","v":0},1.3125,4.0625,5.0625,4.4059999999999997,null,"Egress Width",{"$f":"Frame_Width-W4","v":{"$error":"#N/A"}},null,null,"Top Stile Reinf",0,0,0,null,"Top Stile Reinf",null,0.14599999999999999,0,null,null,null,{"$error":"#N/A"},{"$f":"IF($AO$4<=6,6,0)","v":{"$error":"#N/A"}},{"$f":"IF(AND(AP8=6,$AN$4>=13,$AN$4<=15),AP8&\"D\",0)","v":{"$error":"#N/A"}},null,null,{"$error":"#N/A"},{"$f":"IF($AT$4<=6,6,0)","v":{"$error":"#N/A"}},{"$f":"IF(AND(AU8=6,$AS$4>=13,$AS$4<=15),AU8&\"D\",0)","v":{"$error":"#N/A"}},null,null,null,null,null,null,null,null,{"$error":"#N/A"},{"$f":"IF(AND($BE$4<=10,$BE$4>8),10,0)","v":{"$error":"#N/A"}},{"$f":"IF(AND(BF8=10,$BD$4>=2,$BD$4<=6),BF8&\"A\",0)","v":{"$error":"#N/A"}},null,null,{"$error":"#N/A"},{"$f":"IF(AND($BJ$4<=10,$BJ$4>8),10,0)","v":{"$error":"#N/A"}},{"$f":"IF(AND(BK8=10,$BI$4>=2,$BI$4<=6),BK8&\"A\",0)","v":{"$error":"#N/A"}},null,null,null,null,null,{"$f":"HLOOKUP($BR$4,CALDWELL_LOOKUP,5,FALSE)","v":13},{"$f":"HLOOKUP($BS$4,CALDWELL_LOOKUP,5,FALSE)","v":14.999499999999999},12,10,null,13.766500000000002,15.766000000000002,13.218500000000002,15.218000000000002,13,14.999499999999999]
[null,10,5,"BU",null,10,5,"BR",null,7,"","",{"$f":"GLASS7","v":""},null,"02A0",{"$f":"CMR!$L$27","v":0},{"$f":"CMR!$L$27-0.75","v":-0.75},{"$f":"$AF$67","v":0},{"$f":"$AF$66","v":0},1.3125,7.4375,1.75,4.5,null,"Egress Area",{"$f":"IF(E301EH>0,ROUND(((E301EH*EW)/144),3),ROUND(((EH*EW)/144),3))","v":{"$error":"#N/A"}},null,null,"Top Glass",0,0,0,null,"Top Glass",{"$f":"(CMR!$E$61*CMR!$E$63)/144","v":0.10026041666666667},{"$f":"$L$12","v":""},{"$error":"#VALUE!"},null,null,null,{"$error":"#N/A"},{"$f":"IF($AO$4<=6,6,0)","v":{"$error":"#N/A"}},{"$f":"IF(AND(AP9=6,$AN$4>=16,$AN$4<=20),AP9&\"E\",0)","v":{"$error":"#N/A"}},null,null,{"$error":"#N/A"},{"$f":"IF($AT$4<=6,6,0)","v":{"$error":"#N/A"}},{"$f":"IF(AND(AU9=6,$AS$4>=16,$AS$4<=20),AU9&\"E\",0)","v":{"$error":"#N/A"}},null,null,null,null,null,null,null,null,{"$error":"#N/A"},{"$f":"IF(AND($BE$4<=10,$BE$4>8),10,0)","v":{"$error":"#N/A"}},{"$f":"IF(AND(BF9=10,$BD$4>=7,$BD$4<=10),BF9&\"B\",0)","v":{"$error":"#N/A"}},null,null,{"$error":"#N/A"},{"$f":"IF(AND($BJ$4<=10,$BJ$4>8),10,0)","v":{"$error":"#N/A"}},{"$f":"IF(AND(BK9=10,$BI$4>=7,$BI$4<=10),BK9&\"B\",0)","v":{"$error":"#N/A"}},null,null,null,null,null,{"$f":"HLOOKUP($BR$4,CALDWELL_LOOKUP,6,FALSE)","v":15.000000000000002},{"$f":"HLOOKUP($BS$4,CALDWELL_LOOKUP,6,FALSE)","v":16.999500000000001},14,12,null,15.766500000000001,17.766000000000002,15.218500000000001,17.218,15.000000000000002,16.999500000000001]
[null,11,6,"YW",null,11,6,"OR",null,8,"","",{"$f":"GLASS8","v":""},null,"0301",{"$f":"CMR!$E$43","v":0},{"$f":"CMR!$E$43-0.625","v":-0.625},{"$f":"$AF$89","v":0},{"$f":"$AF$88","v":0},1.3125,7.6181200000000002,2.0590600000000001,4.375,null,null,null,null,null,"Top Spacer",0,0,0,null,"Top Spacer",{"$f":"((CMR!$E$61*2)+(CMR!$E$63*2))/12","v":-1.3020833333333333},5.3600000000000002E-2,-6.9791666666666669E-2,null,null,null,{"$error":"#N/A"},{"$f":"IF(AND($AO$4<=8,$AO$4>6),8,0)","v":{"$error":"#N/A"}},{"$f":"IF(AND(AP10=8,$AN$4>=16,$AN$4<=20),AP10&\"A\",0)","v":{"$error":"#N/A"}},null,null,{"$error":"#N/A"},{"$f":"IF(AND($AT$4<=8,$AT$4>6),8,0)","v":{"$error":"#N/A"}},{"$f":"IF(AND(AU10=8,$AS$4>=16,$AS$4<=20),AU10&\"A\",0)","v":{"$error":"#N/A"}},null,null,null,null,null,null,null,null,{"$error":"#N/A"},{"$f":"IF(AND($BE$4<=10,$BE$4>8),10,0)","v":{"$error":"#N/A"}},{"$f":"IF(AND(BF10=10,$BD$4>=11,$BD$4<=13),BF10&\"C\",0)","v":{"$error":"#N/A"}},null,null,{"$error":"#N/A"},{"$f":"IF(AND($BJ$4<=10,$BJ$4>8),10,0)","v":{"$error":"#N/A"}},{"$f":"IF(AND(BK10=10,$BI$4>=11,$BI$4<=13),BK10&\"C\",0)","v":{"$error":"#N/A"}},null,null,null,null,null,{"$f":"HLOOKUP($BR$4,CALDWELL_LOOKUP,7,FALSE)","v":17},{"$f":"HLOOKUP($BS$4,CALDWELL_LOOKUP,7,FALSE)","v":18.999500000000001},16,14,null,17.766500000000001,19.766000000000002,17.218499999999999,19.218,17,18.999500000000001]
[null,12,6,"YW",null,12,6,"OR",null,null,null,null,1,null,"E301(3250)",{"$f":"CMR!$E$43","v":0},{"$f":"CMR!$E$43-0.625","v":-0.625},{"$f":"$AF$89","v":0},{"$f":"$AF$88","v":0},null,null,null,4.375,null,"E301(3250)",25.1875,null,null,"Top Hardware",0,0,0,null,"Top Hardware",1,0.24,0.24,null,null,null,{"$error":"#N/A"},{"$f":"IF(AND($AO$4<=8,$AO$4>6),8,0)","v":{"$error":"#N/A"}},{"$f":"IF(AND(AP11=8,$AN$4>=16,$AN$4<=20),AP11&\"B\",0)","v":{"$error":"#N/A"}},null,null,{"$error":"#N/A"},{"$f":"IF(AND($AT$4<=8,$AT$4>6),8,0)","v":{"$error":"#N/A"}},{"$f":"IF(AND(AU11=8,$AS$4>=16,$AS$4<=20),AU11&\"B\",0)","v":{"$error":"#N/A"}},null,null,null,null,null,null,null,null,{"$error":"#N/A"},{"$f":"IF(AND($BE$4<=10,$BE$4>8),10,0)","v":{"$error":"#N/A"}},{"$f":"IF(AND(BF11=10,$BD$4>=14,$BD$4<=16),BF11&\"D\",0)","v":{"$error":"#N/A"}},null,null,{"$error":"#N/A"},{"$f":"IF(AND($BJ$4<=10,$BJ$4>8),10,0)","v":{"$error":"#N/A"}},{"$f":"IF(AND(BK11=10,$BI$4>=14,$BI$4<=16),BK11&\"D\",0)","v":{"$error":"#N/A"}},null,null,null,null,null,{"$f":"HLOOKUP($BR$4,CALDWELL_LOOKUP,8,FALSE)","v":19},{"$f":"HLOOKUP($BS$4,CALDWELL_LOOKUP,8,FALSE)","v":20.999500000000001},18,16,null,19.766500000000001,21.766000000000002,19.218499999999999,21.218,19,20.999500000000001]
[null,13,7,"GN",null,13,7,"BU",null,null,null,{"$f":"VLOOKUP(GT,K3:L10,2,FALSE)","v":""},{"$f":"VLOOKUP(Glass,J3:L10,2,FALSE)","v":""},null,"E301(3052)",{"$f":"CMR!$E$43","v":0},{"$f":"CMR!$E$43-0.625","v":-0.625},{"$f":"$AF$89","v":0},{"$f":"$AF$88","v":0},null,null,null,4.375,null,"E301(3052)",26.375,null,null,"Top Bead",0,0,0,null,"Top Handle Bead",{"$f":"(Frame_Width-5.9375)/12","v":-0.49479166666666669},7.8E-2,-3.8593750000000003E-2,null,null,null,{"$error":"#N/A"},{"$f":"IF(AND($AO$4<=8,$AO$4>6),8,0)","v":{"$error":"#N/A"}},{"$f":"IF(AND(AP12=8,$AN$4>=16,$AN$4<=20),AP12&\"C\",0)","v":{"$error":"#N/A"}},null,null,{"$error":"#N/A"},{"$f":"IF(AND($AT$4<=8,$AT$4>6),8,0)","v":{"$error":"#N/A"}},{"$f":"IF(AND(AU12=8,$AS$4>=16,$AS$4<=20),AU12&\"C\",0)","v":{"$error":"#N/A"}},null,null,null,null,null,null,null,null,{"$error":"#N/A"},{"$f":"IF(AND($BE$4<=12,$BE$4>10),12,0)","v":{"$error":"#N/A"}},{"$f":"IF(AND(BF12=12,$BD$4>=3,$BD$4<=7),BF12&\"A\",0)","v":{"$error":"#N/A"}},null,null,{"$error":"#N/A"},{"$f":"IF(AND($BJ$4<=12,$BJ$4>10),12,0)","v":{"$error":"#N/A"}},{"$f":"IF(AND(BK12=12,$BI$4>=3,$BI$4<=7),BK12&\"A\",0)","v":{"$error":"#N/A"}},null,null,null,null,null,{"$f":"HLOOKUP($BR$4,CALDWELL_LOOKUP,9,FALSE)","v":21},{"$f":"HLOOKUP($BS$4,CALDWELL_LOOKUP,9,FALSE)","v":22.999500000000001},20,18,null,21.766500000000001,23.766000000000002,21.218499999999999,23.218,21,22.999500000000001]
[null,14,7,"GN",null,14,7,"BU",null,null,null,null,null,null,"E301(2862)",{"$f":"CMR!$E$43","v":0},{"$f":"CMR!$E$43-0.625","v":-0.625},{"$f":"$AF$89","v":0},{"$f":"$AF$88","v":0},null,null,null,4.375,null,"E301(2862)",32.3125,null,null,"Bottom Top Rail",{"$f":"(Frame_Width-2.3125)/12","v":-0.19270833333333334},0.24099999999999999,{"$f":"AD13*AE13","v":-4.6442708333333332E-2},null,"Top Bead",{"$f":"((Frame_Width-5.9375)+((CMR!$E$58-3.0625)*2))/12","v":-1.0052083333333333},7.8E-2,-7.8406249999999997E-2,null,null,null,{"$error":"#N/A"},{"$f":"IF(AND($AO$4<=8,$AO$4>6),8,0)","v":{"$error":"#N/A"}},{"$f":"IF(AND(AP13=8,$AN$4>=16,$AN$4<=20),AP13&\"D\",0)","v":{"$error":"#N/A"}},null,null,{"$error":"#N/A"},{"$f":"IF(AND($AT$4<=8,$AT$4>6),8,0)","v":{"$error":"#N/A"}},{"$f":"IF(AND(AU13=8,$AS$4>=16,$AS$4<=20),AU13&\"D\",0)","v":{"$error":"#N/A"}},null,null,null,null,null,null,null,null,{"$error":"#N/A"},{"$f":"IF(AND($BE$4<=12,$BE$4>10),12,0)","v":{"$error":"#N/A"}},{"$f":"IF(AND(BF13=12,$BD$4>=8,$BD$4<=10),BF13&\"B\",0)","v":{"$error":"#N/A"}},null,null,{"$error":"#N/A"},{"$f":"IF(AND($BJ$4<=12,$BJ$4>10),12,0)","v":{"$error":"#N/A"}},{"$f":"IF(AND(BK13=12,$BI$4>=8,$BI$4<=10),BK13&\"B\",0)","v":{"$error":"#N/A"}},null,null,null,null,null,{"$f":"HLOOKUP($BR$4,CALDWELL_LOOKUP,10,FALSE)","v":23},{"$f":"HLOOKUP($BS$4,CALDWELL_LOOKUP,10,FALSE)","v":24.999500000000001},22,20,null,23.766500000000001,25.766000000000002,23.218499999999999,25.218,23,24.999500000000001]
[null,15,8,"LG",null,15,8,"BK",null,null,null,null,"Extrusion",null,"0501",{"$f":"CMR!$L$43","v":0},{"$f":"CMR!$L$43-1.3125","v":-1.3125},{"$f":"$AF$113","v":0},{"$f":"$AF$112","v":0},1.875,4.375,2.6890000000000001,5.375,null,null,{"$f":"IF(OR(ModelNo=\"E301(3250)\",ModelNo=\"E301(3052)\",ModelNo=\"E301(2862)\"),VLOOKUP(ModelNo,$Y$11:$Z$13,2,FALSE),0)","v":0},null,null,"Bottom Bottom Rail",{"$f":"(Frame_Width-2.3125)/12","v":-0.19270833333333334},0.25,-4.8177083333333336E-2,null,"Bottom Top Rail",{"$f":"(Frame_Width-3)/12","v":-0.25},0.42899999999999999,-0.10725,null,null,null,{"$error":"#N/A"},{"$f":"IF(AND($AO$4<=8,$AO$4>6),8,0)","v":{"$error":"#N/A"}},{"$f":"IF(AND(AP14=8,$AN$4>=16,$AN$4<=20),AP14&\"E\",0)","v":{"$error":"#N/A"}},null,null,{"$error":"#N/A"},{"$f":"IF(AND($AT$4<=8,$AT$4>6),8,0)","v":{"$error":"#N/A"}},{"$f":"IF(AND(AU14=8,$AS$4>=16,$AS$4<=20),AU14&\"E\",0)","v":{"$error":"#N/A"}},null,null,null,null,null,null,null,null,{"$error":"#N/A"},{"$f":"IF(AND($BE$4<=12,$BE$4>10),12,0)","v":{"$error":"#N/A"}},{"$f":"IF(AND(BF14=12,$BD$4>=11,$BD$4<=16),BF14&\"C\",0)","v":{"$error":"#N/A"}},null,null,{"$error":"#N/A"},{"$f":"IF(AND($BJ$4<=12,$BJ$4>10),12,0)","v":{"$error":"#N/A"}},{"$f":"IF(AND(BK14=12,$BI$4>=11,$BI$4<=16),BK14&\"C\",0)","v":{"$error":"#N/A"}},null,null,null,null,null,{"$f":"HLOOKUP($BR$4,CALDWELL_LOOKUP,11,FALSE)","v":25},{"$f":"HLOOKUP($BS$4,CALDWELL_LOOKUP,11,FALSE)","v":26.999500000000001},24,22,null,25.766500000000001,27.766000000000002,25.218499999999999,27.218,25,26.999500000000001]
[null,16,8,"LG",null,16,8,"BK",null,null,null,1,{"$f":"IF(EXT_1=0,\"\",EXT_1)","v":""},null,"B501",{"$f":"CMR!$L$43","v":0},{"$f":"CMR!$L$43-1.3125","v":-1.3125},{"$f":"$AF$113","v":0},{"$f":"$AF$112","v":0},1.875,4.375,2.6890000000000001,5.375,null,null,null,null,null,"Bottom Stile",{"$f":"((CMR!$E$11+0.125)*2)/12","v":2.0833333333333332E-2},0.23,4.7916666666666663E-3,null,"Bottom Bottom Rail",{"$f":"(Frame_Width-3)/12","v":-0.25},0.42899999999999999,-0.10725,null,null,null,{"$error":"#N/A"},{"$f":"IF(AND($AO$4<=10,$AO$4>8),10,0)","v":{"$error":"#N/A"}},{"$f":"IF(AND(AP15=10,$AN$4>=2,$AN$4<=6),AP15&\"A\",0)","v":{"$error":"#N/A"}},null,null,{"$error":"#N/A"},{"$f":"IF(AND($AT$4<=10,$AT$4>8),10,0)","v":{"$error":"#N/A"}},{"$f":"IF(AND(AU15=10,$AS$4>=2,$AS$4<=6),AU15&\"A\",0)","v":{"$error":"#N/A"}},null,null,null,null,null,null,null,null,{"$error":"#N/A"},{"$f":"IF(AND($BE$4<=12,$BE$4>10),12,0)","v":{"$error":"#N/A"}},{"$f":"IF(AND(BF15=12,$BD$4>=17,$BD$4<=18),BF15&\"D\",0)","v":{"$error":"#N/A"}},null,null,{"$error":"#N/A"},{"$f":"IF(AND($BJ$4<=12,$BJ$4>10),12,0)","v":{"$error":"#N/A"}},{"$f":"IF(AND(BK15=12,$BI$4>=17,$BI$4<=18),BK15&\"D\",0)","v":{"$error":"#N/A"}},null,null,null,null,null,{"$f":"HLOOKUP($BR$4,CALDWELL_LOOKUP,12,FALSE)","v":27},{"$f":"HLOOKUP($BS$4,CALDWELL_LOOKUP,12,FALSE)","v":28.999500000000001},26,24,null,27.766500000000001,29.766000000000002,27.218499999999999,29.218,27,28.999500000000001]
[null,17,9,"NAT",null,17,9,"NAT",null,null,null,2,{"$f":"IF(EXT_2=0,\"\",EXT_2)","v":""},12.5,"0700",{"$f":"CMR!$E$11","v":0},{"$f":"CMR!$E$11+0.125","v":0.125},{"$f":"$AF$23","v":0},{"$f":"$AF$22","v":0},1.03125,3.0739999999999998,1.5369999999999999,3.0625,null,"V100",{"$f":"Frame_Height-(V100_CDIM-0.844)-3.64625","v":-2.8022500000000004},null,null,"Bottom Rail Reinf.",{"$f":"(TRUNC(((AD13*12)-6)/2)*2)/12","v":-0.66666666666666663},0.32800000000000001,-0.21866666666666668,null,"Bottom Stile",{"$f":"(2*(CMR!$E$59-0.8125))/12","v":-0.13541666666666666},0.23300000000000001,-3.1552083333333335E-2,null,null,null,{"$error":"#N/A"},{"$f":"IF(AND($AO$4<=10,$AO$4>8),10,0)","v":{"$error":"#N/A"}},{"$f":"IF(AND(AP16=10,$AN$4>=7,$AN$4<=10),AP16&\"B\",0)","v":{"$error":"#N/A"}},null,null,{"$error":"#N/A"},{"$f":"IF(AND($AT$4<=10,$AT$4>8),10,0)","v":{"$error":"#N/A"}},{"$f":"IF(AND(AU16=10,$AS$4>=7,$AS$4<=10),AU16&\"B\",0)","v":{"$error":"#N/A"}},null,null,null,null,null,null,null,null,{"$error":"#N/A"},{"$f":"IF(AND($BE$4<=12,$BE$4>10),12,0)","v":{"$error":"#N/A"}},{"$f":"IF(AND(BF16=12,$BD$4>=19,$BD$4<=21),BF16&\"E\",0)","v":{"$error":"#N/A"}},null,null,{"$error":"#N/A"},{"$f":"IF(AND($BJ$4<=12,$BJ$4>10),12,0)","v":{"$error":"#N/A"}},{"$f":"IF(AND(BK16=12,$BI$4>=19,$BI$4<=21),BK16&\"E\",0)","v":{"$error":"#N/A"}},null,null,null,null,null,{"$f":"HLOOKUP($BR$4,CALDWELL_LOOKUP,13,FALSE)","v":29},{"$f":"HLOOKUP($BS$4,CALDWELL_LOOKUP,13,FALSE)","v":30.999500000000001},28,26,null,29.766499999999997,31.765999999999998,29.218499999999995,31.217999999999996,29,30.999500000000001]
[null,18,9,"NAT",null,18,9,"NAT",null,null,null,3,{"$f":"IF(EXT_3=0,\"\",EXT_3)","v":""},13,"07HP",{"$f":"CMR!$L$11","v":0},{"$f":"CMR!$L$11+0.125","v":0.125},{"$f":"$AF$23","v":0},{"$f":"$AF$22","v":0},1.03125,3.1680000000000001,1.631,3.0625,null,"V101",{"$f":"Frame_Height-(V101_CDIM-0.3125)-4.948","v":-4.6355000000000004},null,null,"Bottom Stile Reinf.",{"$f":"IF(OR(CMR!$E$16>=28.5,ModelNo=\"01HP\",ModelNo=\"07HP\",ModelNo=\"S140 (HP)\",ModelNo=\"S144 (HP)\",ModelNo=\"S146 (HP)\"),(((CMR!$E$11-1.625)/2)*2)/12,0)","v":0},0.23799999999999999,0,null,"Bottom Rail Reinf.",{"$f":"(FLOOR(Frame_Width-13,2))/12","v":-1.1666666666666667},0.14599999999999999,-0.17033333333333334,null,null,null,{"$error":"#N/A"},{"$f":"IF(AND($AO$4<=10,$AO$4>8),10,0)","v":{"$error":"#N/A"}},{"$f":"IF(AND(AP17=10,$AN$4>=11,$AN$4<=13),AP17&\"C\",0)","v":{"$error":"#N/A"}},null,null,{"$error":"#N/A"},{"$f":"IF(AND($AT$4<=10,$AT$4>8),10,0)","v":{"$error":"#N/A"}},{"$f":"IF(AND(AU17=10,$AS$4>=11,$AS$4<=13),AU17&\"C\",0)","v":{"$error":"#N/A"}},null,null,null,null,null,null,null,null,{"$error":"#N/A"},{"$f":"IF(AND($BE$4<=14,$BE$4>12),14,0)","v":{"$error":"#N/A"}},{"$f":"IF(AND(BF17=14,$BD$4>=3,$BD$4<=7),BF17&\"A\",0)","v":{"$error":"#N/A"}},null,null,{"$error":"#N/A"},{"$f":"IF(AND($BJ$4<=14,$BJ$4>12),14,0)","v":{"$error":"#N/A"}},{"$f":"IF(AND(BK17=14,$BI$4>=3,$BI$4<=7),BK17&\"A\",0)","v":{"$error":"#N/A"}},null,null,null,null,null,{"$f":"HLOOKUP($BR$4,CALDWELL_LOOKUP,14,FALSE)","v":30.999999999999996},{"$f":"HLOOKUP($BS$4,CALDWELL_LOOKUP,14,FALSE)","v":32.999499999999998},30,28,null,31.766500000000001,33.765999999999998,31.218499999999999,33.217999999999996,30.999999999999996,32.999499999999998]
[null,19,10,"PK",null,19,55,"NAT",null,null,null,4,{"$f":"IF(EXT_4=0,\"\",EXT_4)","v":""},10,"0901",{"$f":"CMR!$E$59","v":0},{"$f":"CMR!$E$59-0.6875","v":-0.6875},{"$f":"$AK$25","v":0},{"$f":"$AK$24","v":0},0.9375,7.9269999999999996,2.125,4.0625,null,"V200",{"$f":"Frame_Height-(TRUNC(((V200_CDIM-0.8125)*32+0.5))/32-0.0625)-4.047","v":-3.2032499999999997},null,null,"Bottom Glass",{"$f":"(CMR!$E$14*CMR!$E$16)/144","v":4.1015625E-2},{"$f":"$L$12","v":""},{"$f":"IF(AND(Frame_Width=35.5,Frame_Height=59.5),($AD$18*$AE$18)-2.25,$AD$18*$AE$18)","v":{"$error":"#VALUE!"}},null,"Bottom Stile Reinf.",null,0.14599999999999999,0,null,null,null,{"$error":"#N/A"},{"$f":"IF(AND($AO$4<=10,$AO$4>8),10,0)","v":{"$error":"#N/A"}},{"$f":"IF(AND(AP18=10,$AN$4>=14,$AN$4<=15),AP18&\"D\",0)","v":{"$error":"#N/A"}},null,null,{"$error":"#N/A"},{"$f":"IF(AND($AT$4<=10,$AT$4>8),10,0)","v":{"$error":"#N/A"}},{"$f":"IF(AND(AU18=10,$AS$4>=14,$AS$4<=15),AU18&\"D\",0)","v":{"$error":"#N/A"}},null,null,null,null,null,null,null,null,{"$error":"#N/A"},{"$error":"#N/A"},{"$f":"IF(AND(BF18=14,$BD$4>=8,$BD$4<=10),BF18&\"B\",0)","v":{"$error":"#N/A"}},null,null,{"$error":"#N/A"},{"$error":"#N/A"},{"$f":"IF(AND(BK18=14,$BI$4>=8,$BI$4<=10),BK18&\"B\",0)","v":{"$error":"#N/A"}},null,null,null,null,null,{"$f":"HLOOKUP($BR$4,CALDWELL_LOOKUP,15,FALSE)","v":33},{"$f":"HLOOKUP($BS$4,CALDWELL_LOOKUP,15,FALSE)","v":34.999499999999998},32,30,null,33.766500000000001,35.765999999999998,33.218499999999999,35.217999999999996,33,34.999499999999998]
[null,20,10,"PK",null,20,55,"NAT",null,null,null,5,{"$f":"IF(EXT_5=0,\"\",EXT_5)","v":""},10,"09L1",{"$f":"CMR!$E$59","v":0},{"$f":"CMR!$E$59-0.6875","v":-0.6875},{"$f":"$AK$25","v":0},{"$f":"$AK$24","v":0},0.9375,7.9269999999999996,2.125,4.0625,null,"1700",{"$f":"CDIM_1700-2.875","v":-2.875},null,null,"Bottom Spacer",{"$f":"((CMR!$E$14*2)+(CMR!$E$16*2))/12","v":-0.90625},5.3600000000000002E-2,-4.8575E-2,null,"Bottom Glass",{"$f":"(CMR!$E$62*CMR!$E$64)/144","v":0.10026041666666667},{"$f":"$L$12","v":""},{"$error":"#VALUE!"},null,null,null,{"$error":"#N/A"},{"$f":"IF(AND($AO$4<=10,$AO$4>8),10,0)","v":{"$error":"#N/A"}},{"$f":"IF(AND(AP19=10,$AN$4>=16,$AN$4<=18),AP19&\"E\",0)","v":{"$error":"#N/A"}},null,null,{"$error":"#N/A"},{"$f":"IF(AND($AT$4<=10,$AT$4>8),10,0)","v":{"$error":"#N/A"}},{"$f":"IF(AND(AU19=10,$AS$4>=16,$AS$4<=18),AU19&\"E\",0)","v":{"$error":"#N/A"}},null,null,null,null,null,null,null,null,{"$error":"#N/A"},{"$error":"#N/A"},{"$f":"IF(AND(BF19=14,$BD$4>=11,$BD$4<=16),BF19&\"C\",0)","v":{"$error":"#N/A"}},null,null,{"$error":"#N/A"},{"$error":"#N/A"},{"$f":"IF(AND(BK19=14,$BI$4>=11,$BI$4<=16),BK19&\"C\",0)","v":{"$error":"#N/A"}},null,null,null,null,null,{"$f":"HLOOKUP($BR$4,CALDWELL_LOOKUP,16,FALSE)","v":35},{"$f":"HLOOKUP($BS$4,CALDWELL_LOOKUP,16,FALSE)","v":36.999499999999998},34,32,null,35.766500000000001,37.765999999999998,35.218499999999999,37.217999999999996,35,36.999499999999998]
[null,21,56,"BU",null,21,47,"BK",null,null,null,6,{"$f":"IF(EXT_5=0,\"\",EXT_6)","v":""},11.75,"i201",{"$f":"CMR!$E$27","v":0},{"$f":"CMR!$E$27-0.5625","v":-0.5625},{"$f":"$AK$72","v":0},{"$f":"$AK$71","v":0},1.25,7.3125,1.75,4.4059999999999997,null,"1720",{"$f":"CDIM_1720-2.875","v":-2.875},null,null,"Bottom Hardware",1,0.36,0.36,null,"Bottom Spacer",{"$f":"((CMR!$E$62*2)+(CMR!$E$64*2))/12","v":-1.3020833333333333},5.3600000000000002E-2,-6.9791666666666669E-2,null,null,null,{"$error":"#N/A"},{"$f":"IF(AND($AO$4<=12,$AO$4>10),12,0)","v":{"$error":"#N/A"}},{"$f":"IF(AND(AP20=12,$AN$4>=3,$AN$4<=7),AP20&\"A\",0)","v":{"$error":"#N/A"}},null,null,{"$error":"#N/A"},{"$f":"IF(AND($AT$4<=12,$AT$4>10),12,0)","v":{"$error":"#N/A"}},{"$f":"IF(AND(AU20=12,$AS$4>=3,$AS$4<=7),AU20&\"A\",0)","v":{"$error":"#N/A"}},null,null,null,null,null,null,null,null,{"$error":"#N/A"},{"$error":"#N/A"},{"$f":"IF(AND(BF20=14,$BD$4>=17,$BD$4<=19),BF20&\"D\",0)","v":{"$error":"#N/A"}},null,null,{"$error":"#N/A"},{"$error":"#N/A"},{"$f":"IF(AND(BK20=14,$BI$4>=17,$BI$4<=19),BK20&\"D\",0)","v":{"$error":"#N/A"}},null,null,null,null,null,{"$f":"HLOOKUP($BR$4,CALDWELL_LOOKUP,17,FALSE)","v":37},{"$f":"HLOOKUP($BS$4,CALDWELL_LOOKUP,17,FALSE)","v":38.999499999999998},36,34,null,37.766500000000001,39.765999999999998,37.218499999999999,39.217999999999996,37,38.999499999999998]
[null,22,56,"BU",null,22,47,"BK",null,null,null,7,{"$f":"IF(EXT_5=0,\"\",EXT_7)","v":""},12,"3100",{"$f":"CMR!$E$75","v":0},{"$f":"TRUNC(((CMR!$E$75-0.375)*32+0.5))/32","v":-0.34375},{"$f":"$AK$49","v":0},0,1.25,3.42977,2.42977,4.8600000000000003,null,"1730",{"$f":"CDIM_1730-2.875","v":-2.875},null,null,"Bottom Bead",{"$f":"(((Frame_Width-3.75)*2)+((CMR!$E$11-2.5)*2))/12","v":-1.0416666666666667},4.5999999999999999E-2,-4.791666666666667E-2,null,"Bottom Hardware",1,0.32200000000000001,0.32200000000000001,null,null,null,{"$error":"#N/A"},{"$f":"IF(AND($AO$4<=12,$AO$4>10),12,0)","v":{"$error":"#N/A"}},{"$f":"IF(AND(AP21=12,$AN$4>=8,$AN$4<=10),AP21&\"B\",0)","v":{"$error":"#N/A"}},null,null,{"$error":"#N/A"},{"$f":"IF(AND($AT$4<=12,$AT$4>10),12,0)","v":{"$error":"#N/A"}},{"$f":"IF(AND(AU21=12,$AS$4>=8,$AS$4<=10),AU21&\"B\",0)","v":{"$error":"#N/A"}},null,null,null,null,null,null,null,null,{"$error":"#N/A"},{"$error":"#N/A"},{"$f":"IF(AND(BF21=14,$BD$4>=20,$BD$4<=22),BF21&\"E\",0)","v":{"$error":"#N/A"}},null,null,{"$error":"#N/A"},{"$error":"#N/A"},{"$f":"IF(AND(BK21=14,$BI$4>=20,$BI$4<=22),BK21&\"E\",0)","v":{"$error":"#N/A"}},null,null,null,null,null,{"$f":"HLOOKUP($BR$4,CALDWELL_LOOKUP,18,FALSE)","v":39},{"$f":"HLOOKUP($BS$4,CALDWELL_LOOKUP,18,FALSE)","v":40.999499999999998},38,36,null,39.766500000000001,41.765999999999998,39.218499999999999,41.217999999999996,39,40.999499999999998]
[null,23,66,"YW",null,23,48,"BU",null,null,null,8,{"$f":"IF(EXT_5=0,\"\",EXT_8)","v":""},12,"S140",{"$f":"CDIMS140","v":0},{"$f":"BSH_S140","v":{"$error":"#N/A"}},{"$f":"SW_S140","v":{"$error":"#N/A"}},0,{"$f":"IF(OR(EXTSELECT=2,EXTSELECT=3,EXTSELECT=6),1.3125,IF(OR(EXTSELECT=4,EXTSELECT=5),1.03125,0))","v":0},4.25,5.625,{"$f":"IF(OR(EXTSELECT=2,EXTSELECT=3),5.8125,IF(OR(EXTSELECT=4,EXTSELECT=5),3.0625,IF(OR(EXTSELECT=7,EXTSELECT=8),4.625,4.5)))","v":4.5},null,"1900",{"$f":"CDIM_1900-3.0625","v":-3.0625},null,null,null,null,"Top Sash",0,null,"Bottom Keeper Bead",{"$f":"(Frame_Width-5.9375)/12","v":-0.49479166666666669},7.8E-2,-3.8593750000000003E-2,null,null,null,{"$error":"#N/A"},{"$f":"IF(AND($AO$4<=12,$AO$4>10),12,0)","v":{"$error":"#N/A"}},{"$f":"IF(AND(AP22=12,$AN$4>=11,$AN$4<=16),AP22&\"C\",0)","v":{"$error":"#N/A"}},null,null,{"$error":"#N/A"},{"$f":"IF(AND($AT$4<=12,$AT$4>10),12,0)","v":{"$error":"#N/A"}},{"$f":"IF(AND(AU22=12,$AS$4>=11,$AS$4<=16),AU22&\"C\",0)","v":{"$error":"#N/A"}},null,null,"V-Series Tube Length",null,null,null,null,null,{"$error":"#N/A"},{"$error":"#N/A"},{"$f":"IF(AND(BF22=14,$BD$4>=23,$BD$4<=25),BF22&\"F\",0)","v":{"$error":"#N/A"}},null,null,{"$error":"#N/A"},{"$error":"#N/A"},{"$f":"IF(AND(BK22=14,$BI$4>=23,$BI$4<=25),BK22&\"F\",0)","v":{"$error":"#N/A"}},null,null,null,null,null,{"$f":"HLOOKUP($BR$4,CALDWELL_LOOKUP,19,FALSE)","v":41},{"$f":"HLOOKUP($BS$4,CALDWELL_LOOKUP,19,FALSE)","v":42.999499999999998},40,38,null,41.766500000000001,43.765999999999998,41.218499999999999,43.217999999999996,41,42.999499999999998]
[null,24,66,"YW",null,24,48,"BU",null,null,null,null,1,{"$f":"VLOOKUP(EXTSELECT,L15:M22,2,FALSE)","v":""},"S144",{"$f":"CDIMS140","v":0},{"$f":"BSH_S140","v":{"$error":"#N/A"}},{"$f":"SW_S140","v":{"$error":"#N/A"}},0,{"$f":"IF(OR(EXTSELECT=2,EXTSELECT=3,EXTSELECT=6),1.3125,IF(OR(EXTSELECT=4,EXTSELECT=5),1.03125,0))","v":0},4.25,5.625,{"$f":"IF(OR(EXTSELECT=2,EXTSELECT=3),5.8125,IF(OR(EXTSELECT=4,EXTSELECT=5),3.0625,IF(OR(EXTSELECT=7,EXTSELECT=8),4.625,4.5)))","v":4.5},null,"1920",{"$f":"CDIM_1920-3.0625","v":-3.0625},null,null,null,null,"Bottom Sash",{"$f":"IF(OR(ModelNo=\"0100\",ModelNo=\"01HP\",ModelNo=\"0700\",ModelNo=\"07HP\",ModelNo=\"S140\",ModelNo=\"S144\",ModelNo=\"S146\",ModelNo=\"S140 (HP)\",ModelNo=\"S144 (HP)\",ModelNo=\"S146 (HP)\"),SUM(AF13:AF21),0)","v":0},null,"Bottom Bead",{"$f":"((Frame_Width-5.9375)+((CMR!$E$59-3.0625)*2))/12","v":-1.0052083333333333},7.8E-2,-7.8406249999999997E-2,null,null,null,{"$error":"#N/A"},{"$f":"IF(AND($AO$4<=12,$AO$4>10),12,0)","v":{"$error":"#N/A"}},{"$f":"IF(AND(AP23=12,$AN$4>=17,$AN$4<=18),AP23&\"D\",0)","v":{"$error":"#N/A"}},null,null,{"$error":"#N/A"},{"$f":"IF(AND($AT$4<=12,$AT$4>10),12,0)","v":{"$error":"#N/A"}},{"$f":"IF(AND(AU23=12,$AS$4>=17,$AS$4<=18),AU23&\"D\",0)","v":{"$error":"#N/A"}},null,null,"Model","Top","Bott",null,null,null,{"$error":"#N/A"},{"$f":"IF(AND($BE$4<=16,$BE$4>14),16,0)","v":{"$error":"#N/A"}},{"$f":"IF(AND(BF23=16,$BD$4>=3,$BD$4<=7),BF23&\"A\",0)","v":{"$error":"#N/A"}},null,null,{"$error":"#N/A"},{"$f":"IF(AND($BJ$4<=16,$BJ$4>14),16,0)","v":{"$error":"#N/A"}},{"$f":"IF(AND(BK23=16,$BI$4>=3,$BI$4<=7),BK23&\"A\",0)","v":{"$error":"#N/A"}},null,null,null,null,null,{"$f":"HLOOKUP($BR$4,CALDWELL_LOOKUP,20,FALSE)","v":43},{"$f":"HLOOKUP($BS$4,CALDWELL_LOOKUP,20,FALSE)","v":44.999499999999998},42,40,null,43.766500000000001,45.765999999999998,43.218499999999999,45.217999999999996,43,44.999499999999998]
[null,25,67,"GN",null,25,58,"OR",null,null,null,null,{"$f":"IF($M$23=1,0,IF($M$23=6,1.75,IF(OR($M$23=2,$M$23=3),2.40625,IF(OR($M$23=7,$M$23=8),1.8125,1))))","v":0},null,"S146",{"$f":"CDIMS140","v":0},{"$f":"BSH_S140","v":{"$error":"#N/A"}},{"$f":"SW_S140","v":{"$error":"#N/A"}},0,{"$f":"IF(OR(EXTSELECT=2,EXTSELECT=3,EXTSELECT=6),1.3125,IF(OR(EXTSELECT=4,EXTSELECT=5),1.03125,0))","v":0},4.25,5.625,{"$f":"IF(OR(EXTSELECT=2,EXTSELECT=3),5.8125,IF(OR(EXTSELECT=4,EXTSELECT=5),3.0625,IF(OR(EXTSELECT=7,EXTSELECT=8),4.625,4.5)))","v":4.5},null,"1930",{"$f":"CDIM_1930-3.0625","v":-3.0625},null,null,null,null,null,null,null,null,null,"Top Sash",{"$f":"IF(OR(ModelNo=\"0901\",ModelNo=\"09A1\",ModelNo=\"09B1\",ModelNo=\"09L1\"),(SUM(AK4:AK13))+5,0)","v":0},null,null,null,{"$error":"#N/A"},{"$f":"IF(AND($AO$4<=12,$AO$4>10),12,0)","v":{"$error":"#N/A"}},{"$f":"IF(AND(AP24=12,$AN$4>=19,$AN$4<=21),AP24&\"E\",0)","v":{"$error":"#N/A"}},null,null,{"$error":"#N/A"},{"$f":"IF(AND($AT$4<=12,$AT$4>10),12,0)","v":{"$error":"#N/A"}},{"$f":"IF(AND(AU24=12,$AS$4>=19,$AS$4<=21),AU24&\"E\",0)","v":{"$error":"#N/A"}},null,null,"V100",null,{"$f":"FLOOR(Frame_Height/2-2,2)","v":-2},null,null,null,{"$error":"#N/A"},{"$error":"#N/A"},{"$f":"IF(AND(BF24=16,$BD$4>=8,$BD$4<=10),BF24&\"B\",0)","v":{"$error":"#N/A"}},null,null,{"$error":"#N/A"},{"$error":"#N/A"},{"$f":"IF(AND(BK24=16,$BI$4>=8,$BI$4<=10),BK24&\"B\",0)","v":{"$error":"#N/A"}},null,null,null,null,null,{"$f":"HLOOKUP($BR$4,CALDWELL_LOOKUP,21,FALSE)","v":45},{"$f":"HLOOKUP($BS$4,CALDWELL_LOOKUP,21,FALSE)","v":46.999499999999998},44,42,null,45.766500000000001,47.765999999999998,45.218499999999999,47.217999999999996,45,46.999499999999998]
[null,26,67,"GN",null,26,58,"OR",null,null,null,null,{"$f":"IF(AND(EXTSELECT=1,OR(SELECTEXT=\"Select Reinforcement\",SELECTEXT=\"Select Extrusion\")),\"<< Must Select\",\"\")","v":""},null,"V100",{"$f":"V100_CDIM","v":0},{"$f":"TRUNC(((V100_CDIM-0.844)*32+0.5))/32","v":-0.8125},{"$f":"V100_BSW","v":0},0,null,4.375,2,4.625,null,"1901",{"$f":"CDIM_1901-4.125","v":-4.125},null,null,"0201","Length","Weight/ft","Weight",null,null,null,"Bottom Sash",{"$f":"IF(OR(ModelNo=\"0901\",ModelNo=\"09A1\",ModelNo=\"09B1\",ModelNo=\"09L1\"),SUM(AK14:AK23),0)","v":0},null,null,null,{"$error":"#N/A"},{"$f":"IF(AND($AO$4<=14,$AO$4>12),14,0)","v":{"$error":"#N/A"}},{"$f":"IF(AND(AP25=14,$AN$4>=3,$AN$4<=7),AP25&\"A\",0)","v":{"$error":"#N/A"}},null,null,{"$error":"#N/A"},{"$f":"IF(AND($AT$4<=14,$AT$4>12),14,0)","v":{"$error":"#N/A"}},{"$f":"IF(AND(AU25=14,$AS$4>=3,$AS$4<=7),AU25&\"A\",0)","v":{"$error":"#N/A"}},null,null,"V101",{"$f":"IF(V101_DDIM>=Frame_Height/2-0.07,(INT(INT((Frame_Height/2-4.75))/2))*2,(INT(INT((V101_DDIM-4.75))/2))*2)","v":-6},{"$f":"(INT(INT((Frame_Height/2-2.75)+0.25)/2)*2)","v":-4},null,null,null,{"$error":"#N/A"},{"$error":"#N/A"},{"$f":"IF(AND(BF25=16,$BD$4>=11,$BD$4<=16),BF25&\"C\",0)","v":{"$error":"#N/A"}},null,null,{"$error":"#N/A"},{"$error":"#N/A"},{"$f":"IF(AND(BK25=16,$BI$4>=11,$BI$4<=16),BK25&\"C\",0)","v":{"$error":"#N/A"}},null,null,null,null,null,{"$f":"HLOOKUP($BR$4,CALDWELL_LOOKUP,22,FALSE)","v":47},{"$f":"HLOOKUP($BS$4,CALDWELL_LOOKUP,22,FALSE)","v":48.999499999999998},46,44,null,47.766500000000001,49.765999999999998,47.218499999999999,49.217999999999996,47,48.999499999999998]
[null,27,77,"LG",null,27,68,"BR",null,null,null,null,{"$f":"IF(AND(EXT_CONTROL=1,W>0,H>0,LEG=0),\"<< Need Leg Height\",IF(AND(ModelNo=\"S140\",W>0,H>0,LEG<>(Frame_Height-(Frame_Width/2))),\"<< Leg Should be\"&\" \"&(Frame_Height-(Frame_Width/2)),\"\"))","v":""},null,"V101",{"$f":"V101_CDIM","v":0},{"$f":"TRUNC(((V101_CDIM-0.3125)*32+0.5))/32","v":-0.28125},{"$f":"V101_BSW","v":0},{"$f":"V101_TSW","v":0},null,4.375,2,4.625,null,"1921",{"$f":"CDIM_1921-4.125","v":-4.125},null,null,"Top Top Rail",{"$f":"(Frame_Width-3.25)/12","v":-0.27083333333333331},0.25700000000000001,{"$f":"AD26*AE26","v":-6.9604166666666661E-2},null,null,null,null,null,null,null,null,{"$error":"#N/A"},{"$error":"#N/A"},{"$f":"IF(AND(AP26=14,$AN$4>=8,$AN$4<=10),AP26&\"B\",0)","v":{"$error":"#N/A"}},null,null,{"$error":"#N/A"},{"$error":"#N/A"},{"$f":"IF(AND(AU26=14,$AS$4>=8,$AS$4<=10),AU26&\"B\",0)","v":{"$error":"#N/A"}},null,null,"V200",null,{"$f":"FLOOR(Frame_Height/2-2.75,2)","v":-4},null,null,null,{"$error":"#N/A"},{"$error":"#N/A"},{"$f":"IF(AND(BF26=16,$BD$4>=17,$BD$4<=19),BF26&\"D\",0)","v":{"$error":"#N/A"}},null,null,{"$error":"#N/A"},{"$error":"#N/A"},{"$f":"IF(AND(BK26=16,$BI$4>=17,$BI$4<=19),BK26&\"D\",0)","v":{"$error":"#N/A"}}]
[null,28,77,"LG",null,28,68,"BR",null,null,null,null,"Type",null,"V200",{"$f":"V200_CDIM","v":0},{"$f":"TRUNC(((V200_CDIM-0.8125)*32+0.5))/32-0.0625","v":-0.84375},{"$f":"V200_BSW","v":0},0,null,4.375,1.8180000000000001,4.625,null,"1931",{"$f":"CDIM_1931-4.125","v":-4.125},null,null,"Top Bottom Rail",{"$f":"(Frame_Width-3.25)/12","v":-0.27083333333333331},0.27300000000000002,-7.3937500000000003E-2,null,"3100","Length","Weight/ft","Weight",null,null,null,{"$error":"#N/A"},{"$error":"#N/A"},{"$f":"IF(AND(AP27=14,$AN$4>=11,$AN$4<=16),AP27&\"C\",0)","v":{"$error":"#N/A"}},null,null,{"$error":"#N/A"},{"$error":"#N/A"},{"$f":"IF(AND(AU27=14,$AS$4>=11,$AS$4<=16),AU27&\"C\",0)","v":{"$error":"#N/A"}},null,null,"1700",null,{"$f":"VLOOKUP((CDIM_1700-0.84375),Caldwell,3)","v":{"$error":"#N/A"}},null,null,null,{"$error":"#N/A"},{"$error":"#N/A"},{"$f":"IF(AND(BF27=16,$BD$4>=20,$BD$4<=22),BF27&\"E\",0)","v":{"$error":"#N/A"}},null,null,{"$error":"#N/A"},{"$error":"#N/A"},{"$f":"IF(AND(BK27=16,$BI$4>=20,$BI$4<=22),BK27&\"E\",0)","v":{"$error":"#N/A"}}]
[null,29,78,"OR",null,29,78,"GR",null,null,null,1,{"$f":"IF(TYPE1>\"\",TYPE1,\"\")","v":""},null,"3001",{"$f":"CDIM3001","v":0},{"$f":"CDIM3001-0.625","v":-0.625},{"$f":"BSW_3001","v":0},{"$f":"TSW_3001","v":0},null,5.25,5.875,5.25,null,null,{"$f":"VLOOKUP(ModelNo,$Y$16:$Z$27,2,FALSE)","v":{"$error":"#N/A"}},null,null,"Top Stile",{"$f":"(2*(CMR!$E$26-1.5625))/12","v":-0.26041666666666669},0.23300000000000001,-6.067708333333334E-2,null,"Top Top Rail",0,0,{"$f":"AI28*AJ28","v":0},null,null,null,{"$error":"#N/A"},{"$error":"#N/A"},{"$f":"IF(AND(AP28=14,$AN$4>=17,$AN$4<=19),AP28&\"D\",0)","v":{"$error":"#N/A"}},null,null,{"$error":"#N/A"},{"$error":"#N/A"},{"$f":"IF(AND(AU28=14,$AS$4>=17,$AS$4<=19),AU28&\"D\",0)","v":{"$error":"#N/A"}},null,null,"1720",null,{"$f":"VLOOKUP((CDIM_1720-0.84375),Caldwell,3)","v":{"$error":"#N/A"}},null,null,null,{"$error":"#N/A"},{"$error":"#N/A"},{"$f":"IF(AND(BF28=16,$BD$4>=23,$BD$4<=24),BF28&\"F\",0)","v":{"$error":"#N/A"}},null,null,{"$error":"#N/A"},{"$error":"#N/A"},{"$f":"IF(AND(BK28=16,$BI$4>=23,$BI$4<=24),BK28&\"F\",0)","v":{"$error":"#N/A"}}]
[null,30,78,"OR",null,30,78,"GR",null,null,null,2,{"$f":"IF(TYPE2>\"\",TYPE2,\"\")","v":""},null,"03A0",{"$f":"CDIM03A0","v":0},{"$f":"CDIM03A0-1.125","v":-1.125},{"$f":"BSW03A0","v":0},0,null,4.25,5.625,5.8125,null,null,{"$f":"IF(VEH>0,ROUND(((VEH*EW)/144),3))","v":{"$error":"#N/A"}},null,null,"Top Rail Reinf.",{"$f":"(TRUNC(((Frame_Width-3.25)-6)/2)*2)/12","v":-0.66666666666666663},{"$f":"IF(ModelNo=\"0201\",0.299,IF(ModelNo=\"L201\",0.052,0))","v":0},0,null,"Top Bottom Rail",0,0,{"$f":"AI29*AJ29","v":0},null,null,null,{"$error":"#N/A"},{"$error":"#N/A"},{"$f":"IF(AND(AP29=14,$AN$4>=20,$AN$4<=22),AP29&\"E\",0)","v":{"$error":"#N/A"}},null,null,{"$error":"#N/A"},{"$error":"#N/A"},{"$f":"IF(AND(AU29=14,$AS$4>=20,$AS$4<=22),AU29&\"E\",0)","v":{"$error":"#N/A"}},null,null,"1730",null,{"$f":"VLOOKUP((CDIM_1730-0.84375),Caldwell,3)","v":{"$error":"#N/A"}},null,null,null,{"$error":"#N/A"},{"$error":"#N/A"},{"$f":"IF(AND(BF29=16,$BD$4>=25,$BD$4<=27),BF29&\"G\",0)","v":{"$error":"#N/A"}},null,null,{"$error":"#N/A"},{"$error":"#N/A"},{"$f":"IF(AND(BK29=16,$BI$4>=25,$BI$4<=27),BK29&\"G\",0)","v":{"$error":"#N/A"}}]
[null,31,88,"WT",null,31,88,"RD",null,null,null,3,{"$f":"IF(TYPE3>\"\",TYPE3,\"\")","v":""},null,"1700",{"$f":"CDIM_1700","v":0},{"$f":"TRUNC(((CDIM_1700-0.78125)*32+0.5))/32-0.0625","v":-0.8125},{"$f":"AK153","v":0},0,null,3,4.1875,4.625,null,null,null,null,null,"Top Stile Reinf",{"$f":"IF(CMR!$E$31>26.6875,((TRUNC((CMR!$E$26-9.5)/2)*2)/12)*2,0)","v":0},{"$f":"IF(ModelNo=\"0201\",0.299,IF(ModelNo=\"L201\",0.052,0))","v":0},0,null,"Top Stile",0,0,{"$f":"(AI30*AJ30)/12","v":0},null,null,null,{"$error":"#N/A"},{"$error":"#N/A"},{"$f":"IF(AND(AP30=14,$AN$4>=23,$AN$4<=25),AP30&\"F\",0)","v":{"$error":"#N/A"}},null,null,{"$error":"#N/A"},{"$error":"#N/A"},{"$f":"IF(AND(AU30=14,$AS$4>=23,$AS$4<=25),AU30&\"F\",0)","v":{"$error":"#N/A"}},null,null,"1900",null,{"$f":"VLOOKUP((CDIM_1900-0.84375),Caldwell,3)","v":{"$error":"#N/A"}},null,null,null,{"$error":"#N/A"},{"$f":"IF(AND($BE$4<=18,$BE$4>16),18,0)","v":{"$error":"#N/A"}},{"$f":"IF(AND(BF30=18,$BD$4>=4,$BD$4<=9),BF30&\"A\",0)","v":{"$error":"#N/A"}},null,null,{"$error":"#N/A"},{"$f":"IF(AND($BJ$4<=18,$BJ$4>16),18,0)","v":{"$error":"#N/A"}},{"$f":"IF(AND(BK30=18,$BI$4>=4,$BI$4<=9),BK30&\"A\",0)","v":{"$error":"#N/A"}}]
[null,32,88,"WT",null,32,88,"RD",null,null,null,4,{"$f":"IF(TYPE4>\"\",TYPE4,\"\")","v":""},null,"1720",{"$f":"CDIM_1720","v":0},{"$f":"TRUNC(((CDIM_1720-0.84375)*32+0.5))/32","v":-0.8125},{"$f":"AK165","v":0},0,null,3,4.1875,{"$f":"Frame_Width/2+4.875","v":4.875},null,null,null,null,null,"Top Glass",{"$f":"(CMR!$E$29*CMR!$E$31)/144","v":0.10685221354166667},{"$f":"$L$12","v":""},{"$error":"#VALUE!"},null,"Top Rail Reinf.",0,0,0,null,null,null,{"$error":"#N/A"},{"$error":"#N/A"},{"$f":"IF(AND(AP31=14,$AN$4>=26,$AN$4<=28),AP31&\"G\",0)","v":{"$error":"#N/A"}},null,null,{"$error":"#N/A"},{"$error":"#N/A"},{"$f":"IF(AND(AU31=14,$AS$4>=26,$AS$4<=28),AU31&\"G\",0)","v":{"$error":"#N/A"}},null,null,"1920",null,{"$f":"VLOOKUP((CDIM_1920-0.84375),Caldwell,3)","v":{"$error":"#N/A"}},null,null,null,{"$error":"#N/A"},{"$error":"#N/A"},{"$f":"IF(AND(BF31=18,$BD$4>=10,$BD$4<=13),BF31&\"B\",0)","v":{"$error":"#N/A"}},null,null,{"$error":"#N/A"},{"$error":"#N/A"},{"$f":"IF(AND(BK31=18,$BI$4>=10,$BI$4<=13),BK31&\"B\",0)","v":{"$error":"#N/A"}}]
[null,33,89,"NAT",null,33,89,"YW",null,null,null,1,{"$f":"VLOOKUP(TYPE,L28:M31,2,FALSE)","v":""},null,"1730",{"$f":"CDIM_1730","v":0},{"$f":"TRUNC(((CDIM_1730-0.84375)*32+0.5))/32","v":-0.8125},{"$f":"AK177","v":0},0,null,3,4.1875,{"$f":"((Frame_Width/3)*2)+4.875","v":4.875},null,"SHAT Error",null,null,null,"Top Spacer",{"$f":"((CMR!$E$29*2)+(CMR!$E$31*2))/12","v":-1.3385416666666667},5.3600000000000002E-2,-7.1745833333333342E-2,null,"Top Stile Reinf",0,0,0,null,null,null,{"$error":"#N/A"},{"$error":"#N/A"},{"$f":"IF(AND(AP32=14,$AN$4>=29,$AN$4<=31),AP32&\"H\",0)","v":{"$error":"#N/A"}},null,null,{"$error":"#N/A"},{"$error":"#N/A"},{"$f":"IF(AND(AU32=14,$AS$4>=29,$AS$4<=31),AU32&\"H\",0)","v":{"$error":"#N/A"}},null,null,"1930",null,{"$f":"VLOOKUP((CDIM_1930-0.84375),Caldwell,3)","v":{"$error":"#N/A"}},null,null,null,{"$error":"#N/A"},{"$error":"#N/A"},{"$f":"IF(AND(BF32=18,$BD$4>=14,$BD$4<=18),BF32&\"C\",0)","v":{"$error":"#N/A"}},null,null,{"$error":"#N/A"},{"$error":"#N/A"},{"$f":"IF(AND(BK32=18,$BI$4>=14,$BI$4<=18),BK32&\"C\",0)","v":{"$error":"#N/A"}}]
[null,34,89,"NAT",null,34,89,"YW",null,null,null,null,null,null,"1900",{"$f":"CDIM_1900","v":0},{"$f":"TRUNC(((CDIM_1900-0.844)*16+0.5))/16","v":-0.8125},{"$f":"AF160","v":0},0,null,3,4.4375,4.625,null,{"$f":"IF(AND(OR(ModelNo=\"S140\",ModelNo=\"S144\",ModelNo=\"S146\"),EH<6),1,0)","v":{"$error":"#N/A"}},null,null,null,"Top Hardware",1,0.2,0.2,null,"Top Glass",0,0,0,null,null,null,{"$error":"#N/A"},{"$error":"#N/A"},{"$f":"IF(AND(AP33=14,$AN$4>=32,$AN$4<=34),AP33&\"I\",0)","v":{"$error":"#N/A"}},null,null,{"$error":"#N/A"},{"$error":"#N/A"},{"$f":"IF(AND(AU33=14,$AS$4>=32,$AS$4<=34),AU33&\"I\",0)","v":{"$error":"#N/A"}},null,null,"1901",{"$f":"VLOOKUP((DDIM_1901-1),Caldwell,4)","v":{"$error":"#N/A"}},{"$f":"VLOOKUP((CDIM_1901-1),Caldwell,3)","v":{"$error":"#N/A"}},null,null,null,{"$error":"#N/A"},{"$error":"#N/A"},{"$f":"IF(AND(BF33=18,$BD$4>=19,$BD$4<=21),BF33&\"D\",0)","v":{"$error":"#N/A"}},null,null,{"$error":"#N/A"},{"$error":"#N/A"},{"$f":"IF(AND(BK33=18,$BI$4>=19,$BI$4<=21),BK33&\"D\",0)","v":{"$error":"#N/A"}}]
[null,35,99,"PU",null,35,99,"YW",null,null,null,null,"Opening",null,"1920",{"$f":"CDIM_1920","v":0},{"$f":"TRUNC(((CDIM_1920-0.844)*16+0.5))/16","v":-0.8125},{"$f":"AF172","v":0},0,null,3,4.4375,{"$f":"Frame_Width/2+4.875","v":4.875},null,"SHAT_MIN_R",null,null,null,"Top Bead",{"$f":"(((Frame_Width-4.3125)*2)+((CMR!$E$26-2.625)*2))/12","v":-1.15625},2.8000000000000001E-2,-3.2375000000000001E-2,null,"Top Spacer",0,0,0,null,null,null,{"$error":"#N/A"},{"$f":"IF(AND($AO$4<=16,$AO$4>14),16,0)","v":{"$error":"#N/A"}},{"$f":"IF(AND(AP34=16,$AN$4>=3,$AN$4<=7),AP34&\"A\",0)","v":{"$error":"#N/A"}},null,null,{"$error":"#N/A"},{"$f":"IF(AND($AT$4<=16,$AT$4>14),16,0)","v":{"$error":"#N/A"}},{"$f":"IF(AND(AU34=16,$AS$4>=3,$AS$4<=7),AU34&\"A\",0)","v":{"$error":"#N/A"}},null,null,"1921",{"$f":"VLOOKUP((DDIM_1921-1),Caldwell,4)","v":{"$error":"#N/A"}},{"$f":"VLOOKUP((CDIM_1921-1),Caldwell,3)","v":{"$error":"#N/A"}},null,null,null,{"$error":"#N/A"},{"$error":"#N/A"},{"$f":"IF(AND(BF34=18,$BD$4>=22,$BD$4<=24),BF34&\"E\",0)","v":{"$error":"#N/A"}},null,null,{"$error":"#N/A"},{"$error":"#N/A"},{"$f":"IF(AND(BK34=18,$BI$4>=22,$BI$4<=24),BK34&\"E\",0)","v":{"$error":"#N/A"}}]
[null,36,99,"PU",null,36,99,"YW",null,null,null,1,"Exact Size",null,"1930",{"$f":"CDIM_1930","v":0},{"$f":"TRUNC(((CDIM_1930-0.844)*16+0.5))/16","v":-0.8125},{"$f":"AF184","v":0},0,null,3,4.4375,{"$f":"((Frame_Width/3)*2)+4.875","v":4.875},null,{"$f":"IF(AND(OR(ModelNo=\"S140\",ModelNo=\"S144\",ModelNo=\"S146\"),SHATRADIUS<Y36),1,0)","v":{"$error":"#DIV/0!"}},null,null,null,"Bottom Top Rail",{"$f":"(Frame_Width-2.25)/12","v":-0.1875},0.246,{"$f":"AD35*AE35","v":-4.6124999999999999E-2},null,"Top Hardware",0,0,0,null,null,null,{"$error":"#N/A"},{"$error":"#N/A"},{"$f":"IF(AND(AP35=16,$AN$4>=8,$AN$4<=10),AP35&\"B\",0)","v":{"$error":"#N/A"}},null,null,{"$error":"#N/A"},{"$error":"#N/A"},{"$f":"IF(AND(AU35=16,$AS$4>=8,$AS$4<=10),AU35&\"B\",0)","v":{"$error":"#N/A"}},null,null,"1931",{"$f":"VLOOKUP((DDIM_1931-1),Caldwell,4)","v":{"$error":"#N/A"}},{"$f":"VLOOKUP((CDIM_1931-1),Caldwell,3)","v":{"$error":"#N/A"}},null,null,null,{"$error":"#N/A"},{"$error":"#N/A"},{"$f":"IF(AND(BF35=18,$BD$4>=25,$BD$4<=26),BF35&\"F\",0)","v":{"$error":"#N/A"}},null,null,{"$error":"#N/A"},{"$error":"#N/A"},{"$f":"IF(AND(BK35=18,$BI$4>=25,$BI$4<=26),BK35&\"F\",0)","v":{"$error":"#N/A"}}]
[null,37,766,"BU",null,37,478,"PUR",null,null,null,2,"Rough Opening",null,"1901",{"$f":"CDIM_1901","v":0},{"$f":"TRUNC(((CDIM_1901-1)*16+0.5))/16","v":-0.9375},{"$f":"AK199","v":0},{"$f":"AK198","v":0},null,3.5,3.125,4.625,null,{"$f":"IF(OR(ModelNo=\"S140\",ModelNo=\"S144\",ModelNo=\"S146\"),VLOOKUP(EXTSELECT,L16:N20,3),0)","v":0},null,null,null,"Bottom Bottom Rail",{"$f":"(Frame_Width-2.25)/12","v":-0.1875},0.25700000000000001,-4.8187500000000001E-2,null,"Top Bead",0,0,0,null,null,null,{"$error":"#N/A"},{"$error":"#N/A"},{"$f":"IF(AND(AP36=16,$AN$4>=11,$AN$4<=16),AP36&\"C\",0)","v":{"$error":"#N/A"}},null,null,{"$error":"#N/A"},{"$error":"#N/A"},{"$f":"IF(AND(AU36=16,$AS$4>=11,$AS$4<=16),AU36&\"C\",0)","v":{"$error":"#N/A"}},null,null,{"$f":"ModelNo","v":"Select Model"},{"$f":"VLOOKUP($AY$36,$AY$24:$BA$35,2,FALSE)","v":{"$error":"#N/A"}},{"$f":"VLOOKUP($AY$36,$AY$24:$BA$35,3,FALSE)","v":{"$error":"#N/A"}},null,null,null,{"$error":"#N/A"},{"$error":"#N/A"},{"$f":"IF(AND(BF36=18,$BD$4>=27,$BD$4<=29),BF36&\"G\",0)","v":{"$error":"#N/A"}},null,null,{"$error":"#N/A"},{"$error":"#N/A"},{"$f":"IF(AND(BK36=18,$BI$4>=27,$BI$4<=29),BK36&\"G\",0)","v":{"$error":"#N/A"}}]
[null,38,766,"BU",null,38,478,"PUR",null,null,null,1,{"$f":"VLOOKUP(RO,L35:M36,2,FALSE)","v":"Exact Size"},null,"1921",{"$f":"CDIM_1921","v":0},{"$f":"TRUNC(((CDIM_1921-1)*16+0.5))/16","v":-0.9375},{"$f":"AK199","v":0},{"$f":"AK198","v":0},null,3.5,3.125,{"$f":"Frame_Width/2+4.875","v":4.875},null,"SHAT_MESSAGE",null,null,null,"Bottom Stile",{"$f":"(2*(CMR!$E$27-0.5625))/12","v":-9.375E-2},0.23300000000000001,-2.1843750000000002E-2,null,"Bottom Top Rail",{"$f":"(Frame_Width-2.14315)/12","v":-0.17859583333333331},0.33100000000000002,{"$f":"AI37*AJ37","v":-5.9115220833333329E-2},null,null,null,{"$error":"#N/A"},{"$error":"#N/A"},{"$f":"IF(AND(AP37=16,$AN$4>=17,$AN$4<=19),AP37&\"D\",0)","v":{"$error":"#N/A"}},null,null,{"$error":"#N/A"},{"$error":"#N/A"},{"$f":"IF(AND(AU37=16,$AS$4>=17,$AS$4<=19),AU37&\"D\",0)","v":{"$error":"#N/A"}},null,null,null,null,null,null,null,null,{"$error":"#N/A"},{"$error":"#N/A"},{"$f":"IF(AND(BF37=18,$BD$4>=30,$BD$4<=32),BF37&\"H\",0)","v":{"$error":"#N/A"}},null,null,{"$error":"#N/A"},{"$error":"#N/A"},{"$f":"IF(AND(BK37=18,$BI$4>=30,$BI$4<=32),BK37&\"H\",0)","v":{"$error":"#N/A"}}]
[null,39,866,"YW",null,39,488,"YW",null,null,null,null,null,null,"1931",{"$f":"CDIM_1931","v":0},{"$f":"TRUNC(((CDIM_1931-1)*16+0.5))/16","v":-0.9375},{"$f":"AK199","v":0},{"$f":"AK198","v":0},null,3.5,3.125,{"$f":"((Frame_Width/3)*2)+4.875","v":4.875},null,{"$f":"IF(Y35=1,\"Radius Must be Greater Than \"&Y36,\"\")","v":{"$error":"#DIV/0!"}},null,null,null,"Bottom Rail Reinf.",{"$f":"(TRUNC(((Frame_Width-2.25)-6)/2)*2)/12","v":-0.66666666666666663},{"$f":"IF(ModelNo=\"0201\",0.37,IF(ModelNo=\"L201\",0.052,0))","v":0},0,null,"Bottom Bottom Rail",{"$f":"(Frame_Width-2.14315)/12","v":-0.17859583333333331},0.316,{"$f":"AI38*AJ38","v":-5.643628333333333E-2},null,null,null,{"$error":"#N/A"},{"$error":"#N/A"},{"$f":"IF(AND(AP38=16,$AN$4>=20,$AN$4<=22),AP38&\"E\",0)","v":{"$error":"#N/A"}},null,null,{"$error":"#N/A"},{"$error":"#N/A"},{"$f":"IF(AND(AU38=16,$AS$4>=20,$AS$4<=22),AU38&\"E\",0)","v":{"$error":"#N/A"}},null,null,null,null,null,null,null,null,{"$error":"#N/A"},{"$f":"IF(AND($BE$4<=20,$BE$4>18),20,0)","v":{"$error":"#N/A"}},{"$f":"IF(AND(BF38=20,$BD$4>=5,$BD$4<=10),BF38&\"A\",0)","v":{"$error":"#N/A"}},null,null,{"$error":"#N/A"},{"$f":"IF(AND($BJ$4<=20,$BJ$4>18),20,0)","v":{"$error":"#N/A"}},{"$f":"IF(AND(BK38=20,$BI$4>=5,$BI$4<=10),BK38&\"A\",0)","v":{"$error":"#N/A"}}]
[null,40,866,"YW",null,40,488,"YW",null,null,null,{"$f":"IF(OR(ModelNo=\"0100\",ModelNo=\"01HP\",ModelNo=\"0102\",ModelNo=\"0103\",ModelNo=\"0104\",ModelNo=\"0109\",ModelNo=\"0151\",ModelNo=\"0152\",ModelNo=\"0153\",ModelNo=\"0154\",ModelNo=\"0155\",ModelNo=\"0170\",ModelNo=\"0171\",ModelNo=\"0172\",ModelNo=\"0173\",ModelNo=\"S174\",ModelNo=\"S175\",ModelNo=\"0179\",ModelNo=\"0301\"),1,0)","v":0},"Screen",null,null,null,null,null,null,null,null,null,null,null,null,null,null,null,"Bottom Stile Reinf.",{"$f":"IF(CMR!$E$32>27.6875,((TRUNC((CMR!$E$27-4.5)/2)*2)/12)*2,0)","v":0},{"$f":"IF(ModelNo=\"0201\",0.299,IF(ModelNo=\"L201\",0.052,0))","v":0},0,null,"Bottom Stile",{"$f":"((CMR!$E$75-0.375)*2)/12","v":-6.25E-2},0.27,{"$f":"AI39*AJ39","v":-1.6875000000000001E-2},null,null,null,{"$error":"#N/A"},{"$error":"#N/A"},{"$f":"IF(AND(AP39=16,$AN$4>=23,$AN$4<=24),AP39&\"F\",0)","v":{"$error":"#N/A"}},null,null,{"$error":"#N/A"},{"$error":"#N/A"},{"$f":"IF(AND(AU39=16,$AS$4>=23,$AS$4<=24),AU39&\"F\",0)","v":{"$error":"#N/A"}},null,null,null,null,null,null,null,null,{"$error":"#N/A"},{"$error":"#N/A"},{"$f":"IF(AND(BF39=20,$BD$4>=11,$BD$4<=14),BF39&\"B\",0)","v":{"$error":"#N/A"}},null,null,{"$error":"#N/A"},{"$error":"#N/A"},{"$f":"IF(AND(BK39=20,$BI$4>=11,$BI$4<=14),BK39&\"B\",0)","v":{"$error":"#N/A"}}]
[null,41,777,"GN",null,41,588,"RD",null,null,null,1,{"$f":"IF(SCREEN1>\"\",SCREEN1,\"\")","v":""},null,null,null,null,null,null,null,null,null,null,null,null,null,null,null,"Bottom Glass",{"$f":"(CMR!$E$30*CMR!$E$32)/144","v":5.8024088541666664E-2},{"$f":"$L$12","v":""},{"$error":"#VALUE!"},null,"Lock Rail Reinf.",{"$f":"(Frame_Width-2.39315)/12","v":-0.19942916666666666},0.39200000000000002,{"$f":"AI40*AJ40","v":-7.8176233333333331E-2},null,null,null,{"$error":"#N/A"},{"$error":"#N/A"},{"$f":"IF(AND(AP40=16,$AN$4>=25,$AN$4<=28),AP40&\"G\",0)","v":{"$error":"#N/A"}},null,null,{"$error":"#N/A"},{"$error":"#N/A"},{"$f":"IF(AND(AU40=16,$AS$4>=25,$AS$4<=28),AU40&\"G\",0)","v":{"$error":"#N/A"}},null,null,null,null,null,null,null,null,{"$error":"#N/A"},{"$error":"#N/A"},{"$f":"IF(AND(BF40=20,$BD$4>=15,$BD$4<=18),BF40&\"C\",0)","v":{"$error":"#N/A"}},null,null,{"$error":"#N/A"},{"$error":"#N/A"},{"$f":"IF(AND(BK40=20,$BI$4>=15,$BI$4<=18),BK40&\"C\",0)","v":{"$error":"#N/A"}}]
[null,42,777,"GN",null,42,588,"RD",null,null,null,2,{"$f":"IF(SCREEN2>\"\",SCREEN2,\"\")","v":""},null,null,null,null,null,null,null,null,null,null,null,null,null,null,null,"Bottom Spacer",{"$f":"((CMR!$E$30*2)+(CMR!$E$32*2))/12","v":-1.0052083333333333},5.3600000000000002E-2,-5.3879166666666665E-2,null,"Lock Rail Reinf.",{"$f":"(Frame_Width-3.625)/12","v":-0.30208333333333331},0.22900000000000001,{"$f":"AI41*AJ41","v":-6.9177083333333333E-2},null,null,null,{"$error":"#N/A"},{"$error":"#N/A"},{"$f":"IF(AND(AP41=16,$AN$4>=29,$AN$4<=31),AP41&\"H\",0)","v":{"$error":"#N/A"}},null,null,{"$error":"#N/A"},{"$error":"#N/A"},{"$f":"IF(AND(AU41=16,$AS$4>=29,$AS$4<=31),AU41&\"H\",0)","v":{"$error":"#N/A"}},null,null,null,null,null,null,null,null,{"$error":"#N/A"},{"$error":"#N/A"},{"$f":"IF(AND(BF41=20,$BD$4>=19,$BD$4<=22),BF41&\"D\",0)","v":{"$error":"#N/A"}},null,null,{"$error":"#N/A"},{"$error":"#N/A"},{"$f":"IF(AND(BK41=20,$BI$4>=19,$BI$4<=22),BK41&\"D\",0)","v":{"$error":"#N/A"}}]
[null,43,877,"LG",null,43,688,"GR",null,null,null,3,{"$f":"IF(SCREEN3>\"\",SCREEN3,\"\")","v":""},null,null,null,null,null,null,null,null,null,null,null,null,null,null,null,"Bottom Hardware",1,0.36,0.36,null,"Handle Rail Reinf.",{"$f":"(Frame_Width-3.625)/12","v":-0.30208333333333331},0.53600000000000003,-0.16191666666666665,null,null,null,{"$error":"#N/A"},{"$error":"#N/A"},{"$f":"IF(AND(AP42=16,$AN$4>=32,$AN$4<=34),AP42&\"I\",0)","v":{"$error":"#N/A"}},null,null,{"$error":"#N/A"},{"$error":"#N/A"},{"$f":"IF(AND(AU42=16,$AS$4>=32,$AS$4<=34),AU42&\"I\",0)","v":{"$error":"#N/A"}},null,null,null,null,null,null,null,null,{"$error":"#N/A"},{"$error":"#N/A"},{"$f":"IF(AND(BF42=20,$BD$4>=23,$BD$4<=26),BF42&\"E\",0)","v":{"$error":"#N/A"}},null,null,{"$error":"#N/A"},{"$error":"#N/A"},{"$f":"IF(AND(BK42=20,$BI$4>=23,$BI$4<=26),BK42&\"E\",0)","v":{"$error":"#N/A"}}]
[null,44,877,"LG",null,44,688,"GR",null,null,null,1,{"$f":"IF(Screen_Type=3,\"L\",IF(Screen_Type=2,\"F\",\"H\"))","v":"H"},null,null,null,null,null,null,null,null,null,null,null,null,null,null,null,"Bottom Bead",{"$f":"(((Frame_Width-3.3125)*2)+((CMR!$E$27-1.625)*2))/12","v":-0.82291666666666663},2.8000000000000001E-2,-2.3041666666666665E-2,null,"Bottom Stile Reinf.",{"$f":"(CMR!$E$75-1.84375)/12","v":-0.15364583333333334},0.53600000000000003,-8.2354166666666673E-2,null,null,null,{"$error":"#N/A"},{"$f":"IF(AND($AO$4<=18,$AO$4>16),18,0)","v":{"$error":"#N/A"}},{"$f":"IF(AND(AP43=18,$AN$4>=4,$AN$4<=9),AP43&\"A\",0)","v":{"$error":"#N/A"}},null,null,{"$error":"#N/A"},{"$f":"IF(AND($AT$4<=18,$AT$4>16),18,0)","v":{"$error":"#N/A"}},{"$f":"IF(AND(AU43=18,$AS$4>=4,$AS$4<=9),AU43&\"A\",0)","v":{"$error":"#N/A"}},null,null,null,null,null,null,null,null,{"$error":"#N/A"},{"$error":"#N/A"},{"$f":"IF(AND(BF43=20,$BD$4>=27,$BD$4<=30),BF43&\"F\",0)","v":{"$error":"#N/A"}},null,null,{"$error":"#N/A"},{"$error":"#N/A"},{"$f":"IF(AND(BK43=20,$BI$4>=27,$BI$4<=30),BK43&\"F\",0)","v":{"$error":"#N/A"}}]
[null,45,878,"OR",null,45,788,"BR",null,null,null,null,null,null,null,null,null,null,null,null,null,null,null,null,null,null,null,null,null,null,"Top Sash",{"$f":"IF(OR(ModelNo=\"0201\",ModelNo=\"L201\"),SUM(AF26:AF34),0)","v":0},null,"Bottom Glass",{"$f":"(CMR!$E$78*CMR!$E$80)/144","v":9.7927517361111105E-2},{"$f":"$L$12","v":""},{"$error":"#VALUE!"},null,null,null,{"$error":"#N/A"},{"$error":"#N/A"},{"$f":"IF(AND(AP44=18,$AN$4>=10,$AN$4<=13),AP44&\"B\",0)","v":{"$error":"#N/A"}},null,null,{"$error":"#N/A"},{"$error":"#N/A"},{"$f":"IF(AND(AU44=18,$AS$4>=10,$AS$4<=13),AU44&\"B\",0)","v":{"$error":"#N/A"}},null,null,null,null,null,null,null,null,{"$error":"#N/A"},{"$error":"#N/A"},{"$f":"IF(AND(BF44=20,$BD$4>=31,$BD$4<=34),BF44&\"G\",0)","v":{"$error":"#N/A"}},null,null,{"$error":"#N/A"},{"$error":"#N/A"},{"$f":"IF(AND(BK44=20,$BI$4>=31,$BI$4<=34),BK44&\"G\",0)","v":{"$error":"#N/A"}}]
[null,46,878,"OR",null,46,788,"BR",null,null,null,null,"Add Grid for Weight Calc",null,null,null,null,null,null,null,null,null,null,null,null,null,null,null,null,null,"Bottom Sash",{"$f":"IF(OR(ModelNo=\"0201\",ModelNo=\"L201\"),SUM(AF35:AF43),0)","v":0},null,"Bottom Spacer",{"$f":"((CMR!$E$78*2)+(CMR!$E$80*2))/12","v":-1.2864583333333333},5.3600000000000002E-2,-6.8954166666666664E-2,null,null,null,{"$error":"#N/A"},{"$error":"#N/A"},{"$f":"IF(AND(AP45=18,$AN$4>=14,$AN$4<=18),AP45&\"C\",0)","v":{"$error":"#N/A"}},null,null,{"$error":"#N/A"},{"$error":"#N/A"},{"$f":"IF(AND(AU45=18,$AS$4>=14,$AS$4<=18),AU45&\"C\",0)","v":{"$error":"#N/A"}},null,null,null,null,null,null,null,null,{"$error":"#N/A"},{"$f":"IF(AND($BE$4<=22,$BE$4>20),22,0)","v":{"$error":"#N/A"}},{"$f":"IF(AND(BF45=22,$BD$4>=5,$BD$4<=10),BF45&\"A\",0)","v":{"$error":"#N/A"}},null,null,{"$error":"#N/A"},{"$f":"IF(AND($BJ$4<=22,$BJ$4>20),22,0)","v":{"$error":"#N/A"}},{"$f":"IF(AND(BK45=22,$BI$4>=5,$BI$4<=10),BK45&\"A\",0)","v":{"$error":"#N/A"}}]
[null,47,888,"WT",null,47,888,"OR",null,null,null,null,false,null,null,null,null,null,null,null,null,null,null,null,null,null,null,null,null,null,null,null,null,"Bottom Hardware",1,0.36,0.36,null,null,null,{"$error":"#N/A"},{"$error":"#N/A"},{"$f":"IF(AND(AP46=18,$AN$4>=19,$AN$4<=21),AP46&\"D\",0)","v":{"$error":"#N/A"}},null,null,{"$error":"#N/A"},{"$error":"#N/A"},{"$f":"IF(AND(AU46=18,$AS$4>=19,$AS$4<=21),AU46&\"D\",0)","v":{"$error":"#N/A"}},null,null,null,null,null,null,null,null,{"$error":"#N/A"},{"$error":"#N/A"},{"$f":"IF(AND(BF46=22,$BD$4>=11,$BD$4<=16),BF46&\"B\",0)","v":{"$error":"#N/A"}},null,null,{"$error":"#N/A"},{"$error":"#N/A"},{"$f":"IF(AND(BK46=22,$BI$4>=11,$BI$4<=16),BK46&\"B\",0)","v":{"$error":"#N/A"}}]
[null,48,888,"WT",null,48,888,"OR",null,null,null,null,null,null,null,null,null,null,null,null,null,null,null,null,null,null,null,null,"02A0","Length","Weight/ft","Weight",null,"Bottom Bead",{"$f":"(((Frame_Width-4.45565)*2)+((CMR!$E$75-4.09375)*2))/12","v":-1.4249000000000001},4.5999999999999999E-2,-6.5545400000000004E-2,null,null,null,{"$error":"#N/A"},{"$error":"#N/A"},{"$f":"IF(AND(AP47=18,$AN$4>=22,$AN$4<=24),AP47&\"E\",0)","v":{"$error":"#N/A"}},null,null,{"$error":"#N/A"},{"$error":"#N/A"},{"$f":"IF(AND(AU47=18,$AS$4>=22,$AS$4<=24),AU47&\"E\",0)","v":{"$error":"#N/A"}},null,null,null,null,null,null,null,null,{"$error":"#N/A"},{"$error":"#N/A"},{"$f":"IF(AND(BF47=22,$BD$4>=17,$BD$4<=21),BF47&\"C\",0)","v":{"$error":"#N/A"}},null,null,{"$error":"#N/A"},{"$error":"#N/A"},{"$f":"IF(AND(BK47=22,$BI$4>=17,$BI$4<=21),BK47&\"C\",0)","v":{"$error":"#N/A"}}]
[null,49,889,"BN",null,49,889,"BU",null,null,null,null,null,null,null,null,null,null,null,null,null,null,null,null,null,null,null,null,"Top Top Rail",0,0,{"$f":"AD48*AE48","v":0},null,null,null,"Top Sash",0,null,null,null,{"$error":"#N/A"},{"$error":"#N/A"},{"$f":"IF(AND(AP48=18,$AN$4>=25,$AN$4<=26),AP48&\"F\",0)","v":{"$error":"#N/A"}},null,null,{"$error":"#N/A"},{"$error":"#N/A"},{"$f":"IF(AND(AU48=18,$AS$4>=25,$AS$4<=26),AU48&\"F\",0)","v":{"$error":"#N/A"}},null,null,null,null,null,null,null,null,{"$error":"#N/A"},{"$error":"#N/A"},{"$f":"IF(AND(BF48=22,$BD$4>=22,$BD$4<=24),BF48&\"D\",0)","v":{"$error":"#N/A"}},null,null,{"$error":"#N/A"},{"$error":"#N/A"},{"$f":"IF(AND(BK48=22,$BI$4>=22,$BI$4<=24),BK48&\"D\",0)","v":{"$error":"#N/A"}}]
[null,50,889,"BN",null,50,889,"BU",null,null,null,null,null,null,null,null,null,null,null,null,null,null,null,null,null,null,null,null,"Top Bottom Rail",0,0,0,null,null,null,"Bottom Sash",{"$f":"IF(ModelNo=\"3100\",SUM(AK37:AK47),0)","v":0},null,null,null,{"$error":"#N/A"},{"$error":"#N/A"},{"$f":"IF(AND(AP49=18,$AN$4>=27,$AN$4<=29),AP49&\"G\",0)","v":{"$error":"#N/A"}},null,null,{"$error":"#N/A"},{"$error":"#N/A"},{"$f":"IF(AND(AU49=18,$AS$4>=27,$AS$4<=29),AU49&\"G\",0)","v":{"$error":"#N/A"}},null,null,null,null,null,null,null,null,{"$error":"#N/A"},{"$error":"#N/A"},{"$f":"IF(AND(BF49=22,$BD$4>=25,$BD$4<=27),BF49&\"E\",0)","v":{"$error":"#N/A"}},null,null,{"$error":"#N/A"},{"$error":"#N/A"},{"$f":"IF(AND(BK49=22,$BI$4>=25,$BI$4<=27),BK49&\"E\",0)","v":{"$error":"#N/A"}}]
[null,51,899,"RD",null,51,"899","BK",null,null,null,null,null,null,null,null,null,null,null,null,null,null,null,null,null,null,null,null,"Top Stile",0,0,0,null,null,null,null,null,null,null,null,{"$error":"#N/A"},{"$error":"#N/A"},{"$f":"IF(AND(AP50=18,$AN$4>=30,$AN$4<=32),AP50&\"H\",0)","v":{"$error":"#N/A"}},null,null,{"$error":"#N/A"},{"$error":"#N/A"},{"$f":"IF(AND(AU50=18,$AS$4>=30,$AS$4<=32),AU50&\"H\",0)","v":{"$error":"#N/A"}},null,null,null,null,null,null,null,null,{"$error":"#N/A"},{"$error":"#N/A"},{"$f":"IF(AND(BF50=22,$BD$4>=28,$BD$4<=30),BF50&\"F\",0)","v":{"$error":"#N/A"}},null,null,{"$error":"#N/A"},{"$error":"#N/A"},{"$f":"IF(AND(BK50=22,$BI$4>=28,$BI$4<=30),BK50&\"F\",0)","v":{"$error":"#N/A"}}]
[null,52,899,"RD",null,52,"899","BK",null,null,null,null,null,null,null,null,null,null,null,null,null,null,null,null,null,null,null,null,"Top Rail Reinf.",0,0,0,null,"i201","Length","Weight/ft","Weight",null,null,null,{"$error":"#N/A"},{"$error":"#N/A"},{"$f":"IF(AND(AP51=18,$AN$4>=33,$AN$4<=34),AP51&\"I\",0)","v":{"$error":"#N/A"}},null,null,{"$error":"#N/A"},{"$error":"#N/A"},{"$f":"IF(AND(AU51=18,$AS$4>=33,$AS$4<=34),AU51&\"I\",0)","v":{"$error":"#N/A"}},null,null,null,null,null,null,null,null,{"$error":"#N/A"},{"$error":"#N/A"},{"$f":"IF(AND(BF51=22,$BD$4>=31,$BD$4<=34),BF51&\"G\",0)","v":{"$error":"#N/A"}},null,null,{"$error":"#N/A"},{"$error":"#N/A"},{"$f":"IF(AND(BK51=22,$BI$4>=31,$BI$4<=34),BK51&\"G\",0)","v":{"$error":"#N/A"}}]
[null,53,999,"NAT",null,53,"999","NAT",null,null,null,null,null,null,null,null,null,null,null,null,null,null,null,null,null,null,null,null,"Top Stile Reinf",0,0,0,null,"Top Top Rail",{"$f":"(Frame_Width-3.25)/12","v":-0.27083333333333331},0.25700000000000001,{"$f":"AI52*AJ52","v":-6.9604166666666661E-2},null,null,null,{"$error":"#N/A"},{"$f":"IF(AND($AO$4<=20,$AO$4>18),20,0)","v":{"$error":"#N/A"}},{"$f":"IF(AND(AP52=20,$AN$4>=5,$AN$4<=10),AP52&\"A\",0)","v":{"$error":"#N/A"}},null,null,{"$error":"#N/A"},{"$f":"IF(AND($AT$4<=20,$AT$4>18),20,0)","v":{"$error":"#N/A"}},{"$f":"IF(AND(AU52=20,$AS$4>=5,$AS$4<=10),AU52&\"A\",0)","v":{"$error":"#N/A"}},null,null,null,null,null,null,null,null,{"$error":"#N/A"},{"$error":"#N/A"},{"$f":"IF(AND(BF52=22,$BD$4>=35,$BD$4<=37),BF52&\"H\",0)","v":{"$error":"#N/A"}},null,null,{"$error":"#N/A"},{"$error":"#N/A"},{"$f":"IF(AND(BK52=22,$BI$4>=35,$BI$4<=37),BK52&\"H\",0)","v":{"$error":"#N/A"}}]
[null,54,999,"NAT",null,54,"999","NAT",null,null,null,null,null,null,null,null,null,null,null,null,null,null,null,null,null,null,null,null,"Top Glass",0,0,0,null,"Top Bottom Rail",{"$f":"(Frame_Width-3.25)/12","v":-0.27083333333333331},0.27300000000000002,-7.3937500000000003E-2,null,null,null,{"$error":"#N/A"},{"$error":"#N/A"},{"$f":"IF(AND(AP53=20,$AN$4>=11,$AN$4<=14),AP53&\"B\",0)","v":{"$error":"#N/A"}},null,null,{"$error":"#N/A"},{"$error":"#N/A"},{"$f":"IF(AND(AU53=20,$AS$4>=11,$AS$4<=14),AU53&\"B\",0)","v":{"$error":"#N/A"}},null,null,null,null,null,null,null,null,{"$error":"#N/A"},{"$f":"IF(AND($BE$4<=24,$BE$4>22),24,0)","v":{"$error":"#N/A"}},{"$f":"IF(AND(BF53=24,$BD$4>=6,$BD$4<=10),BF53&\"A\",0)","v":{"$error":"#N/A"}},null,null,{"$error":"#N/A"},{"$f":"IF(AND($BJ$4<=24,$BJ$4>22),24,0)","v":{"$error":"#N/A"}},{"$f":"IF(AND(BK53=24,$BI$4>=6,$BI$4<=10),BK53&\"A\",0)","v":{"$error":"#N/A"}}]
[null,55,6679,"BU",null,55,"4888","NAT",null,null,null,null,null,null,null,null,null,null,null,null,null,null,null,null,null,null,null,null,"Top Spacer",0,0,0,null,"Top Stile",{"$f":"(2*(CMR!$E$26-1.5625))/12","v":-0.26041666666666669},0.23300000000000001,-6.067708333333334E-2,null,null,null,{"$error":"#N/A"},{"$error":"#N/A"},{"$f":"IF(AND(AP54=20,$AN$4>=15,$AN$4<=18),AP54&\"C\",0)","v":{"$error":"#N/A"}},null,null,{"$error":"#N/A"},{"$error":"#N/A"},{"$f":"IF(AND(AU54=20,$AS$4>=15,$AS$4<=18),AU54&\"C\",0)","v":{"$error":"#N/A"}},null,null,null,null,null,null,null,null,{"$error":"#N/A"},{"$error":"#N/A"},{"$f":"IF(AND(BF54=24,$BD$4>=11,$BD$4<=17),BF54&\"B\",0)","v":{"$error":"#N/A"}},null,null,{"$error":"#N/A"},{"$error":"#N/A"},{"$f":"IF(AND(BK54=24,$BI$4>=11,$BI$4<=17),BK54&\"B\",0)","v":{"$error":"#N/A"}}]
[null,56,6679,"BU",null,56,"4888","NAT",null,null,null,null,null,null,null,null,null,null,null,null,null,null,null,null,null,null,null,null,"Top Hardware",0,0,0,null,"Keeper Rail Reinf.",{"$f":"(TRUNC(Frame_Width-3.25)-6)/12","v":-0.75},0.43099999999999999,-0.32324999999999998,null,null,null,{"$error":"#N/A"},{"$error":"#N/A"},{"$f":"IF(AND(AP55=20,$AN$4>=19,$AN$4<=22),AP55&\"D\",0)","v":{"$error":"#N/A"}},null,null,{"$error":"#N/A"},{"$error":"#N/A"},{"$f":"IF(AND(AU55=20,$AS$4>=19,$AS$4<=22),AU55&\"D\",0)","v":{"$error":"#N/A"}},null,null,null,null,null,null,null,null,{"$error":"#N/A"},{"$error":"#N/A"},{"$f":"IF(AND(BF55=24,$BD$4>=18,$BD$4<=22),BF55&\"C\",0)","v":{"$error":"#N/A"}},null,null,{"$error":"#N/A"},{"$error":"#N/A"},{"$f":"IF(AND(BK55=24,$BI$4>=18,$BI$4<=22),BK55&\"C\",0)","v":{"$error":"#N/A"}}]
[null,57,6779,"LG",null,57,"5888","BK",null,null,null,null,null,null,null,null,null,null,null,null,null,null,null,null,null,null,null,null,"Top Bead",0,0,0,null,"Top Stile Reinf",{"$f":"(2*(CMR!$E$26-3.5625))/12","v":-0.59375},0.43099999999999999,-0.25590625,null,null,null,{"$error":"#N/A"},{"$error":"#N/A"},{"$f":"IF(AND(AP56=20,$AN$4>=23,$AN$4<=26),AP56&\"E\",0)","v":{"$error":"#N/A"}},null,null,{"$error":"#N/A"},{"$error":"#N/A"},{"$f":"IF(AND(AU56=20,$AS$4>=23,$AS$4<=26),AU56&\"E\",0)","v":{"$error":"#N/A"}},null,null,null,null,null,null,null,null,{"$error":"#N/A"},{"$error":"#N/A"},{"$f":"IF(AND(BF56=24,$BD$4>=23,$BD$4<=25),BF56&\"D\",0)","v":{"$error":"#N/A"}},null,null,{"$error":"#N/A"},{"$error":"#N/A"},{"$f":"IF(AND(BK56=24,$BI$4>=23,$BI$4<=25),BK56&\"D\",0)","v":{"$error":"#N/A"}}]
[null,58,6779,"LG",null,58,"5888","BK",null,null,null,null,null,null,null,"Block & Tackle Tube Length",null,null,null,null,null,null,null,null,null,null,null,null,"Bottom Top Rail",{"$f":"(Frame_Width-2.25)/12","v":-0.1875},0.24099999999999999,{"$f":"AD57*AE57","v":-4.5187499999999999E-2},null,"Top Glass",{"$f":"(CMR!$E$29*CMR!$E$31)/144","v":0.10685221354166667},{"$f":"$L$12","v":""},{"$error":"#VALUE!"},null,null,null,{"$error":"#N/A"},{"$error":"#N/A"},{"$f":"IF(AND(AP57=20,$AN$4>=27,$AN$4<=30),AP57&\"F\",0)","v":{"$error":"#N/A"}},null,null,{"$error":"#N/A"},{"$error":"#N/A"},{"$f":"IF(AND(AU57=20,$AS$4>=27,$AS$4<=30),AU57&\"F\",0)","v":{"$error":"#N/A"}},null,null,null,null,null,null,null,null,{"$error":"#N/A"},{"$error":"#N/A"},{"$f":"IF(AND(BF57=24,$BD$4>=26,$BD$4<=28),BF57&\"E\",0)","v":{"$error":"#N/A"}},null,null,{"$error":"#N/A"},{"$error":"#N/A"},{"$f":"IF(AND(BK57=24,$BI$4>=26,$BI$4<=28),BK57&\"E\",0)","v":{"$error":"#N/A"}}]
[null,59,7779,"WT",null,59,"6888","BU",null,null,null,null,null,null,null,"Model","Bott. Tube Length","Top Tube Length",null,null,null,null,null,null,null,null,null,null,"Bottom Bottom Rail",{"$f":"(Frame_Width-2.25)/12","v":-0.1875},0.25,-4.6875E-2,null,"Top Spacer",{"$f":"((CMR!$E$29*2)+(CMR!$E$31*2))/12","v":-1.3385416666666667},5.3600000000000002E-2,-7.1745833333333342E-2,null,null,null,{"$error":"#N/A"},{"$error":"#N/A"},{"$f":"IF(AND(AP58=20,$AN$4>=31,$AN$4<=34),AP58&\"G\",0)","v":{"$error":"#N/A"}},null,null,{"$error":"#N/A"},{"$error":"#N/A"},{"$f":"IF(AND(AU58=20,$AS$4>=31,$AS$4<=34),AU58&\"G\",0)","v":{"$error":"#N/A"}},null,null,null,null,null,null,null,null,{"$error":"#N/A"},{"$error":"#N/A"},{"$f":"IF(AND(BF58=24,$BD$4>=29,$BD$4<=30),BF58&\"F\",0)","v":{"$error":"#N/A"}},null,null,{"$error":"#N/A"},{"$error":"#N/A"},{"$f":"IF(AND(BK58=24,$BI$4>=29,$BI$4<=30),BK58&\"F\",0)","v":{"$error":"#N/A"}}]
[null,60,7779,"WT",null,60,"6888","BU",null,null,null,null,null,null,null,{"$f":"ModelNo","v":"Select Model"},{"$f":"VLOOKUP(ModelNo,$P$60:$R$68,2,FALSE)","v":{"$error":"#N/A"}},{"$f":"VLOOKUP(ModelNo,$P$60:$R$68,3,FALSE)","v":{"$error":"#N/A"}},null,null,null,null,null,null,null,null,null,null,"Bottom Stile",{"$f":"((CMR!L27-0.75)*2)/12","v":-0.125},0.23,-2.8750000000000001E-2,null,"Top Hardware",1,{"$f":"IF(Frame_Width>36,0.258,0.2)","v":0.2},0.2,null,null,null,{"$error":"#N/A"},{"$error":"#N/A"},{"$f":"IF(AND(AP59=20,$AN$4>=35,$AN$4<=37),AP59&\"H\",0)","v":{"$error":"#N/A"}},null,null,{"$error":"#N/A"},{"$error":"#N/A"},{"$f":"IF(AND(AU59=20,$AS$4>=35,$AS$4<=37),AU59&\"H\",0)","v":{"$error":"#N/A"}},null,null,null,null,null,null,null,null,{"$error":"#N/A"},{"$error":"#N/A"},{"$f":"IF(AND(BF59=24,$BD$4>=31,$BD$4<=34),BF59&\"G\",0)","v":{"$error":"#N/A"}},null,null,{"$error":"#N/A"},{"$error":"#N/A"},{"$f":"IF(AND(BK59=24,$BI$4>=31,$BI$4<=34),BK59&\"G\",0)","v":{"$error":"#N/A"}}]
[null,61,6799,"OR",null,61,"7888","OR",null,null,null,null,null,null,null,"0201",{"$f":"FLOOR(Frame_Height/2-2.25,2)","v":-4},{"$f":"IF(DDIM0201>=Frame_Height/2,FLOOR(Frame_Height/2-4.75,2),FLOOR(DDIM0201-4.75,2))","v":-6},null,null,null,null,null,null,null,null,null,null,"Bottom Rail Reinf.",{"$f":"(TRUNC(((AD57*12)-6)/2)*2)/12","v":-0.66666666666666663},0.32800000000000001,-0.21866666666666668,null,"Top Bead",{"$f":"(((Frame_Width-4.3125)*2)+((CMR!$E$26-2.625)*2))/12","v":-1.15625},2.8000000000000001E-2,-3.2375000000000001E-2,null,null,null,{"$error":"#N/A"},{"$error":"#N/A"},{"$f":"IF(AND(AP60=20,$AN$4>=38,$AN$4<=40),AP60&\"I\",0)","v":{"$error":"#N/A"}},null,null,{"$error":"#N/A"},{"$error":"#N/A"},{"$f":"IF(AND(AU60=20,$AS$4>=38,$AS$4<=40),AU60&\"I\",0)","v":{"$error":"#N/A"}},null,null,null,null,null,null,null,null,{"$error":"#N/A"},{"$error":"#N/A"},{"$f":"IF(AND(BF60=24,$BD$4>=35,$BD$4<=37),BF60&\"H\",0)","v":{"$error":"#N/A"}},null,null,{"$error":"#N/A"},{"$error":"#N/A"},{"$f":"IF(AND(BK60=24,$BI$4>=35,$BI$4<=37),BK60&\"H\",0)","v":{"$error":"#N/A"}}]
[null,62,6799,"OR",null,62,"7888","OR",null,null,null,null,null,null,null,"L201",{"$f":"FLOOR(Frame_Height/2-2.25,2)","v":-4},{"$f":"IF(DDIM0201>=Frame_Height/2,FLOOR(Frame_Height/2-4.75,2),FLOOR(DDIM0201-4.75,2))","v":-6},null,null,null,null,null,null,null,null,null,null,"Bottom Stile Reinf.",{"$f":"IF(CMR!$L$32>=27.5,(((CMR!$L$32-4.5)/2)*2)/12,0)","v":0},0.23799999999999999,0,null,"Bottom Top Rail",{"$f":"(Frame_Width-2.25)/12","v":-0.1875},0.246,-4.6124999999999999E-2,null,null,null,{"$error":"#N/A"},{"$f":"IF(AND($AO$4<=22,$AO$4>20),22,0)","v":{"$error":"#N/A"}},{"$f":"IF(AND(AP61=22,$AN$4>=5,$AN$4<=10),AP61&\"A\",0)","v":{"$error":"#N/A"}},null,null,{"$error":"#N/A"},{"$f":"IF(AND($AT$4<=22,$AT$4>20),22,0)","v":{"$error":"#N/A"}},{"$f":"IF(AND(AU61=22,$AS$4>=5,$AS$4<=10),AU61&\"A\",0)","v":{"$error":"#N/A"}},null,null,null,null,null,null,null,null,{"$error":"#N/A"},{"$f":"IF(AND($BE$4<=26,$BE$4>24),26,0)","v":{"$error":"#N/A"}},{"$f":"IF(AND(BF61=26,$BD$4>=6,$BD$4<=11),BF61&\"A\",0)","v":{"$error":"#N/A"}},null,null,{"$error":"#N/A"},{"$f":"IF(AND($BJ$4<=26,$BJ$4>24),26,0)","v":{"$error":"#N/A"}},{"$f":"IF(AND(BK61=26,$BI$4>=6,$BI$4<=11),BK61&\"A\",0)","v":{"$error":"#N/A"}}]
[null,63,7799,"BN",null,63,"8888","BR",null,null,null,null,null,null,null,"02A0",{"$f":"FLOOR(Frame_Height/2-2.25,2)","v":-4},null,null,null,null,null,null,null,null,null,null,null,"Bottom Glass",{"$f":"(CMR!$L$30*CMR!$L$32)/144","v":6.3910590277777776E-2},{"$f":"$L$12","v":""},{"$error":"#VALUE!"},null,"Bottom Bottom Rail",{"$f":"(Frame_Width-2.25)/12","v":-0.1875},0.25700000000000001,-4.8187500000000001E-2,null,null,null,{"$error":"#N/A"},{"$error":"#N/A"},{"$f":"IF(AND(AP62=22,$AN$4>=11,$AN$4<=16),AP62&\"B\",0)","v":{"$error":"#N/A"}},null,null,{"$error":"#N/A"},{"$error":"#N/A"},{"$f":"IF(AND(AU62=22,$AS$4>=11,$AS$4<=16),AU62&\"B\",0)","v":{"$error":"#N/A"}},null,null,null,null,null,null,null,null,{"$error":"#N/A"},{"$error":"#N/A"},{"$f":"IF(AND(BF62=26,$BD$4>=12,$BD$4<=17),BF62&\"B\",0)","v":{"$error":"#N/A"}},null,null,{"$error":"#N/A"},{"$error":"#N/A"},{"$f":"IF(AND(BK62=26,$BI$4>=12,$BI$4<=17),BK62&\"B\",0)","v":{"$error":"#N/A"}}]
[null,64,7799,"BN",null,64,"8888","BR",null,null,null,null,null,null,null,"0501",{"$f":"FLOOR(Frame_Height/2-3,2)","v":-4},{"$f":"IF(DDIM0501>=Frame_Height/2-0.07,FLOOR(Frame_Height/2-5,2),FLOOR(DDIM0501-5,2))","v":-6},null,null,null,null,null,null,null,null,null,null,"Bottom Spacer",{"$f":"((CMR!$L$30*2)+(CMR!$L$32*2))/12","v":-1.0416666666666667},5.3600000000000002E-2,-5.5833333333333339E-2,null,"Bottom Stile",{"$f":"(2*(CMR!$E$27-0.5625))/12","v":-9.375E-2},0.23300000000000001,-2.1843750000000002E-2,null,null,null,{"$error":"#N/A"},{"$error":"#N/A"},{"$f":"IF(AND(AP63=22,$AN$4>=17,$AN$4<=21),AP63&\"C\",0)","v":{"$error":"#N/A"}},null,null,{"$error":"#N/A"},{"$error":"#N/A"},{"$f":"IF(AND(AU63=22,$AS$4>=17,$AS$4<=21),AU63&\"C\",0)","v":{"$error":"#N/A"}},null,null,null,null,null,null,null,null,{"$error":"#N/A"},{"$error":"#N/A"},{"$f":"IF(AND(BF63=26,$BD$4>=18,$BD$4<=22),BF63&\"C\",0)","v":{"$error":"#N/A"}},null,null,{"$error":"#N/A"},{"$error":"#N/A"},{"$f":"IF(AND(BK63=26,$BI$4>=18,$BI$4<=22),BK63&\"C\",0)","v":{"$error":"#N/A"}}]
[null,65,7899,"GN",null,65,"8889","GR",null,null,null,null,null,null,null,"B501",{"$f":"FLOOR(Frame_Height/2-3,2)","v":-4},{"$f":"IF(DDIM0501>=Frame_Height/2-0.07,FLOOR(Frame_Height/2-5,2),FLOOR(DDIM0501-5,2))","v":-6},null,null,null,null,null,null,null,null,null,null,"Bottom Hardware",1,0.36,0.36,null,"Lock Rail Reinf.",{"$f":"(Frame_Width-3)/12","v":-0.25},0.56010000000000004,-0.14002500000000001,null,null,null,{"$error":"#N/A"},{"$error":"#N/A"},{"$f":"IF(AND(AP64=22,$AN$4>=22,$AN$4<=24),AP64&\"D\",0)","v":{"$error":"#N/A"}},null,null,{"$error":"#N/A"},{"$error":"#N/A"},{"$f":"IF(AND(AU64=22,$AS$4>=22,$AS$4<=24),AU64&\"D\",0)","v":{"$error":"#N/A"}},null,null,null,null,null,null,null,null,{"$error":"#N/A"},{"$error":"#N/A"},{"$f":"IF(AND(BF64=26,$BD$4>=23,$BD$4<=26),BF64&\"D\",0)","v":{"$error":"#N/A"}},null,null,{"$error":"#N/A"},{"$error":"#N/A"},{"$f":"IF(AND(BK64=26,$BI$4>=23,$BI$4<=26),BK64&\"D\",0)","v":{"$error":"#N/A"}}]
[null,66,7899,"GN",null,66,"8889","GR",null,null,null,null,null,null,null,"0901",{"$f":"FLOOR(Frame_Height/2-2.5,2)","v":-4},{"$f":"IF(DDIM0901>=Frame_Height/2-0.07,FLOOR(Frame_Height/2-4,2),FLOOR(DDIM0901-4,2))","v":-4},null,null,null,null,null,null,null,null,null,null,"Bottom Bead",{"$f":"(((Frame_Width-3.3125)*2)+((CMR!$L$27-1.8125)*2))/12","v":-0.85416666666666663},2.8000000000000001E-2,-2.3916666666666666E-2,null,"Bottom Rail Reinf.",{"$f":"(Frame_Width-8.25)/12","v":-0.6875},0.43,{"$f":"AI65*AJ65","v":-0.29562499999999997},null,null,null,{"$error":"#N/A"},{"$error":"#N/A"},{"$f":"IF(AND(AP65=22,$AN$4>=25,$AN$4<=27),AP65&\"E\",0)","v":{"$error":"#N/A"}},null,null,{"$error":"#N/A"},{"$error":"#N/A"},{"$f":"IF(AND(AU65=22,$AS$4>=25,$AS$4<=27),AU65&\"E\",0)","v":{"$error":"#N/A"}},null,null,null,null,null,null,null,null,{"$error":"#N/A"},{"$error":"#N/A"},{"$f":"IF(AND(BF65=26,$BD$4>=27,$BD$4<=30),BF65&\"E\",0)","v":{"$error":"#N/A"}},null,null,{"$error":"#N/A"},{"$error":"#N/A"},{"$f":"IF(AND(BK65=26,$BI$4>=27,$BI$4<=30),BK65&\"E\",0)","v":{"$error":"#N/A"}}]
[null,67,8899,"RD",null,67,"8899","RD",null,null,null,null,null,null,null,"09L1",{"$f":"FLOOR(Frame_Height/2-2.5,2)","v":-4},{"$f":"IF(DDIM0901>=Frame_Height/2-0.07,FLOOR(Frame_Height/2-4,2),FLOOR(DDIM0901-4,2))","v":-4},null,null,null,null,null,null,null,null,null,null,null,null,"Top Sash",0,null,"Bottom Stile Reinf.",{"$f":"2*((CMR!$E$27-2.5625)/12)","v":-0.42708333333333331},0.43,-0.18364583333333331,null,null,null,{"$error":"#N/A"},{"$error":"#N/A"},{"$f":"IF(AND(AP66=22,$AN$4>=28,$AN$4<=30),AP66&\"F\",0)","v":{"$error":"#N/A"}},null,null,{"$error":"#N/A"},{"$error":"#N/A"},{"$f":"IF(AND(AU66=22,$AS$4>=28,$AS$4<=30),AU66&\"F\",0)","v":{"$error":"#N/A"}},null,null,null,null,null,null,null,null,{"$error":"#N/A"},{"$error":"#N/A"},{"$f":"IF(AND(BF66=26,$BD$4>=31,$BD$4<=34),BF66&\"F\",0)","v":{"$error":"#N/A"}},null,null,{"$error":"#N/A"},{"$error":"#N/A"},{"$f":"IF(AND(BK66=26,$BI$4>=31,$BI$4<=34),BK66&\"F\",0)","v":{"$error":"#N/A"}}]
[null,68,8899,"RD",null,68,"8899","RD",null,null,null,null,null,null,null,"3001",{"$f":"FLOOR(Frame_Height/2-2.25,2)","v":-4},{"$f":"IF(DDIM3001>=Frame_Height/2,FLOOR(Frame_Height/2-4.75,2),FLOOR(DDIM3001-4.75,2))","v":-6},null,null,null,null,null,null,null,null,null,null,null,null,"Bottom Sash",{"$f":"IF(OR(ModelNo=\"02A0\",ModelNo=\"S140\",ModelNo=\"S144\",ModelNo=\"S146\",ModelNo=\"S140 (HP)\",ModelNo=\"S144 (HP)\",ModelNo=\"S146 (HP)\"),SUM(AF57:AF65),0)","v":0},null,"Bottom Glass",{"$f":"(CMR!$E$30*CMR!$E$32)/144","v":5.8024088541666664E-2},{"$f":"$L$12","v":""},{"$error":"#VALUE!"},null,null,null,{"$error":"#N/A"},{"$error":"#N/A"},{"$f":"IF(AND(AP67=22,$AN$4>=31,$AN$4<=34),AP67&\"G\",0)","v":{"$error":"#N/A"}},null,null,{"$error":"#N/A"},{"$error":"#N/A"},{"$f":"IF(AND(AU67=22,$AS$4>=31,$AS$4<=34),AU67&\"G\",0)","v":{"$error":"#N/A"}},null,null,null,null,null,null,null,null,{"$error":"#N/A"},{"$error":"#N/A"},{"$f":"IF(AND(BF67=26,$BD$4>=35,$BD$4<=38),BF67&\"G\",0)","v":{"$error":"#N/A"}},null,null,{"$error":"#N/A"},{"$error":"#N/A"},{"$f":"IF(AND(BK67=26,$BI$4>=35,$BI$4<=38),BK67&\"G\",0)","v":{"$error":"#N/A"}}]
[null,69,8999,"YW",null,69,"8999","YW",null,null,null,null,null,null,null,"03A0",{"$f":"IF(FLOOR(Frame_Height/2-2.25,2)>38,38,FLOOR(Frame_Height/2-2.25,2))","v":-4},null,null,null,null,null,null,null,null,null,null,null,null,null,null,null,null,"Bottom Spacer",{"$f":"((CMR!$E$30*2)+(CMR!$E$32*2))/12","v":-1.0052083333333333},5.3600000000000002E-2,-5.3879166666666665E-2,null,null,null,{"$error":"#N/A"},{"$error":"#N/A"},{"$f":"IF(AND(AP68=22,$AN$4>=35,$AN$4<=37),AP68&\"H\",0)","v":{"$error":"#N/A"}},null,null,{"$error":"#N/A"},{"$error":"#N/A"},{"$f":"IF(AND(AU68=22,$AS$4>=35,$AS$4<=37),AU68&\"H\",0)","v":{"$error":"#N/A"}},null,null,null,null,null,null,null,null,{"$error":"#N/A"},{"$error":"#N/A"},{"$f":"IF(AND(BF68=26,$BD$4>=39,$BD$4<=42),BF68&\"H\",0)","v":{"$error":"#N/A"}},null,null,{"$error":"#N/A"},{"$error":"#N/A"},{"$f":"IF(AND(BK68=26,$BI$4>=39,$BI$4<=42),BK68&\"H\",0)","v":{"$error":"#N/A"}}]
[null,70,8999,"YW",null,70,"8999","YW",null,null,null,null,null,null,null,null,null,null,null,null,null,null,null,null,null,null,null,null,"0301","Length","Weight/ft","Weight",null,"Bottom Hardware",1,{"$f":"IF(Frame_Width>36,0.482,0.36)","v":0.36},0.36,null,null,null,{"$error":"#N/A"},{"$error":"#N/A"},{"$f":"IF(AND(AP69=22,$AN$4>=38,$AN$4<=40),AP69&\"I\",0)","v":{"$error":"#N/A"}},null,null,{"$error":"#N/A"},{"$error":"#N/A"},{"$f":"IF(AND(AU69=22,$AS$4>=38,$AS$4<=40),AU69&\"I\",0)","v":{"$error":"#N/A"}},null,null,null,null,null,null,null,null,{"$f":"IF(AND(BF69>0,BG69>0),BF69,0)","v":{"$error":"#N/A"}},{"$f":"IF(AND($BE$4<=28,$BE$4>26),28,0)","v":{"$error":"#N/A"}},{"$f":"IF(AND(BF69=28,$BD$4>=7,$BD$4<=12),BF69&\"A\",0)","v":{"$error":"#N/A"}},null,null,{"$f":"IF(AND(BK69>0,BL69>0),BK69,0)","v":{"$error":"#N/A"}},{"$f":"IF(AND($BJ$4<=28,$BJ$4>26),28,0)","v":{"$error":"#N/A"}},{"$f":"IF(AND(BK69=28,$BI$4>=7,$BI$4<=12),BK69&\"A\",0)","v":{"$error":"#N/A"}}]
[null,71,9999,"PU",null,71,"9999","PUR",null,null,null,null,null,null,null,null,null,null,null,null,null,null,null,null,null,null,null,null,"Top Top Rail",{"$f":"(Frame_Width-3.25)/12","v":-0.27083333333333331},0.25700000000000001,{"$f":"AD70*AE70","v":-6.9604166666666661E-2},null,"Bottom Bead",{"$f":"(((Frame_Width-3.3125)*2)+((CMR!$E$27-1.625)*2))/12","v":-0.82291666666666663},2.8000000000000001E-2,-2.3041666666666665E-2,null,null,null,{"$f":"IF(AND(AP70>0,AQ70>0),AP70,0)","v":{"$error":"#N/A"}},{"$f":"IF(AND($AO$4<=24,$AO$4>22),24,0)","v":{"$error":"#N/A"}},{"$f":"IF(AND(AP70=24,$AN$4>=6,$AN$4<=10),AP70&\"A\",0)","v":{"$error":"#N/A"}},null,null,{"$f":"IF(AND(AU70>0,AV70>0),AU70,0)","v":{"$error":"#N/A"}},{"$f":"IF(AND($AT$4<=24,$AT$4>22),24,0)","v":{"$error":"#N/A"}},{"$f":"IF(AND(AU70=24,$AS$4>=6,$AS$4<=10),AU70&\"A\",0)","v":{"$error":"#N/A"}},null,null,null,null,null,null,null,null,{"$error":"#N/A"},{"$error":"#N/A"},{"$f":"IF(AND(BF70=28,$BD$4>=13,$BD$4<=18),BF70&\"B\",0)","v":{"$error":"#N/A"}},null,null,{"$error":"#N/A"},{"$error":"#N/A"},{"$f":"IF(AND(BK70=28,$BI$4>=13,$BI$4<=18),BK70&\"B\",0)","v":{"$error":"#N/A"}}]
[null,72,9999,"PU",null,72,"9999","PUR",null,null,null,null,null,null,null,null,null,null,null,null,null,null,null,null,null,null,null,null,"Top Bottom Rail",{"$f":"(Frame_Width-3.25)/12","v":-0.27083333333333331},0.27300000000000002,-7.3937500000000003E-2,null,null,null,"Top Sash",{"$f":"IF(ModelNo=\"i201\",(SUM(AK52:AK60))+5,0)","v":0},null,null,null,{"$error":"#N/A"},{"$error":"#N/A"},{"$f":"IF(AND(AP71=24,$AN$4>=11,$AN$4<=17),AP71&\"B\",0)","v":{"$error":"#N/A"}},null,null,{"$error":"#N/A"},{"$error":"#N/A"},{"$f":"IF(AND(AU71=24,$AS$4>=11,$AS$4<=17),AU71&\"B\",0)","v":{"$error":"#N/A"}},null,null,null,null,null,null,null,null,{"$error":"#N/A"},{"$error":"#N/A"},{"$f":"IF(AND(BF71=28,$BD$4>=19,$BD$4<=23),BF71&\"C\",0)","v":{"$error":"#N/A"}},null,null,{"$error":"#N/A"},{"$error":"#N/A"},{"$f":"IF(AND(BK71=28,$BI$4>=19,$BI$4<=23),BK71&\"C\",0)","v":{"$error":"#N/A"}}]
[null,null,null,null,null,null,null,null,null,null,null,null,null,null,null,null,null,null,null,null,null,null,null,null,null,null,null,null,"Top Stile",{"$f":"(2*(CMR!$E$42-1.625))/12","v":-0.27083333333333331},0.23300000000000001,-6.310416666666667E-2,null,null,null,"Bottom Sash",{"$f":"IF(ModelNo=\"i201\",SUM(AK61:AK70),0)","v":0},null,null,null,{"$error":"#N/A"},{"$error":"#N/A"},{"$f":"IF(AND(AP72=24,$AN$4>=18,$AN$4<=22),AP72&\"C\",0)","v":{"$error":"#N/A"}},null,null,{"$error":"#N/A"},{"$error":"#N/A"},{"$f":"IF(AND(AU72=24,$AS$4>=18,$AS$4<=22),AU72&\"C\",0)","v":{"$error":"#N/A"}},null,null,null,null,null,null,null,null,{"$error":"#N/A"},{"$error":"#N/A"},{"$f":"IF(AND(BF72=28,$BD$4>=24,$BD$4<=28),BF72&\"D\",0)","v":{"$error":"#N/A"}},null,null,{"$error":"#N/A"},{"$error":"#N/A"},{"$f":"IF(AND(BK72=28,$BI$4>=24,$BI$4<=28),BK72&\"D\",0)","v":{"$error":"#N/A"}}]
[null,null,null,null,null,null,null,null,null,null,null,null,null,null,null,null,null,null,null,null,null,null,null,null,null,null,null,null,"Top Rail Reinf.",{"$f":"(TRUNC(((Frame_Width-3.25)-6)/2)*2)/12","v":-0.66666666666666663},0.29899999999999999,-0.19933333333333331,null,null,null,null,null,null,null,null,{"$error":"#N/A"},{"$error":"#N/A"},{"$f":"IF(AND(AP73=24,$AN$4>=23,$AN$4<=25),AP73&\"D\",0)","v":{"$error":"#N/A"}},null,null,{"$error":"#N/A"},{"$error":"#N/A"},{"$f":"IF(AND(AU73=24,$AS$4>=23,$AS$4<=25),AU73&\"D\",0)","v":{"$error":"#N/A"}},null,null,null,null,null,null,null,null,{"$error":"#N/A"},{"$error":"#N/A"},{"$f":"IF(AND(BF73=28,$BD$4>=29,$BD$4<=32),BF73&\"E\",0)","v":{"$error":"#N/A"}},null,null,{"$error":"#N/A"},{"$error":"#N/A"},{"$f":"IF(AND(BK73=28,$BI$4>=29,$BI$4<=32),BK73&\"E\",0)","v":{"$error":"#N/A"}}]
[null,4,3,1,null,4,3,1,null,null,null,null,null,null,null,false,"AC SASH CALCULATOR",null,null,null,null,null,null,null,null,null,null,null,"Top Stile Reinf",{"$f":"IF(CMR!$E$47>26.6875,((TRUNC((CMR!$E$42-9.5)/2)*2)/12)*2,0)","v":0},0.29899999999999999,0,null,null,null,null,null,null,null,null,{"$error":"#N/A"},{"$error":"#N/A"},{"$f":"IF(AND(AP74=24,$AN$4>=26,$AN$4<=28),AP74&\"E\",0)","v":{"$error":"#N/A"}},null,null,{"$error":"#N/A"},{"$error":"#N/A"},{"$f":"IF(AND(AU74=24,$AS$4>=26,$AS$4<=28),AU74&\"E\",0)","v":{"$error":"#N/A"}},null,null,null,null,null,null,null,null,{"$error":"#N/A"},{"$error":"#N/A"},{"$f":"IF(AND(BF74=28,$BD$4>=33,$BD$4<=36),BF74&\"F\",0)","v":{"$error":"#N/A"}},null,null,{"$error":"#N/A"},{"$error":"#N/A"},{"$f":"IF(AND(BK74=28,$BI$4>=33,$BI$4<=36),BK74&\"F\",0)","v":{"$error":"#N/A"}}]
[null,{"$f":"B74+1","v":5},3,1,null,5,3,1,null,null,null,null,null,null,null,"Model","Head","Sill","Center of Astragal","Top Sash Width","Sash Height","CMR",null,null,null,null,null,null,"Top Glass",{"$f":"(CMR!$E$45*CMR!$E$47)/144","v":0.11002604166666667},{"$f":"$L$12","v":""},{"$error":"#VALUE!"},null,"V100","Length","Weight/ft","Weight",null,null,null,{"$error":"#N/A"},{"$error":"#N/A"},{"$f":"IF(AND(AP75=24,$AN$4>=29,$AN$4<=30),AP75&\"F\",0)","v":{"$error":"#N/A"}},null,null,{"$error":"#N/A"},{"$error":"#N/A"},{"$f":"IF(AND(AU75=24,$AS$4>=29,$AS$4<=30),AU75&\"F\",0)","v":{"$error":"#N/A"}},null,null,null,null,null,null,null,null,{"$error":"#N/A"},{"$error":"#N/A"},{"$f":"IF(AND(BF75=28,$BD$4>=37,$BD$4<=40),BF75&\"G\",0)","v":{"$error":"#N/A"}},null,null,{"$error":"#N/A"},{"$error":"#N/A"},{"$f":"IF(AND(BK75=28,$BI$4>=37,$BI$4<=40),BK75&\"G\",0)","v":{"$error":"#N/A"}}]
[null,6,3,1,null,6,3,1,null,null,null,null,null,null,null,{"$f":"ModelNo","v":"Select Model"},{"$f":"IF(ISERROR(VLOOKUP(ModelNo,ACTABLE,2,FALSE)),\"\",VLOOKUP(ModelNo,ACTABLE,2,FALSE))","v":""},{"$f":"IF(ISERROR(VLOOKUP(ModelNo,ACTABLE,3,FALSE)),\"\",VLOOKUP(ModelNo,ACTABLE,3,FALSE))","v":""},{"$f":"IF(ISERROR(VLOOKUP(ModelNo,ACTABLE,4,FALSE)),\"\",VLOOKUP(ModelNo,ACTABLE,4,FALSE))","v":""},{"$f":"IF(ISERROR(VLOOKUP(ModelNo,ACTABLE,5,FALSE)),\"\",VLOOKUP(ModelNo,ACTABLE,5,FALSE))","v":""},{"$f":"IF(ISERROR(VLOOKUP(ModelNo,ACTABLE,6,FALSE)),\"\",VLOOKUP(ModelNo,ACTABLE,6,FALSE))","v":""},{"$f":"IF(ISERROR(VLOOKUP(ModelNo,ACTABLE,7,FALSE)),\"\",VLOOKUP(ModelNo,ACTABLE,7,FALSE))","v":""},null,null,null,null,null,null,"Top Spacer",{"$f":"((CMR!$E$45*2)+(CMR!$E$47*2))/12","v":-1.3541666666666667},5.3600000000000002E-2,-7.2583333333333333E-2,null,"Top Top Rail",0,0,{"$f":"AI76*AJ76","v":0},null,null,null,{"$error":"#N/A"},{"$error":"#N/A"},{"$f":"IF(AND(AP76=24,$AN$4>=31,$AN$4<=34),AP76&\"G\",0)","v":{"$error":"#N/A"}},null,null,{"$error":"#N/A"},{"$error":"#N/A"},{"$f":"IF(AND(AU76=24,$AS$4>=31,$AS$4<=34),AU76&\"G\",0)","v":{"$error":"#N/A"}},null,null,null,null,null,null,null,null,{"$error":"#N/A"},{"$error":"#N/A"},{"$f":"IF(AND(BF76=28,$BD$4>=41,$BD$4<=43),BF76&\"H\",0)","v":{"$error":"#N/A"}},null,null,{"$error":"#N/A"},{"$error":"#N/A"},{"$f":"IF(AND(BK76=28,$BI$4>=41,$BI$4<=43),BK76&\"H\",0)","v":{"$error":"#N/A"}}]
[null,7,4,1,null,7,4,1,null,null,null,null,null,null,null,"0100",null,1.5369999999999999,2.5583,{"$f":"Frame_Width-2.3125","v":-2.3125},null,{"$f":"INT((Frame_Height-(R77+0.5+ACHEIGHT+S77))*16+0.5)/16","v":-4.625},null,null,null,null,null,null,"Top Hardware",1,0.2,0.2,null,"Top Bottom Rail",0,0,0,null,null,null,{"$error":"#N/A"},{"$error":"#N/A"},{"$f":"IF(AND(AP77=24,$AN$4>=35,$AN$4<=37),AP77&\"H\",0)","v":{"$error":"#N/A"}},null,null,{"$error":"#N/A"},{"$error":"#N/A"},{"$f":"IF(AND(AU77=24,$AS$4>=35,$AS$4<=37),AU77&\"H\",0)","v":{"$error":"#N/A"}},null,null,null,null,null,null,null,null,{"$error":"#N/A"},{"$error":"#N/A"},{"$f":"IF(AND(BF77=28,$BD$4>=44,$BD$4<=45),BF77&\"I\",0)","v":{"$error":"#N/A"}},null,null,{"$error":"#N/A"},{"$error":"#N/A"},{"$f":"IF(AND(BK77=28,$BI$4>=44,$BI$4<=45),BK77&\"I\",0)","v":{"$error":"#N/A"}}]
[null,8,4,1,null,8,4,1,null,null,null,null,null,null,null,"01HP",null,1.5369999999999999,2.6833,{"$f":"Frame_Width-2.3125","v":-2.3125},null,{"$f":"INT((Frame_Height-(R78+0.5+ACHEIGHT+S78))*16+0.5)/16","v":-4.75},null,null,null,null,null,null,"Top Bead",{"$f":"(((Frame_Width-4.3125)*2)+((CMR!$E$42-2.6875)*2))/12","v":-1.1666666666666667},2.8000000000000001E-2,-3.266666666666667E-2,null,"Top Stile",0,0,0,null,null,null,{"$error":"#N/A"},{"$error":"#N/A"},{"$f":"IF(AND(AP78=24,$AN$4>=38,$AN$4<=40),AP78&\"I\",0)","v":{"$error":"#N/A"}},null,null,{"$error":"#N/A"},{"$error":"#N/A"},{"$f":"IF(AND(AU78=24,$AS$4>=38,$AS$4<=40),AU78&\"I\",0)","v":{"$error":"#N/A"}},null,null,null,null,null,null,null,null,{"$error":"#N/A"},{"$f":"IF(AND($BE$4<=30,$BE$4>28),30,0)","v":{"$error":"#N/A"}},{"$f":"IF(AND(BF78=30,$BD$4>=8,$BD$4<=13),BF78&\"A\",0)","v":{"$error":"#N/A"}},null,null,{"$error":"#N/A"},{"$f":"IF(AND($BJ$4<=30,$BJ$4>28),30,0)","v":{"$error":"#N/A"}},{"$f":"IF(AND(BK78=30,$BI$4>=8,$BI$4<=13),BK78&\"A\",0)","v":{"$error":"#N/A"}}]
[null,9,5,1,null,9,5,1,null,null,null,null,null,null,null,"02A0",null,1.75,2.875,{"$f":"Frame_Width-2.25","v":-2.25},null,{"$f":"INT((Frame_Height-(R79+0.5+ACHEIGHT+S79))*16+0.5)/16","v":-5.125},null,null,null,null,null,null,"Bottom Top Rail",{"$f":"(Frame_Width-2.25)/12","v":-0.1875},0.246,-4.6124999999999999E-2,null,"Top Rail Reinf.",0,0,0,null,null,null,{"$error":"#N/A"},{"$f":"IF(AND($AO$4<=26,$AO$4>24),26,0)","v":{"$error":"#N/A"}},{"$f":"IF(AND(AP79=26,$AN$4>=6,$AN$4<=11),AP79&\"A\",0)","v":{"$error":"#N/A"}},null,null,{"$error":"#N/A"},{"$f":"IF(AND($AT$4<=26,$AT$4>24),26,0)","v":{"$error":"#N/A"}},{"$f":"IF(AND(AU79=26,$AS$4>=6,$AS$4<=11),AU79&\"A\",0)","v":{"$error":"#N/A"}},null,null,null,null,null,null,null,null,{"$error":"#N/A"},{"$error":"#N/A"},{"$f":"IF(AND(BF79=30,$BD$4>=14,$BD$4<=19),BF79&\"B\",0)","v":{"$error":"#N/A"}},null,null,{"$error":"#N/A"},{"$error":"#N/A"},{"$f":"IF(AND(BK79=30,$BI$4>=14,$BI$4<=19),BK79&\"B\",0)","v":{"$error":"#N/A"}}]
[null,10,5,1,null,10,5,1,null,null,null,null,null,null,null,"0201",1.625,1.75,null,{"$f":"Frame_Width-3.25","v":-3.25},{"$f":"INT((Frame_Height-(Q80+R80+0.5+ACHEIGHT))*16+0.5)/16","v":-3.875},null,null,null,null,null,null,null,"Bottom Bottom Rail",{"$f":"(Frame_Width-2.25)/12","v":-0.1875},0.25700000000000001,-4.8187500000000001E-2,null,"Top Stile Reinf",0,0,0,null,null,null,{"$error":"#N/A"},{"$error":"#N/A"},{"$f":"IF(AND(AP80=26,$AN$4>=12,$AN$4<=17),AP80&\"B\",0)","v":{"$error":"#N/A"}},null,null,{"$error":"#N/A"},{"$error":"#N/A"},{"$f":"IF(AND(AU80=26,$AS$4>=12,$AS$4<=17),AU80&\"B\",0)","v":{"$error":"#N/A"}},null,null,null,null,null,null,null,null,{"$error":"#N/A"},{"$error":"#N/A"},{"$f":"IF(AND(BF80=30,$BD$4>=20,$BD$4<=24),BF80&\"C\",0)","v":{"$error":"#N/A"}},null,null,{"$error":"#N/A"},{"$error":"#N/A"},{"$f":"IF(AND(BK80=30,$BI$4>=20,$BI$4<=24),BK80&\"C\",0)","v":{"$error":"#N/A"}}]
[null,11,6,1,null,11,6,1,null,null,null,null,null,null,null,"L201",1.625,1.75,null,{"$f":"Frame_Width-3.25","v":-3.25},-3.875,null,null,null,null,null,null,null,"Bottom Stile",{"$f":"(2*(CMR!$E$43-0.625))/12","v":-0.10416666666666667},0.23300000000000001,-2.4270833333333335E-2,null,"Top Glass",0,0,0,null,null,null,{"$error":"#N/A"},{"$error":"#N/A"},{"$f":"IF(AND(AP81=26,$AN$4>=18,$AN$4<=22),AP81&\"C\",0)","v":{"$error":"#N/A"}},null,null,{"$error":"#N/A"},{"$error":"#N/A"},{"$f":"IF(AND(AU81=26,$AS$4>=18,$AS$4<=22),AU81&\"C\",0)","v":{"$error":"#N/A"}},null,null,null,null,null,null,null,null,{"$error":"#N/A"},{"$error":"#N/A"},{"$f":"IF(AND(BF81=30,$BD$4>=25,$BD$4<=29),BF81&\"D\",0)","v":{"$error":"#N/A"}},null,null,{"$error":"#N/A"},{"$error":"#N/A"},{"$f":"IF(AND(BK81=30,$BI$4>=25,$BI$4<=29),BK81&\"D\",0)","v":{"$error":"#N/A"}}]
[null,12,6,1,null,12,6,1,null,null,null,null,null,null,null,"i201",1.625,1.75,null,{"$f":"Frame_Width-3.25","v":-3.25},-3.875,null,null,null,null,null,null,null,"Bottom Rail Reinf.",{"$f":"(TRUNC(((Frame_Width-2.25)-6)/2)*2)/12","v":-0.66666666666666663},0.37,-0.24666666666666665,null,"Top Spacer",0,0,0,null,null,null,{"$error":"#N/A"},{"$error":"#N/A"},{"$f":"IF(AND(AP82=26,$AN$4>=23,$AN$4<=26),AP82&\"D\",0)","v":{"$error":"#N/A"}},null,null,{"$error":"#N/A"},{"$error":"#N/A"},{"$f":"IF(AND(AU82=26,$AS$4>=23,$AS$4<=26),AU82&\"D\",0)","v":{"$error":"#N/A"}},null,null,null,null,null,null,null,null,{"$error":"#N/A"},{"$error":"#N/A"},{"$f":"IF(AND(BF82=30,$BD$4>=30,$BD$4<=33),BF82&\"E\",0)","v":{"$error":"#N/A"}},null,null,{"$error":"#N/A"},{"$error":"#N/A"},{"$f":"IF(AND(BK82=30,$BI$4>=30,$BI$4<=33),BK82&\"E\",0)","v":{"$error":"#N/A"}}]
[null,13,7,1,null,13,7,1,null,null,null,null,null,null,null,"0301",1.75,2.0625,null,{"$f":"Frame_Width-3.25","v":-3.25},-4.3125,null,null,null,null,null,null,null,"Bottom Stile Reinf.",{"$f":"IF(CMR!$E$48>27.6875,((TRUNC((CMR!$E$43-4.5)/2)*2)/12)*2,0)","v":0},0.29899999999999999,0,null,"Top Hardware",0,0,0,null,null,null,{"$error":"#N/A"},{"$error":"#N/A"},{"$f":"IF(AND(AP83=26,$AN$4>=27,$AN$4<=30),AP83&\"E\",0)","v":{"$error":"#N/A"}},null,null,{"$error":"#N/A"},{"$error":"#N/A"},{"$f":"IF(AND(AU83=26,$AS$4>=27,$AS$4<=30),AU83&\"E\",0)","v":{"$error":"#N/A"}},null,null,null,null,null,null,null,null,{"$error":"#N/A"},{"$error":"#N/A"},{"$f":"IF(AND(BF83=30,$BD$4>=34,$BD$4<=37),BF83&\"F\",0)","v":{"$error":"#N/A"}},null,null,{"$error":"#N/A"},{"$error":"#N/A"},{"$f":"IF(AND(BK83=30,$BI$4>=34,$BI$4<=37),BK83&\"F\",0)","v":{"$error":"#N/A"}}]
[null,14,7,1,null,14,7,1,null,null,null,null,null,null,null,"0401",1.125,2,null,{"$f":"Frame_Width-3.25","v":-3.25},-3.625,null,null,null,null,null,null,null,"Bottom Glass",{"$f":"(CMR!$E$46*CMR!$E$48)/144","v":6.0546875E-2},{"$f":"$L$12","v":""},{"$error":"#VALUE!"},null,"Top Bead",0,0,0,null,null,null,{"$error":"#N/A"},{"$error":"#N/A"},{"$f":"IF(AND(AP84=26,$AN$4>=31,$AN$4<=34),AP84&\"F\",0)","v":{"$error":"#N/A"}},null,null,{"$error":"#N/A"},{"$error":"#N/A"},{"$f":"IF(AND(AU84=26,$AS$4>=31,$AS$4<=34),AU84&\"F\",0)","v":{"$error":"#N/A"}},null,null,null,null,null,null,null,null,{"$error":"#N/A"},{"$error":"#N/A"},{"$f":"IF(AND(BF84=30,$BD$4>=38,$BD$4<=40),BF84&\"G\",0)","v":{"$error":"#N/A"}},null,null,{"$error":"#N/A"},{"$error":"#N/A"},{"$f":"IF(AND(BK84=30,$BI$4>=38,$BI$4<=40),BK84&\"G\",0)","v":{"$error":"#N/A"}}]
[null,15,8,1,null,15,8,1,null,null,null,null,null,null,null,{"$f":"IF(ModelNo=\"B501\",\"B501\",\"0501\")","v":"0501"},2.25,3,null,{"$f":"Frame_Width-4.25","v":-4.25},-5.75,null,null,null,null,null,null,null,"Bottom Spacer",{"$f":"((CMR!$E$46*2)+(CMR!$E$48*2))/12","v":-1.0208333333333333},5.3600000000000002E-2,-5.4716666666666663E-2,null,"Bottom Top Rail",{"$f":"(Frame_Width-2.1875)/12","v":-0.18229166666666666},0.224,-4.0833333333333333E-2,null,null,null,{"$error":"#N/A"},{"$error":"#N/A"},{"$f":"IF(AND(AP85=26,$AN$4>=35,$AN$4<=38),AP85&\"G\",0)","v":{"$error":"#N/A"}},null,null,{"$error":"#N/A"},{"$error":"#N/A"},{"$f":"IF(AND(AU85=26,$AS$4>=35,$AS$4<=38),AU85&\"G\",0)","v":{"$error":"#N/A"}},null,null,null,null,null,null,null,null,{"$error":"#N/A"},{"$error":"#N/A"},{"$f":"IF(AND(BF85=30,$BD$4>=41,$BD$4<=43),BF85&\"H\",0)","v":{"$error":"#N/A"}},null,null,{"$error":"#N/A"},{"$error":"#N/A"},{"$f":"IF(AND(BK85=30,$BI$4>=41,$BI$4<=43),BK85&\"H\",0)","v":{"$error":"#N/A"}}]
[null,16,8,1,null,16,8,1,null,null,null,null,null,null,null,"0601",2.375,2.75,null,{"$f":"Frame_Width-4.25","v":-4.25},-5.625,null,null,null,null,null,null,null,"Bottom Hardware",1,0.36,0.36,null,"Bottom Bottom Rail",{"$f":"(Frame_Width-2.1875)/12","v":-0.18229166666666666},0.19900000000000001,-3.6276041666666668E-2,null,null,null,{"$error":"#N/A"},{"$error":"#N/A"},{"$f":"IF(AND(AP86=26,$AN$4>=39,$AN$4<=42),AP86&\"H\",0)","v":{"$error":"#N/A"}},null,null,{"$error":"#N/A"},{"$error":"#N/A"},{"$f":"IF(AND(AU86=26,$AS$4>=39,$AS$4<=42),AU86&\"H\",0)","v":{"$error":"#N/A"}},null,null,null,null,null,null,null,null,{"$error":"#N/A"},{"$error":"#N/A"},{"$f":"IF(AND(BF86=30,$BD$4>=44,$BD$4<=45),BF86&\"I\",0)","v":{"$error":"#N/A"}},null,null,{"$error":"#N/A"},{"$error":"#N/A"},{"$f":"IF(AND(BK86=30,$BI$4>=44,$BI$4<=45),BK86&\"I\",0)","v":{"$error":"#N/A"}}]
[null,17,9,1,null,17,9,1,null,null,null,null,null,null,null,"0700",null,1.5369999999999999,2.5625,{"$f":"Frame_Width-2.3125","v":-2.3125},null,{"$f":"INT((Frame_Height-(R87+0.5+ACHEIGHT+S87))*16+0.5)/16","v":-4.625},null,null,null,null,null,null,"Bottom Bead",{"$f":"(((Frame_Width-3.3125)*2)+((CMR!$E$43-1.6875)*2))/12","v":-0.83333333333333337},2.8000000000000001E-2,-2.3333333333333334E-2,null,"Bottom Stile",{"$f":"((V100_CDIM-0.844)*2)/12","v":-0.14066666666666666},0.19900000000000001,-2.7992666666666666E-2,null,null,null,{"$error":"#N/A"},{"$error":"#N/A"},{"$f":"IF(AND(AP87=26,$AN$4>=43,$AN$4<=45),AP87&\"I\",0)","v":{"$error":"#N/A"}},null,null,{"$error":"#N/A"},{"$error":"#N/A"},{"$f":"IF(AND(AU87=26,$AS$4>=43,$AS$4<=45),AU87&\"I\",0)","v":{"$error":"#N/A"}},null,null,null,null,null,null,null,null,{"$error":"#N/A"},{"$f":"IF(AND($BE$4<=32,$BE$4>30),32,0)","v":{"$error":"#N/A"}},{"$f":"IF(AND(BF87=32,$BD$4>=8,$BD$4<=14),BF87&\"A\",0)","v":{"$error":"#N/A"}},null,null,{"$error":"#N/A"},{"$f":"IF(AND($BJ$4<=32,$BJ$4>30),32,0)","v":{"$error":"#N/A"}},{"$f":"IF(AND(BK87=32,$BI$4>=8,$BI$4<=14),BK87&\"A\",0)","v":{"$error":"#N/A"}}]
[null,18,9,1,null,18,9,1,null,null,null,null,null,null,null,"07HP",null,1.5369999999999999,2.6875,{"$f":"Frame_Width-2.3125","v":-2.3125},null,{"$f":"INT((Frame_Height-(R88+0.5+ACHEIGHT+S88))*16+0.5)/16","v":-4.75},null,null,null,null,null,null,null,null,"Top Sash",{"$f":"IF(OR(ModelNo=\"0301\",ModelNo=\"E301(3250)\",ModelNo=\"E301(3052)\",ModelNo=\"E301(2862)\"),(SUM(AF70:AF78))+5,0)","v":0},null,"Bottom Rail Reinf.",{"$f":"(TRUNC(((Frame_Width-8.188)-0.5)/2)*2)/12","v":-0.66666666666666663},0.13300000000000001,-8.8666666666666671E-2,null,null,null,{"$error":"#N/A"},{"$f":"IF(AND($AO$4<=28,$AO$4>26),28,0)","v":{"$error":"#N/A"}},{"$f":"IF(AND(AP88=28,$AN$4>=6,$AN$4<=12),AP88&\"A\",0)","v":{"$error":"#N/A"}},null,null,{"$error":"#N/A"},{"$f":"IF(AND($AT$4<=28,$AT$4>26),28,0)","v":{"$error":"#N/A"}},{"$f":"IF(AND(AU88=28,$AS$4>=6,$AS$4<=12),AU88&\"A\",0)","v":{"$error":"#N/A"}},null,null,null,null,null,null,null,null,{"$error":"#N/A"},{"$error":"#N/A"},{"$f":"IF(AND(BF88=32,$BD$4>=15,$BD$4<=20),BF88&\"B\",0)","v":{"$error":"#N/A"}},null,null,{"$error":"#N/A"},{"$error":"#N/A"},{"$f":"IF(AND(BK88=32,$BI$4>=15,$BI$4<=20),BK88&\"B\",0)","v":{"$error":"#N/A"}}]
[null,19,10,1,null,19,55,2,null,null,null,null,null,null,null,"0901",1.4375,2.125,null,{"$f":"Frame_Width-3.4375","v":-3.4375},{"$f":"INT((Frame_Height-(Q89+R89+0.5+ACHEIGHT))*16+0.5)/16","v":-4.0625},null,null,null,null,null,null,null,null,null,"Bottom Sash",{"$f":"IF(OR(ModelNo=\"0301\",ModelNo=\"E301(3250)\",ModelNo=\"E301(3052)\",ModelNo=\"E301(2862)\"),SUM(AF79:AF87),0)","v":0},null,"Bottom Stile Reinf.",{"$f":"(TRUNC((((V100_CDIM-0.844)-1.46875)-0.25)/2)*2)/12","v":-0.16666666666666666},0.10100000000000001,-1.6833333333333332E-2,null,null,null,{"$error":"#N/A"},{"$error":"#N/A"},{"$f":"IF(AND(AP89=28,$AN$4>=13,$AN$4<=18),AP89&\"B\",0)","v":{"$error":"#N/A"}},null,null,{"$error":"#N/A"},{"$error":"#N/A"},{"$f":"IF(AND(AU89=28,$AS$4>=13,$AS$4<=18),AU89&\"B\",0)","v":{"$error":"#N/A"}},null,null,null,null,null,null,null,null,{"$error":"#N/A"},{"$error":"#N/A"},{"$f":"IF(AND(BF89=32,$BD$4>=21,$BD$4<=25),BF89&\"C\",0)","v":{"$error":"#N/A"}},null,null,{"$error":"#N/A"},{"$error":"#N/A"},{"$f":"IF(AND(BK89=32,$BI$4>=21,$BI$4<=25),BK89&\"C\",0)","v":{"$error":"#N/A"}}]
[null,20,10,1,null,20,55,2,null,null,null,null,null,null,null,"09L1",1.4375,2.125,null,{"$f":"Frame_Width-3.4375","v":-3.4375},{"$f":"INT((Frame_Height-(Q90+R90+0.5+ACHEIGHT))*16+0.5)/16","v":-4.0625},null,null,null,null,null,null,null,null,null,null,null,null,"Bottom Glass",{"$f":"(V100_BGW*V100_BGH)/144","v":5.4456922743055552E-2},{"$f":"$L$12","v":""},{"$error":"#VALUE!"},null,null,null,{"$error":"#N/A"},{"$error":"#N/A"},{"$f":"IF(AND(AP90=28,$AN$4>=19,$AN$4<=23),AP90&\"C\",0)","v":{"$error":"#N/A"}},null,null,{"$error":"#N/A"},{"$error":"#N/A"},{"$f":"IF(AND(AU90=28,$AS$4>=19,$AS$4<=23),AU90&\"C\",0)","v":{"$error":"#N/A"}},null,null,null,null,null,null,null,null,{"$error":"#N/A"},{"$error":"#N/A"},{"$f":"IF(AND(BF90=32,$BD$4>=26,$BD$4<=30),BF90&\"D\",0)","v":{"$error":"#N/A"}},null,null,{"$error":"#N/A"},{"$error":"#N/A"},{"$f":"IF(AND(BK90=32,$BI$4>=26,$BI$4<=30),BK90&\"D\",0)","v":{"$error":"#N/A"}}]
[null,21,56,2,null,21,47,2,null,null,null,null,null,null,null,"8001",2.5,2.5,null,{"$f":"Frame_Width-4.9375","v":-4.9375},{"$f":"INT((Frame_Height-(Q91+R91+0.5+ACHEIGHT))*16+0.5)/16","v":-5.5},null,null,null,null,null,null,null,"0501","Length","Weight/ft","Weight",null,"Bottom Spacer",{"$f":"((V100_BGW*2)+(V100_BGH*2))/12","v":-0.953125},5.3600000000000002E-2,-5.1087500000000001E-2,null,null,null,{"$error":"#N/A"},{"$error":"#N/A"},{"$f":"IF(AND(AP91=28,$AN$4>=24,$AN$4<=28),AP91&\"D\",0)","v":{"$error":"#N/A"}},null,null,{"$error":"#N/A"},{"$error":"#N/A"},{"$f":"IF(AND(AU91=28,$AS$4>=24,$AS$4<=28),AU91&\"D\",0)","v":{"$error":"#N/A"}},null,null,null,null,null,null,null,null,{"$error":"#N/A"},{"$error":"#N/A"},{"$f":"IF(AND(BF91=32,$BD$4>=31,$BD$4<=34),BF91&\"E\",0)","v":{"$error":"#N/A"}},null,null,{"$error":"#N/A"},{"$error":"#N/A"},{"$f":"IF(AND(BK91=32,$BI$4>=31,$BI$4<=34),BK91&\"E\",0)","v":{"$error":"#N/A"}}]
[null,22,56,2,null,22,47,2,null,null,null,null,null,null,null,"R601",2.5,2.5,null,{"$f":"Frame_Width-4.9375","v":-4.9375},{"$f":"INT((Frame_Height-(Q92+R92+0.5+ACHEIGHT))*16+0.5)/16","v":-5.5},null,null,null,null,null,null,null,"Top Top Rail",{"$f":"(Frame_Width-4.25)/12","v":-0.35416666666666669},0.36899999999999999,{"$f":"AD92*AE92","v":-0.13068750000000001},null,"Bottom Hardware",1,0.36,0.36,null,null,null,{"$error":"#N/A"},{"$error":"#N/A"},{"$f":"IF(AND(AP92=28,$AN$4>=29,$AN$4<=32),AP92&\"E\",0)","v":{"$error":"#N/A"}},null,null,{"$error":"#N/A"},{"$error":"#N/A"},{"$f":"IF(AND(AU92=28,$AS$4>=29,$AS$4<=32),AU92&\"E\",0)","v":{"$error":"#N/A"}},null,null,null,null,null,null,null,null,{"$error":"#N/A"},{"$error":"#N/A"},{"$f":"IF(AND(BF92=32,$BD$4>=35,$BD$4<=37),BF92&\"F\",0)","v":{"$error":"#N/A"}},null,null,{"$error":"#N/A"},{"$error":"#N/A"},{"$f":"IF(AND(BK92=32,$BI$4>=35,$BI$4<=37),BK92&\"F\",0)","v":{"$error":"#N/A"}}]
[null,23,66,2,null,23,48,2,null,null,null,null,null,null,null,"S140",null,{"$f":"IF(OR(EXTSELECT=2,EXTSELECT=3),1.875,IF(OR(EXTSELECT=4,EXTSELECT=5),1.537,IF(EXTSELECT=7,1.818,IF(EXTSELECT=8,2,1.75))))","v":1.75},2.5583,{"$f":"IF(EXTSELECT=2,Frame_Width-2.25,Frame_Width-2.3125)","v":-2.3125},null,{"$f":"IF(EXTSELECT=2,INT((Frame_Height-(R93+0.5+ACHEIGHT+S93))*16+0.5)/16,INT((Frame_Height-(R93+0.5+ACHEIGHT+S93))*16+0.5)/16)","v":-4.8125},null,null,null,null,null,null,"Top Bottom Rail",{"$f":"(Frame_Width-4.25)/12","v":-0.35416666666666669},0.36899999999999999,-0.13068750000000001,null,"Bottom Bead",{"$f":"(((Frame_Width-2.9375)*2)+((V100_CDIM-1.625)*2))/12","v":-0.76041666666666663},2.1000000000000001E-2,-1.596875E-2,null,null,null,{"$error":"#N/A"},{"$error":"#N/A"},{"$f":"IF(AND(AP93=28,$AN$4>=33,$AN$4<=36),AP93&\"F\",0)","v":{"$error":"#N/A"}},null,null,{"$error":"#N/A"},{"$error":"#N/A"},{"$f":"IF(AND(AU93=28,$AS$4>=33,$AS$4<=36),AU93&\"F\",0)","v":{"$error":"#N/A"}},null,null,null,null,null,null,null,null,{"$error":"#N/A"},{"$error":"#N/A"},{"$f":"IF(AND(BF93=32,$BD$4>=38,$BD$4<=40),BF93&\"G\",0)","v":{"$error":"#N/A"}},null,null,{"$error":"#N/A"},{"$error":"#N/A"},{"$f":"IF(AND(BK93=32,$BI$4>=38,$BI$4<=40),BK93&\"G\",0)","v":{"$error":"#N/A"}}]
[null,24,66,2,null,24,48,2,null,null,null,null,null,null,null,"S144",null,{"$f":"IF(OR(EXTSELECT=2,EXTSELECT=3),1.875,IF(OR(EXTSELECT=4,EXTSELECT=5),1.537,IF(EXTSELECT=7,1.818,IF(EXTSELECT=8,2,1.75))))","v":1.75},2.5583,{"$f":"IF(EXTSELECT=2,Frame_Width-2.25,Frame_Width-2.3125)","v":-2.3125},null,{"$f":"IF(EXTSELECT=2,INT((Frame_Height-(R94+0.5+ACHEIGHT+S94))*16+0.5)/16,INT((Frame_Height-(R94+0.5+ACHEIGHT+S94))*16+0.5)/16)","v":-4.8125},null,null,null,null,null,null,"Top Stile",{"$f":"(2*(CMR!$L$42-2.25))/12","v":-0.375},0.36899999999999999,-0.138375,null,null,null,"Top Sash",0,null,null,null,{"$error":"#N/A"},{"$error":"#N/A"},{"$f":"IF(AND(AP94=28,$AN$4>=37,$AN$4<=40),AP94&\"G\",0)","v":{"$error":"#N/A"}},null,null,{"$error":"#N/A"},{"$error":"#N/A"},{"$f":"IF(AND(AU94=28,$AS$4>=37,$AS$4<=40),AU94&\"G\",0)","v":{"$error":"#N/A"}},null,null,null,null,null,null,null,null,{"$error":"#N/A"},{"$error":"#N/A"},{"$f":"IF(AND(BF94=32,$BD$4>=41,$BD$4<=43),BF94&\"H\",0)","v":{"$error":"#N/A"}},null,null,{"$error":"#N/A"},{"$error":"#N/A"},{"$f":"IF(AND(BK94=32,$BI$4>=41,$BI$4<=43),BK94&\"H\",0)","v":{"$error":"#N/A"}}]
[null,25,67,2,null,25,58,2,null,null,null,null,null,null,null,"S146",null,{"$f":"IF(OR(EXTSELECT=2,EXTSELECT=3),1.875,IF(OR(EXTSELECT=4,EXTSELECT=5),1.537,IF(EXTSELECT=7,1.818,IF(EXTSELECT=8,2,1.75))))","v":1.75},2.5583,{"$f":"IF(EXTSELECT=2,Frame_Width-2.25,Frame_Width-2.3125)","v":-2.3125},null,{"$f":"IF(EXTSELECT=2,INT((Frame_Height-(R95+0.5+ACHEIGHT+S95))*16+0.5)/16,INT((Frame_Height-(R95+0.5+ACHEIGHT+S95))*16+0.5)/16)","v":-4.8125},null,null,null,null,null,null,"Top Rail Reinf.",{"$f":"(TRUNC(((Frame_Width-4.25)-6)/2)*2)/12","v":-0.83333333333333337},0.26400000000000001,-0.22000000000000003,null,null,null,"Bottom Sash",{"$f":"IF(ModelNo=\"V100\",SUM(AK85:AK93),0)","v":0},null,null,null,{"$error":"#N/A"},{"$error":"#N/A"},{"$f":"IF(AND(AP95=28,$AN$4>=41,$AN$4<=43),AP95&\"H\",0)","v":{"$error":"#N/A"}},null,null,{"$error":"#N/A"},{"$error":"#N/A"},{"$f":"IF(AND(AU95=28,$AS$4>=41,$AS$4<=43),AU95&\"H\",0)","v":{"$error":"#N/A"}},null,null,null,null,null,null,null,null,{"$error":"#N/A"},{"$error":"#N/A"},{"$f":"IF(AND(BF95=32,$BD$4>=44,$BD$4<=45),BF95&\"I\",0)","v":{"$error":"#N/A"}},null,null,{"$error":"#N/A"},{"$error":"#N/A"},{"$f":"IF(AND(BK95=32,$BI$4>=44,$BI$4<=45),BK95&\"I\",0)","v":{"$error":"#N/A"}}]
[null,26,67,2,null,26,58,2,null,null,null,null,null,null,null,"3100",null,2.4300000000000002,4.375,{"$f":"TRUNC((Frame_Width-2.14315)*32+0.5)/32","v":-2.125},null,{"$f":"INT((Frame_Height-(R96+0.5+ACHEIGHT+S96))*16+0.5)/16","v":-7.3125},null,null,null,null,null,null,"Top Stile Reinf",{"$f":"IF(CMR!$L$47>26.1875,((TRUNC((CMR!$L$43-10)/2)*2)/12)*2,0)","v":0},0.26400000000000001,0,null,null,null,null,null,null,null,null,{"$error":"#N/A"},{"$error":"#N/A"},{"$f":"IF(AND(AP96=28,$AN$4>=44,$AN$4<=45),AP96&\"I\",0)","v":{"$error":"#N/A"}},null,null,{"$error":"#N/A"},{"$error":"#N/A"},{"$f":"IF(AND(AU96=28,$AS$4>=44,$AS$4<=45),AU96&\"I\",0)","v":{"$error":"#N/A"}},null,null,null,null,null,null,null,null,{"$error":"#N/A"},{"$f":"IF(AND($BE$4<=34,$BE$4>32),34,0)","v":{"$error":"#N/A"}},{"$f":"IF(AND(BF96=34,$BD$4>=11,$BD$4<=16),BF96&\"A\",0)","v":{"$error":"#N/A"}},null,null,{"$error":"#N/A"},{"$f":"IF(AND($BJ$4<=34,$BJ$4>32),34,0)","v":{"$error":"#N/A"}},{"$f":"IF(AND(BK96=34,$BI$4>=11,$BI$4<=16),BK96&\"A\",0)","v":{"$error":"#N/A"}}]
[null,27,77,2,null,27,68,2,null,null,null,null,null,null,null,9001,2.5,2.75,null,{"$f":"Frame_Width-4.9375","v":-4.9375},{"$f":"INT((Frame_Height-(Q97+R97+0.5+ACHEIGHT))*16+0.5)/16","v":-5.75},null,null,null,null,null,null,null,"Top Glass",{"$f":"(CMR!$L$45*CMR!$L$47)/144","v":0.17103407118055555},{"$f":"$L$12","v":""},{"$error":"#VALUE!"},null,"V101","Length","Weight/ft","Weight",null,null,null,{"$error":"#N/A"},{"$f":"IF(AND($AO$4<=30,$AO$4>28),30,0)","v":{"$error":"#N/A"}},{"$f":"IF(AND(AP97=30,$AN$4>=8,$AN$4<=13),AP97&\"A\",0)","v":{"$error":"#N/A"}},null,null,{"$error":"#N/A"},{"$f":"IF(AND($AT$4<=30,$AT$4>28),30,0)","v":{"$error":"#N/A"}},{"$f":"IF(AND(AU97=30,$AS$4>=8,$AS$4<=13),AU97&\"A\",0)","v":{"$error":"#N/A"}},null,null,null,null,null,null,null,null,{"$error":"#N/A"},{"$error":"#N/A"},{"$f":"IF(AND(BF97=34,$BD$4>=17,$BD$4<=22),BF97&\"B\",0)","v":{"$error":"#N/A"}},null,null,{"$error":"#N/A"},{"$error":"#N/A"},{"$f":"IF(AND(BK97=34,$BI$4>=17,$BI$4<=22),BK97&\"B\",0)","v":{"$error":"#N/A"}}]
[null,28,77,2,null,28,68,2,null,null,null,null,null,null,null,"P601",2.5,2.75,null,{"$f":"Frame_Width-4.9375","v":-4.9375},{"$f":"INT((Frame_Height-(Q98+R98+0.5+ACHEIGHT))*16+0.5)/16","v":-5.75},null,null,null,null,null,null,null,"Top Spacer",{"$f":"((CMR!$L$45*2)+(CMR!$L$47*2))/12","v":-1.6875},5.3600000000000002E-2,-9.0450000000000003E-2,null,"Top Top Rail",{"$f":"(Frame_Width-3.4375)/12","v":-0.28645833333333331},0.20799999999999999,{"$f":"AI98*AJ98","v":-5.9583333333333328E-2},null,null,null,{"$error":"#N/A"},{"$error":"#N/A"},{"$f":"IF(AND(AP98=30,$AN$4>=14,$AN$4<=19),AP98&\"B\",0)","v":{"$error":"#N/A"}},null,null,{"$error":"#N/A"},{"$error":"#N/A"},{"$f":"IF(AND(AU98=30,$AS$4>=14,$AS$4<=19),AU98&\"B\",0)","v":{"$error":"#N/A"}},null,null,null,null,null,null,null,null,{"$error":"#N/A"},{"$error":"#N/A"},{"$f":"IF(AND(BF98=34,$BD$4>=23,$BD$4<=27),BF98&\"C\",0)","v":{"$error":"#N/A"}},null,null,{"$error":"#N/A"},{"$error":"#N/A"},{"$f":"IF(AND(BK98=34,$BI$4>=23,$BI$4<=27),BK98&\"C\",0)","v":{"$error":"#N/A"}}]
[null,29,78,2,null,29,78,2,null,null,null,null,null,null,null,"V100",null,2,1,{"$f":"TRUNC((Frame_Width-2.188)*32+0.5)/32","v":-2.15625},null,{"$f":"INT((Frame_Height-(R99+0.5+ACHEIGHT+S99))*16+0.5)/16","v":-3.5},null,null,null,null,null,null,"Top Hardware",1,0.2,0.2,null,"Top Bottom Rail",{"$f":"(Frame_Width-3.4375)/12","v":-0.28645833333333331},0.23799999999999999,-6.8177083333333333E-2,null,null,null,{"$error":"#N/A"},{"$error":"#N/A"},{"$f":"IF(AND(AP99=30,$AN$4>=20,$AN$4<=24),AP99&\"C\",0)","v":{"$error":"#N/A"}},null,null,{"$error":"#N/A"},{"$error":"#N/A"},{"$f":"IF(AND(AU99=30,$AS$4>=20,$AS$4<=24),AU99&\"C\",0)","v":{"$error":"#N/A"}},null,null,null,null,null,null,null,null,{"$error":"#N/A"},{"$error":"#N/A"},{"$f":"IF(AND(BF99=34,$BD$4>=28,$BD$4<=32),BF99&\"D\",0)","v":{"$error":"#N/A"}},null,null,{"$error":"#N/A"},{"$error":"#N/A"},{"$f":"IF(AND(BK99=34,$BI$4>=28,$BI$4<=32),BK99&\"D\",0)","v":{"$error":"#N/A"}}]
[null,30,78,2,null,30,78,2,null,null,null,null,null,null,null,"V101",1.875,2,null,{"$f":"Frame_Width-3.4375","v":-3.4375},{"$f":"INT((Frame_Height-(Q100+R100+0.5+ACHEIGHT))*16+0.5)/16","v":-4.375},null,null,null,null,null,null,null,"Top Handle Bead",{"$f":"(Frame_Width-5.912)/12","v":-0.49266666666666664},0.104,-5.1237333333333329E-2,null,"Top Stile",{"$f":"(2*(V101_DDIM-1.5625))/12","v":-0.26041666666666669},0.19900000000000001,-5.182291666666667E-2,null,null,null,{"$error":"#N/A"},{"$error":"#N/A"},{"$f":"IF(AND(AP100=30,$AN$4>=25,$AN$4<=29),AP100&\"D\",0)","v":{"$error":"#N/A"}},null,null,{"$error":"#N/A"},{"$error":"#N/A"},{"$f":"IF(AND(AU100=30,$AS$4>=25,$AS$4<=29),AU100&\"D\",0)","v":{"$error":"#N/A"}},null,null,null,null,null,null,null,null,{"$error":"#N/A"},{"$error":"#N/A"},{"$f":"IF(AND(BF100=34,$BD$4>=33,$BD$4<=34),BF100&\"E\",0)","v":{"$error":"#N/A"}},null,null,{"$error":"#N/A"},{"$error":"#N/A"},{"$f":"IF(AND(BK100=34,$BI$4>=33,$BI$4<=34),BK100&\"E\",0)","v":{"$error":"#N/A"}}]
[null,31,88,2,null,31,88,2,null,null,null,null,null,null,null,"V200",null,2,0.4375,{"$f":"TRUNC((Frame_Width-2.188)*32+0.5)/32","v":-2.15625},null,{"$f":"INT((Frame_Height-(R101+0.5+ACHEIGHT+S101))*16+0.5)/16","v":-2.9375},null,null,null,null,null,null,"Top Bead",{"$f":"((Frame_Width-4.25)+((CMR!$L$42-5.0625)*2))/12","v":-1.1979166666666667},7.3999999999999996E-2,{"$f":"AD101*AE101","v":-8.864583333333334E-2},null,"Top Rail Reinf.",{"$f":"(TRUNC(((Frame_Width-9.4375)+0.5)/2)*2)/12","v":-0.66666666666666663},0.10100000000000001,-6.7333333333333328E-2,null,null,null,{"$error":"#N/A"},{"$error":"#N/A"},{"$f":"IF(AND(AP101=30,$AN$4>=30,$AN$4<=33),AP101&\"E\",0)","v":{"$error":"#N/A"}},null,null,{"$error":"#N/A"},{"$error":"#N/A"},{"$f":"IF(AND(AU101=30,$AS$4>=30,$AS$4<=33),AU101&\"E\",0)","v":{"$error":"#N/A"}},null,null,null,null,null,null,null,null,{"$error":"#N/A"},{"$error":"#N/A"},{"$f":"IF(AND(BF101=34,$BD$4>=35,$BD$4<=37),BF101&\"F\",0)","v":{"$error":"#N/A"}},null,null,{"$error":"#N/A"},{"$error":"#N/A"},{"$f":"IF(AND(BK101=34,$BI$4>=35,$BI$4<=37),BK101&\"F\",0)","v":{"$error":"#N/A"}}]
[null,32,88,2,null,32,88,2,null,null,null,null,null,null,null,"3001","2.0625",1.875,null,{"$f":"Frame_Width-4.125","v":-4.125},{"$f":"INT((Frame_Height-(Q102+R102+0.5+ACHEIGHT))*16+0.5)/16","v":-4.4375},null,null,null,null,null,null,null,"Bottom Top Rail",{"$f":"(Frame_Width-3.25)/12","v":-0.27083333333333331},0.437,-0.11835416666666666,null,"Top Stile Reinf",{"$f":"((TRUNC(((V101_DDIM-2.5625)+0.5)/2)*2)/12)*2","v":-0.33333333333333331},0.13300000000000001,-4.4333333333333336E-2,null,null,null,{"$error":"#N/A"},{"$error":"#N/A"},{"$f":"IF(AND(AP102=30,$AN$4>=34,$AN$4<=37),AP102&\"F\",0)","v":{"$error":"#N/A"}},null,null,{"$error":"#N/A"},{"$error":"#N/A"},{"$f":"IF(AND(AU102=30,$AS$4>=34,$AS$4<=37),AU102&\"F\",0)","v":{"$error":"#N/A"}},null,null,null,null,null,null,null,null,{"$error":"#N/A"},{"$error":"#N/A"},{"$f":"IF(AND(BF102=34,$BD$4>=38,$BD$4<=40),BF102&\"G\",0)","v":{"$error":"#N/A"}},null,null,{"$error":"#N/A"},{"$error":"#N/A"},{"$f":"IF(AND(BK102=34,$BI$4>=38,$BI$4<=40),BK102&\"G\",0)","v":{"$error":"#N/A"}}]
[null,33,89,2,null,33,89,2,null,null,null,null,null,null,null,"03A0",null,1.875,0.625,{"$f":"Frame_Width-3.125","v":-3.125},null,{"$f":"INT((Frame_Height-(R103+0.5+ACHEIGHT+S103))*16+0.5)/16","v":-3},null,null,null,null,null,null,"Bottom Bottom Rail",{"$f":"(Frame_Width-3.25)/12","v":-0.27083333333333331},0.437,-0.11835416666666666,null,"Top Glass",{"$f":"(V101_TGW*V101_TGH)/144","v":9.3587239583333329E-2},{"$f":"$L$12","v":""},{"$error":"#VALUE!"},null,null,null,{"$error":"#N/A"},{"$error":"#N/A"},{"$f":"IF(AND(AP103=30,$AN$4>=38,$AN$4<=40),AP103&\"G\",0)","v":{"$error":"#N/A"}},null,null,{"$error":"#N/A"},{"$error":"#N/A"},{"$f":"IF(AND(AU103=30,$AS$4>=38,$AS$4<=40),AU103&\"G\",0)","v":{"$error":"#N/A"}},null,null,null,null,null,null,null,null,{"$error":"#N/A"},{"$error":"#N/A"},{"$f":"IF(AND(BF103=34,$BD$4>=41,$BD$4<=43),BF103&\"H\",0)","v":{"$error":"#N/A"}},null,null,{"$error":"#N/A"},{"$error":"#N/A"},{"$f":"IF(AND(BK103=34,$BI$4>=41,$BI$4<=43),BK103&\"H\",0)","v":{"$error":"#N/A"}}]
[null,34,89,2,null,34,89,2,null,null,null,null,null,null,null,"1700",null,2,0.4375,{"$f":"TRUNC((Frame_Width-2.188)*32+0.5)/32","v":-2.15625},null,-2.9375,null,null,null,null,null,null,"Bottom Stile",{"$f":"(2*(CMR!$L$43-1.25))/12","v":-0.20833333333333334},0.437,-9.1041666666666674E-2,null,"Top Spacer",{"$f":"((V101_TGW*2)+(V101_TGH*2))/12","v":-1.2604166666666667},5.3600000000000002E-2,-6.7558333333333345E-2,null,null,null,{"$error":"#N/A"},{"$error":"#N/A"},{"$f":"IF(AND(AP104=30,$AN$4>=41,$AN$4<=43),AP104&\"H\",0)","v":{"$error":"#N/A"}},null,null,{"$error":"#N/A"},{"$error":"#N/A"},{"$f":"IF(AND(AU104=30,$AS$4>=41,$AS$4<=43),AU104&\"H\",0)","v":{"$error":"#N/A"}},null,null,null,null,null,null,null,null,{"$error":"#N/A"},{"$error":"#N/A"},{"$f":"IF(AND(BF104=34,$BD$4>=44,$BD$4<=45),BF104&\"I\",0)","v":{"$error":"#N/A"}},null,null,{"$error":"#N/A"},{"$error":"#N/A"},{"$f":"IF(AND(BK104=34,$BI$4>=44,$BI$4<=45),BK104&\"I\",0)","v":{"$error":"#N/A"}}]
[null,35,99,2,null,35,99,2,null,null,null,null,null,null,null,"1720",null,2,0.4375,{"$f":"TRUNC((Frame_Width/2-2.4375)*32+0.5)/32","v":-2.40625},null,-2.9375,null,null,null,null,null,null,"Bottom Rail Reinf.",{"$f":"(TRUNC(((Frame_Width-3.25)-6)/2)*2)/12","v":-0.66666666666666663},0.43440000000000001,-0.28959999999999997,null,"Top Hardware",1,0.2,0.2,null,null,null,{"$error":"#N/A"},{"$error":"#N/A"},{"$f":"IF(AND(AP105=30,$AN$4>=44,$AN$4<=45),AP105&\"I\",0)","v":{"$error":"#N/A"}},null,null,{"$error":"#N/A"},{"$error":"#N/A"},{"$f":"IF(AND(AU105=30,$AS$4>=44,$AS$4<=45),AU105&\"I\",0)","v":{"$error":"#N/A"}},null,null,null,null,null,null,null,null,{"$error":"#N/A"},{"$f":"IF(AND($BE$4<=36,$BE$4>34),36,0)","v":{"$error":"#N/A"}},{"$f":"IF(AND(BF105=36,$BD$4>=11,$BD$4<=16),BF105&\"A\",0)","v":{"$error":"#N/A"}},null,null,{"$error":"#N/A"},{"$f":"IF(AND($BJ$4<=36,$BJ$4>34),36,0)","v":{"$error":"#N/A"}},{"$f":"IF(AND(BK105=36,$BI$4>=11,$BI$4<=16),BK105&\"A\",0)","v":{"$error":"#N/A"}}]
[null,36,99,2,null,36,99,2,null,null,null,null,null,null,null,"1730",null,2,0.4375,{"$f":"TRUNC((Frame_Width/3-2.53125)*32+0.5)/32","v":-2.5},null,-2.9375,null,null,null,null,null,null,"Bottom Stile Reinf.",{"$f":"IF(CMR!$L$48>26.1875,((TRUNC((CMR!$L$43-4)/2)*2)/12)*2,0)","v":0},0.43440000000000001,0,null,"Top Bead",{"$f":"(((Frame_Width-4.2)*2)+((V101_DDIM-2.875)*2))/12","v":-1.1791666666666667},2.1000000000000001E-2,-2.4762500000000003E-2,null,null,null,{"$error":"#N/A"},{"$f":"IF(AND($AO$4<=32,$AO$4>30),32,0)","v":{"$error":"#N/A"}},{"$f":"IF(AND(AP106=32,$AN$4>=8,$AN$4<=14),AP106&\"A\",0)","v":{"$error":"#N/A"}},null,null,{"$error":"#N/A"},{"$f":"IF(AND($AT$4<=32,$AT$4>30),32,0)","v":{"$error":"#N/A"}},{"$f":"IF(AND(AU106=32,$AS$4>=8,$AS$4<=14),AU106&\"A\",0)","v":{"$error":"#N/A"}},null,null,null,null,null,null,null,null,{"$error":"#N/A"},{"$error":"#N/A"},{"$f":"IF(AND(BF106=36,$BD$4>=17,$BD$4<=22),BF106&\"B\",0)","v":{"$error":"#N/A"}},null,null,{"$error":"#N/A"},{"$error":"#N/A"},{"$f":"IF(AND(BK106=36,$BI$4>=17,$BI$4<=22),BK106&\"B\",0)","v":{"$error":"#N/A"}}]
[null,37,766,3,null,37,478,3,null,null,null,null,null,null,null,"1900",null,2,1,{"$f":"TRUNC((Frame_Width-2.1875)*32+0.5)/32","v":-2.15625},null,-3.5,null,null,null,null,null,null,"Bottom Glass",{"$f":"(CMR!$L$46*CMR!$L$48)/144","v":0.17103407118055555},{"$f":"$L$12","v":""},{"$error":"#VALUE!"},null,"Bottom Top Rail",{"$f":"(Frame_Width-2.1875)/12","v":-0.18229166666666666},0.224,-4.0833333333333333E-2,null,null,null,{"$error":"#N/A"},{"$error":"#N/A"},{"$f":"IF(AND(AP107=32,$AN$4>=15,$AN$4<=20),AP107&\"B\",0)","v":{"$error":"#N/A"}},null,null,{"$error":"#N/A"},{"$error":"#N/A"},{"$f":"IF(AND(AU107=32,$AS$4>=15,$AS$4<=20),AU107&\"B\",0)","v":{"$error":"#N/A"}},null,null,null,null,null,null,null,null,{"$error":"#N/A"},{"$error":"#N/A"},{"$f":"IF(AND(BF107=36,$BD$4>=23,$BD$4<=27),BF107&\"C\",0)","v":{"$error":"#N/A"}},null,null,{"$error":"#N/A"},{"$error":"#N/A"},{"$f":"IF(AND(BK107=36,$BI$4>=23,$BI$4<=27),BK107&\"C\",0)","v":{"$error":"#N/A"}}]
[null,38,766,3,null,38,478,3,null,null,null,null,null,null,null,"1920",null,2,1,{"$f":"TRUNC((Frame_Width/2-2.4375)*32+0.5)/32","v":-2.40625},null,-3.5,null,null,null,null,null,null,"Bottom Spacer",{"$f":"((CMR!$L$46*2)+(CMR!$L$48*2))/12","v":-1.6875},5.3600000000000002E-2,-9.0450000000000003E-2,null,"Bottom Bottom Rail",{"$f":"(Frame_Width-2.1875)/12","v":-0.18229166666666666},0.19900000000000001,-3.6276041666666668E-2,null,null,null,{"$error":"#N/A"},{"$error":"#N/A"},{"$f":"IF(AND(AP108=32,$AN$4>=21,$AN$4<=25),AP108&\"C\",0)","v":{"$error":"#N/A"}},null,null,{"$error":"#N/A"},{"$error":"#N/A"},{"$f":"IF(AND(AU108=32,$AS$4>=21,$AS$4<=25),AU108&\"C\",0)","v":{"$error":"#N/A"}},null,null,null,null,null,null,null,null,{"$error":"#N/A"},{"$error":"#N/A"},{"$f":"IF(AND(BF108=36,$BD$4>=28,$BD$4<=32),BF108&\"D\",0)","v":{"$error":"#N/A"}},null,null,{"$error":"#N/A"},{"$error":"#N/A"},{"$f":"IF(AND(BK108=36,$BI$4>=28,$BI$4<=32),BK108&\"D\",0)","v":{"$error":"#N/A"}}]
[null,39,866,3,null,39,488,3,null,null,null,null,null,null,null,"1930",null,2,1,{"$f":"TRUNC((Frame_Width/3-2.53125)*32+0.5)/32","v":-2.5},null,-3.5,null,null,null,null,null,null,"Bottom Hardware",1,0.36,0.36,null,"Bottom Stile",{"$f":"(2*(V101_CDIM-0.3125))/12","v":-5.2083333333333336E-2},0.19900000000000001,-1.0364583333333335E-2,null,null,null,{"$error":"#N/A"},{"$error":"#N/A"},{"$f":"IF(AND(AP109=32,$AN$4>=26,$AN$4<=30),AP109&\"D\",0)","v":{"$error":"#N/A"}},null,null,{"$error":"#N/A"},{"$error":"#N/A"},{"$f":"IF(AND(AU109=32,$AS$4>=26,$AS$4<=30),AU109&\"D\",0)","v":{"$error":"#N/A"}},null,null,null,null,null,null,null,null,{"$error":"#N/A"},{"$error":"#N/A"},{"$f":"IF(AND(BF109=36,$BD$4>=33,$BD$4<=34),BF109&\"E\",0)","v":{"$error":"#N/A"}},null,null,{"$error":"#N/A"},{"$error":"#N/A"},{"$f":"IF(AND(BK109=36,$BI$4>=33,$BI$4<=34),BK109&\"E\",0)","v":{"$error":"#N/A"}}]
[null,40,866,3,null,40,488,3,null,null,null,null,null,null,null,"1901",1.875,2,null,{"$f":"Frame_Width-2.1875","v":-2.1875},{"$f":"INT((Frame_Height-(Q110+R110+0.5+ACHEIGHT))*16+0.5)/16","v":-4.375},null,null,null,null,null,null,null,"Bottom Keeper Bead",{"$f":"(Frame_Width-5.912)/12","v":-0.49266666666666664},0.109,-5.370066666666666E-2,null,"Bottom Rail Reinf.",{"$f":"(TRUNC(((Frame_Width-8.1875)+0.5)/2)*2)/12","v":-0.5},0.13300000000000001,-6.6500000000000004E-2,null,null,null,{"$error":"#N/A"},{"$error":"#N/A"},{"$f":"IF(AND(AP110=32,$AN$4>=31,$AN$4<=34),AP110&\"E\",0)","v":{"$error":"#N/A"}},null,null,{"$error":"#N/A"},{"$error":"#N/A"},{"$f":"IF(AND(AU110=32,$AS$4>=31,$AS$4<=34),AU110&\"E\",0)","v":{"$error":"#N/A"}},null,null,null,null,null,null,null,null,{"$error":"#N/A"},{"$error":"#N/A"},{"$f":"IF(AND(BF110=36,$BD$4>=35,$BD$4<=37),BF110&\"F\",0)","v":{"$error":"#N/A"}},null,null,{"$error":"#N/A"},{"$error":"#N/A"},{"$f":"IF(AND(BK110=36,$BI$4>=35,$BI$4<=37),BK110&\"F\",0)","v":{"$error":"#N/A"}}]
[null,41,777,3,null,41,588,3,null,null,null,null,null,null,null,"1921",1.875,2,null,{"$f":"Frame_Width/2-2.4375","v":-2.4375},{"$f":"INT((Frame_Height-(Q111+R111+0.5+ACHEIGHT))*16+0.5)/16","v":-4.375},null,null,null,null,null,null,null,"Bottom Bead",{"$f":"((Frame_Width-5.912)+((CMR!$L$43-5.0625)*2))/12","v":-1.3364166666666666},7.3999999999999996E-2,-9.8894833333333321E-2,null,"Bottom Stile Reinf.",{"$f":"((TRUNC(((V101_CDIM-1.3125)+0.5)/2)*2)/12)*2","v":0},0.13300000000000001,0,null,null,null,{"$error":"#N/A"},{"$error":"#N/A"},{"$f":"IF(AND(AP111=32,$AN$4>=35,$AN$4<=37),AP111&\"F\",0)","v":{"$error":"#N/A"}},null,null,{"$error":"#N/A"},{"$error":"#N/A"},{"$f":"IF(AND(AU111=32,$AS$4>=35,$AS$4<=37),AU111&\"F\",0)","v":{"$error":"#N/A"}},null,null,null,null,null,null,null,null,{"$error":"#N/A"},{"$error":"#N/A"},{"$f":"IF(AND(BF111=36,$BD$4>=38,$BD$4<=40),BF111&\"G\",0)","v":{"$error":"#N/A"}},null,null,{"$error":"#N/A"},{"$error":"#N/A"},{"$f":"IF(AND(BK111=36,$BI$4>=38,$BI$4<=40),BK111&\"G\",0)","v":{"$error":"#N/A"}}]
[null,42,777,3,null,42,588,3,null,null,null,null,null,null,null,"1931",1.875,2,null,{"$f":"Frame_Width/3-2.5","v":-2.5},{"$f":"INT((Frame_Height-(Q112+R112+0.5+ACHEIGHT))*16+0.5)/16","v":-4.375},null,null,null,null,null,null,null,null,null,"Top Sash",{"$f":"IF(OR(ModelNo=\"0501\",ModelNo=\"B501\",ModelNo=\"U501\"),SUM(AF92:AF101),0)","v":0},null,"Bottom Glass",{"$f":"(V101_BGW*V101_BGH)/144","v":3.8791232638888888E-2},{"$f":"$L$12","v":""},{"$error":"#VALUE!"},null,null,null,{"$error":"#N/A"},{"$error":"#N/A"},{"$f":"IF(AND(AP112=32,$AN$4>=38,$AN$4<=40),AP112&\"G\",0)","v":{"$error":"#N/A"}},null,null,{"$error":"#N/A"},{"$error":"#N/A"},{"$f":"IF(AND(AU112=32,$AS$4>=38,$AS$4<=40),AU112&\"G\",0)","v":{"$error":"#N/A"}},null,null,null,null,null,null,null,null,{"$error":"#N/A"},{"$error":"#N/A"},{"$f":"IF(AND(BF112=36,$BD$4>=41,$BD$4<=43),BF112&\"H\",0)","v":{"$error":"#N/A"}},null,null,{"$error":"#N/A"},{"$error":"#N/A"},{"$f":"IF(AND(BK112=36,$BI$4>=41,$BI$4<=43),BK112&\"H\",0)","v":{"$error":"#N/A"}}]
[null,43,877,3,null,43,688,3,null,null,null,null,null,null,null,null,null,null,null,null,null,null,null,null,null,null,null,null,null,null,"Bottom Sash",{"$f":"IF(OR(ModelNo=\"0501\",ModelNo=\"B501\",ModelNo=\"U501\"),SUM(AF102:AF111),0)","v":0},null,"Bottom Spacer",{"$f":"((V101_BGW*2)+(V101_BGH*2))/12","v":-0.84375},5.3600000000000002E-2,-4.5225000000000001E-2,null,null,null,{"$error":"#N/A"},{"$error":"#N/A"},{"$f":"IF(AND(AP113=32,$AN$4>=41,$AN$4<=43),AP113&\"H\",0)","v":{"$error":"#N/A"}},null,null,{"$error":"#N/A"},{"$error":"#N/A"},{"$f":"IF(AND(AU113=32,$AS$4>=41,$AS$4<=43),AU113&\"H\",0)","v":{"$error":"#N/A"}},null,null,null,null,null,null,null,null,{"$error":"#N/A"},{"$error":"#N/A"},{"$f":"IF(AND(BF113=36,$BD$4>=44,$BD$4<=45),BF113&\"I\",0)","v":{"$error":"#N/A"}},null,null,{"$error":"#N/A"},{"$error":"#N/A"},{"$f":"IF(AND(BK113=36,$BI$4>=44,$BI$4<=45),BK113&\"I\",0)","v":{"$error":"#N/A"}}]
[null,44,877,3,null,44,688,3,null,null,null,null,null,null,null,null,null,null,null,null,null,null,null,null,null,null,null,null,null,null,null,null,null,"Bottom Hardware",1,0.36,0.36,null,null,null,{"$error":"#N/A"},{"$error":"#N/A"},{"$f":"IF(AND(AP114=32,$AN$4>=44,$AN$4<=45),AP114&\"I\",0)","v":{"$error":"#N/A"}},null,null,{"$error":"#N/A"},{"$error":"#N/A"},{"$f":"IF(AND(AU114=32,$AS$4>=44,$AS$4<=45),AU114&\"I\",0)","v":{"$error":"#N/A"}},null,null,null,null,null,null,null,null,{"$error":"#N/A"},{"$f":"IF(AND($BE$4<=38,$BE$4>36),38,0)","v":{"$error":"#N/A"}},{"$f":"IF(AND(BF114=38,$BD$4>=11,$BD$4<=16),BF114&\"A\",0)","v":{"$error":"#N/A"}},null,null,{"$error":"#N/A"},{"$f":"IF(AND($BJ$4<=38,$BJ$4>36),38,0)","v":{"$error":"#N/A"}},{"$f":"IF(AND(BK114=38,$BI$4>=11,$BI$4<=16),BK114&\"A\",0)","v":{"$error":"#N/A"}}]
[null,45,878,3,null,45,788,3,null,null,null,null,null,null,null,null,null,null,null,null,null,null,null,null,null,null,null,null,"3001","Length","Weight/ft","Weight",null,"Bottom Bead",{"$f":"(((Frame_Width-2.95)*2)+((V101_CDIM-1.0625)*2))/12","v":-0.66875000000000007},2.1000000000000001E-2,-1.4043750000000002E-2,null,null,null,{"$error":"#N/A"},{"$f":"IF(AND($AO$4<=34,$AO$4>32),34,0)","v":{"$error":"#N/A"}},{"$f":"IF(AND(AP115=34,$AN$4>=11,$AN$4<=16),AP115&\"A\",0)","v":{"$error":"#N/A"}},null,null,{"$error":"#N/A"},{"$f":"IF(AND($AT$4<=34,$AT$4>32),34,0)","v":{"$error":"#N/A"}},{"$f":"IF(AND(AU115=34,$AS$4>=11,$AS$4<=16),AU115&\"A\",0)","v":{"$error":"#N/A"}},null,null,null,null,null,null,null,null,{"$error":"#N/A"},{"$error":"#N/A"},{"$f":"IF(AND(BF115=38,$BD$4>=17,$BD$4<=22),BF115&\"B\",0)","v":{"$error":"#N/A"}},null,null,{"$error":"#N/A"},{"$error":"#N/A"},{"$f":"IF(AND(BK115=38,$BI$4>=17,$BI$4<=22),BK115&\"B\",0)","v":{"$error":"#N/A"}}]
[null,46,878,3,null,46,788,3,null,null,null,null,null,null,null,null,null,null,null,null,null,null,null,null,null,null,null,null,"Top Top Rail",{"$f":"(Frame_Width-4.125)/12","v":-0.34375},0.29699999999999999,{"$f":"AD116*AE116","v":-0.10209375},null,null,null,"Top Sash",{"$f":"IF(ModelNo=\"V101\",(SUM(AK98:AK106))+5,0)","v":0},null,null,null,{"$error":"#N/A"},{"$error":"#N/A"},{"$f":"IF(AND(AP116=34,$AN$4>=17,$AN$4<=22),AP116&\"B\",0)","v":{"$error":"#N/A"}},null,null,{"$error":"#N/A"},{"$error":"#N/A"},{"$f":"IF(AND(AU116=34,$AS$4>=17,$AS$4<=22),AU116&\"B\",0)","v":{"$error":"#N/A"}},null,null,null,null,null,null,null,null,{"$error":"#N/A"},{"$error":"#N/A"},{"$f":"IF(AND(BF116=38,$BD$4>=23,$BD$4<=27),BF116&\"C\",0)","v":{"$error":"#N/A"}},null,null,{"$error":"#N/A"},{"$error":"#N/A"},{"$f":"IF(AND(BK116=38,$BI$4>=23,$BI$4<=27),BK116&\"C\",0)","v":{"$error":"#N/A"}}]
[null,47,888,3,null,47,888,3,null,null,null,null,null,null,null,null,null,null,null,null,null,null,null,null,null,null,null,null,"Top Bottom Rail",{"$f":"(Frame_Width-4.125)/12","v":-0.34375},0.28899999999999998,-9.9343749999999995E-2,null,null,null,"Bottom Sash",{"$f":"IF(ModelNo=\"V101\",SUM(AK107:AK115),0)","v":0},null,null,null,{"$error":"#N/A"},{"$error":"#N/A"},{"$f":"IF(AND(AP117=34,$AN$4>=23,$AN$4<=27),AP117&\"C\",0)","v":{"$error":"#N/A"}},null,null,{"$error":"#N/A"},{"$error":"#N/A"},{"$f":"IF(AND(AU117=34,$AS$4>=23,$AS$4<=27),AU117&\"C\",0)","v":{"$error":"#N/A"}},null,null,null,null,null,null,null,null,{"$error":"#N/A"},{"$error":"#N/A"},{"$f":"IF(AND(BF117=38,$BD$4>=28,$BD$4<=32),BF117&\"D\",0)","v":{"$error":"#N/A"}},null,null,{"$error":"#N/A"},{"$error":"#N/A"},{"$f":"IF(AND(BK117=38,$BI$4>=28,$BI$4<=32),BK117&\"D\",0)","v":{"$error":"#N/A"}}]
[null,48,888,3,null,48,888,3,null,null,null,null,null,null,null,null,null,null,null,null,null,null,null,null,null,null,null,null,"Top Stile",{"$f":"(2*(DDIM3001-1.625))/12","v":-0.27083333333333331},0.218,-5.9041666666666666E-2,null,null,null,null,null,null,null,null,{"$error":"#N/A"},{"$error":"#N/A"},{"$f":"IF(AND(AP118=34,$AN$4>=28,$AN$4<=32),AP118&\"D\",0)","v":{"$error":"#N/A"}},null,null,{"$error":"#N/A"},{"$error":"#N/A"},{"$f":"IF(AND(AU118=34,$AS$4>=28,$AS$4<=32),AU118&\"D\",0)","v":{"$error":"#N/A"}},null,null,null,null,null,null,null,null,{"$error":"#N/A"},{"$error":"#N/A"},{"$f":"IF(AND(BF118=38,$BD$4>=33,$BD$4<=34),BF118&\"E\",0)","v":{"$error":"#N/A"}},null,null,{"$error":"#N/A"},{"$error":"#N/A"},{"$f":"IF(AND(BK118=38,$BI$4>=33,$BI$4<=34),BK118&\"E\",0)","v":{"$error":"#N/A"}}]
[null,49,889,3,null,49,889,3,null,null,null,null,null,null,null,null,null,null,null,null,null,null,null,null,null,null,null,null,"Keeper Rail Reinf.",{"$f":"(TRUNC(((Frame_Width-4.125)-2)/2)*2)/12","v":-0.5},{"$f":"IF(OR(EXTSELECT=2,Frame_Width<48,Frame_Height<84),0.0516,IF(OR(EXTSELECT=3,Frame_Width>48,Frame_Height>84),0.3784,0))","v":5.16E-2},-2.58E-2,null,null,null,null,null,null,null,null,{"$error":"#N/A"},{"$error":"#N/A"},{"$f":"IF(AND(AP119=34,$AN$4>=33,$AN$4<=34),AP119&\"E\",0)","v":{"$error":"#N/A"}},null,null,{"$error":"#N/A"},{"$error":"#N/A"},{"$f":"IF(AND(AU119=34,$AS$4>=33,$AS$4<=34),AU119&\"E\",0)","v":{"$error":"#N/A"}},null,null,null,null,null,null,null,null,{"$error":"#N/A"},{"$error":"#N/A"},{"$f":"IF(AND(BF119=38,$BD$4>=35,$BD$4<=37),BF119&\"F\",0)","v":{"$error":"#N/A"}},null,null,{"$error":"#N/A"},{"$error":"#N/A"},{"$f":"IF(AND(BK119=38,$BI$4>=35,$BI$4<=37),BK119&\"F\",0)","v":{"$error":"#N/A"}}]
[null,50,889,3,null,50,889,3,null,null,null,null,null,null,null,null,null,null,null,null,null,null,null,null,null,null,null,null,"Top Stile Reinf",{"$f":"IF(OR(Frame_Width>48,Frame_Height>84,EXTTYPE=\"Steel\"),((TRUNC(((DDIM3001-1.625)-8)/2)*2)/12)*2,0)","v":0},0.45600000000000002,0,null,"V200","Length","Weight/ft","Weight",null,null,null,{"$error":"#N/A"},{"$error":"#N/A"},{"$f":"IF(AND(AP120=34,$AN$4>=35,$AN$4<=37),AP120&\"F\",0)","v":{"$error":"#N/A"}},null,null,{"$error":"#N/A"},{"$error":"#N/A"},{"$f":"IF(AND(AU120=34,$AS$4>=35,$AS$4<=37),AU120&\"F\",0)","v":{"$error":"#N/A"}},null,null,null,null,null,null,null,null,{"$error":"#N/A"},{"$error":"#N/A"},{"$f":"IF(AND(BF120=38,$BD$4>=38,$BD$4<=40),BF120&\"G\",0)","v":{"$error":"#N/A"}},null,null,{"$error":"#N/A"},{"$error":"#N/A"},{"$f":"IF(AND(BK120=38,$BI$4>=38,$BI$4<=40),BK120&\"G\",0)","v":{"$error":"#N/A"}}]
[null,51,899,3,null,51,"899",3,null,null,null,null,null,null,null,null,null,null,null,null,null,null,null,null,null,null,null,null,"Top Glass",{"$f":"(CMR!$E$103*CMR!$E$105)/144","v":0.12852647569444445},{"$f":"$L$12","v":""},{"$error":"#VALUE!"},null,"Top Top Rail",0,0,{"$f":"AI121*AJ121","v":0},null,null,null,{"$error":"#N/A"},{"$error":"#N/A"},{"$f":"IF(AND(AP121=34,$AN$4>=38,$AN$4<=40),AP121&\"G\",0)","v":{"$error":"#N/A"}},null,null,{"$error":"#N/A"},{"$error":"#N/A"},{"$f":"IF(AND(AU121=34,$AS$4>=38,$AS$4<=40),AU121&\"G\",0)","v":{"$error":"#N/A"}},null,null,null,null,null,null,null,null,{"$error":"#N/A"},{"$error":"#N/A"},{"$f":"IF(AND(BF121=38,$BD$4>=41,$BD$4<=43),BF121&\"H\",0)","v":{"$error":"#N/A"}},null,null,{"$error":"#N/A"},{"$error":"#N/A"},{"$f":"IF(AND(BK121=38,$BI$4>=41,$BI$4<=43),BK121&\"H\",0)","v":{"$error":"#N/A"}}]
[null,52,899,3,null,52,"899",3,null,null,null,null,null,null,null,null,null,null,null,null,null,null,null,null,null,null,null,null,"Top Spacer",{"$f":"((CMR!$E$103*2)+(CMR!$E$105*2))/12","v":-1.4947916666666667},5.3600000000000002E-2,-8.0120833333333336E-2,null,"Top Bottom Rail",0,0,0,null,null,null,{"$error":"#N/A"},{"$error":"#N/A"},{"$f":"IF(AND(AP122=34,$AN$4>=41,$AN$4<=43),AP122&\"H\",0)","v":{"$error":"#N/A"}},null,null,{"$error":"#N/A"},{"$error":"#N/A"},{"$f":"IF(AND(AU122=34,$AS$4>=41,$AS$4<=43),AU122&\"H\",0)","v":{"$error":"#N/A"}},null,null,null,null,null,null,null,null,{"$error":"#N/A"},{"$error":"#N/A"},{"$f":"IF(AND(BF122=38,$BD$4>=44,$BD$4<=45),BF122&\"I\",0)","v":{"$error":"#N/A"}},null,null,{"$error":"#N/A"},{"$error":"#N/A"},{"$f":"IF(AND(BK122=38,$BI$4>=44,$BI$4<=45),BK122&\"I\",0)","v":{"$error":"#N/A"}}]
[null,53,999,3,null,53,"999",3,null,null,null,null,null,null,null,null,null,null,null,null,null,null,null,null,null,null,null,null,"Top Hardware",1,0.4,0.4,null,"Top Stile",0,0,0,null,null,null,{"$error":"#N/A"},{"$error":"#N/A"},{"$f":"IF(AND(AP123=34,$AN$4>=44,$AN$4<=45),AP123&\"I\",0)","v":{"$error":"#N/A"}},null,null,{"$error":"#N/A"},{"$error":"#N/A"},{"$f":"IF(AND(AU123=34,$AS$4>=44,$AS$4<=45),AU123&\"I\",0)","v":{"$error":"#N/A"}},null,null,null,null,null,null,null,null,{"$error":"#N/A"},{"$f":"IF(AND($BE$4<=40,$BE$4>38),40,0)","v":{"$error":"#N/A"}},{"$f":"IF(AND(BF123=40,$BD$4>=11,$BD$4<=16),BF123&\"A\",0)","v":{"$error":"#N/A"}},null,null,{"$error":"#N/A"},{"$f":"IF(AND($BJ$4<=40,$BJ$4>38),40,0)","v":{"$error":"#N/A"}},{"$f":"IF(AND(BK123=40,$BI$4>=11,$BI$4<=16),BK123&\"A\",0)","v":{"$error":"#N/A"}}]
[null,54,999,3,null,54,"999",3,null,null,null,null,null,null,null,null,null,null,null,null,null,null,null,null,null,null,null,null,"Top Bead",{"$f":"(((Frame_Width-5.125)*2)+((DDIM3001-4.3125)*2))/12","v":-1.5729166666666667},7.1999999999999995E-2,-0.11325,null,"Top Rail Reinf.",0,0,0,null,null,null,{"$error":"#N/A"},{"$f":"IF(AND($AO$4<=36,$AO$4>34),36,0)","v":{"$error":"#N/A"}},{"$f":"IF(AND(AP124=36,$AN$4>=11,$AN$4<=16),AP124&\"A\",0)","v":{"$error":"#N/A"}},null,null,{"$error":"#N/A"},{"$f":"IF(AND($AT$4<=36,$AT$4>34),36,0)","v":{"$error":"#N/A"}},{"$f":"IF(AND(AU124=36,$AS$4>=11,$AS$4<=16),AU124&\"A\",0)","v":{"$error":"#N/A"}},null,null,null,null,null,null,null,null,{"$error":"#N/A"},{"$error":"#N/A"},{"$f":"IF(AND(BF124=40,$BD$4>=17,$BD$4<=22),BF124&\"B\",0)","v":{"$error":"#N/A"}},null,null,{"$error":"#N/A"},{"$error":"#N/A"},{"$f":"IF(AND(BK124=40,$BI$4>=17,$BI$4<=22),BK124&\"B\",0)","v":{"$error":"#N/A"}}]
[null,55,6679,4,null,55,"4888",4,null,null,null,null,null,null,null,null,null,null,null,null,null,null,null,null,null,null,null,null,"Bottom Top Rail",{"$f":"(Frame_Width-3.125)/12","v":-0.26041666666666669},0.29699999999999999,-7.7343750000000003E-2,null,"Top Stile Reinf",0,0,0,null,null,null,{"$error":"#N/A"},{"$error":"#N/A"},{"$f":"IF(AND(AP125=36,$AN$4>=17,$AN$4<=22),AP125&\"B\",0)","v":{"$error":"#N/A"}},null,null,{"$error":"#N/A"},{"$error":"#N/A"},{"$f":"IF(AND(AU125=36,$AS$4>=17,$AS$4<=22),AU125&\"B\",0)","v":{"$error":"#N/A"}},null,null,null,null,null,null,null,null,{"$error":"#N/A"},{"$error":"#N/A"},{"$f":"IF(AND(BF125=40,$BD$4>=23,$BD$4<=27),BF125&\"C\",0)","v":{"$error":"#N/A"}},null,null,{"$error":"#N/A"},{"$error":"#N/A"},{"$f":"IF(AND(BK125=40,$BI$4>=23,$BI$4<=27),BK125&\"C\",0)","v":{"$error":"#N/A"}}]
[null,56,6679,4,null,56,"4888",4,null,null,null,null,null,null,null,null,null,null,null,null,null,null,null,null,null,null,null,null,"Bottom Bottom Rail",{"$f":"(Frame_Width-3.125)/12","v":-0.26041666666666669},0.23200000000000001,-6.0416666666666674E-2,null,"Top Glass",0,0,0,null,null,null,{"$error":"#N/A"},{"$error":"#N/A"},{"$f":"IF(AND(AP126=36,$AN$4>=23,$AN$4<=27),AP126&\"C\",0)","v":{"$error":"#N/A"}},null,null,{"$error":"#N/A"},{"$error":"#N/A"},{"$f":"IF(AND(AU126=36,$AS$4>=23,$AS$4<=27),AU126&\"C\",0)","v":{"$error":"#N/A"}},null,null,null,null,null,null,null,null,{"$error":"#N/A"},{"$error":"#N/A"},{"$f":"IF(AND(BF126=40,$BD$4>=28,$BD$4<=32),BF126&\"D\",0)","v":{"$error":"#N/A"}},null,null,{"$error":"#N/A"},{"$error":"#N/A"},{"$f":"IF(AND(BK126=40,$BI$4>=28,$BI$4<=32),BK126&\"D\",0)","v":{"$error":"#N/A"}}]
[null,57,6779,4,null,57,"5888",4,null,null,null,null,null,null,null,null,null,null,null,null,null,null,null,null,null,null,null,null,"Bottom Stile",{"$f":"(2*(CDIM3001-0.625))/12","v":-0.10416666666666667},0.219,-2.2812499999999999E-2,null,"Top Spacer",0,0,0,null,null,null,{"$error":"#N/A"},{"$error":"#N/A"},{"$f":"IF(AND(AP127=36,$AN$4>=28,$AN$4<=32),AP127&\"D\",0)","v":{"$error":"#N/A"}},null,null,{"$error":"#N/A"},{"$error":"#N/A"},{"$f":"IF(AND(AU127=36,$AS$4>=28,$AS$4<=32),AU127&\"D\",0)","v":{"$error":"#N/A"}},null,null,null,null,null,null,null,null,{"$error":"#N/A"},{"$error":"#N/A"},{"$f":"IF(AND(BF127=40,$BD$4>=33,$BD$4<=34),BF127&\"E\",0)","v":{"$error":"#N/A"}},null,null,{"$error":"#N/A"},{"$error":"#N/A"},{"$f":"IF(AND(BK127=40,$BI$4>=33,$BI$4<=34),BK127&\"E\",0)","v":{"$error":"#N/A"}}]
[null,58,6779,4,null,58,"5888",4,null,null,null,null,null,null,null,null,null,null,null,null,null,null,null,null,null,null,null,null,"Bottom Rail Reinf.",{"$f":"(TRUNC(((Frame_Width-3.125)-6)/2)*2)/12","v":-0.66666666666666663},{"$f":"IF(OR(EXTSELECT=2,Frame_Width<48,Frame_Height<84),0.0516,IF(OR(EXTSELECT=3,Frame_Width>48,Frame_Height>84),0.57,0))","v":5.16E-2},-3.44E-2,null,"Top Hardware",0,0,0,null,null,null,{"$error":"#N/A"},{"$error":"#N/A"},{"$f":"IF(AND(AP128=36,$AN$4>=33,$AN$4<=34),AP128&\"E\",0)","v":{"$error":"#N/A"}},null,null,{"$error":"#N/A"},{"$error":"#N/A"},{"$f":"IF(AND(AU128=36,$AS$4>=33,$AS$4<=34),AU128&\"E\",0)","v":{"$error":"#N/A"}},null,null,null,null,null,null,null,null,{"$error":"#N/A"},{"$error":"#N/A"},{"$f":"IF(AND(BF128=40,$BD$4>=35,$BD$4<=37),BF128&\"F\",0)","v":{"$error":"#N/A"}},null,null,{"$error":"#N/A"},{"$error":"#N/A"},{"$f":"IF(AND(BK128=40,$BI$4>=35,$BI$4<=37),BK128&\"F\",0)","v":{"$error":"#N/A"}}]
[null,59,7779,4,null,59,"6888",4,null,null,null,null,null,null,null,null,null,null,null,null,null,null,null,null,null,null,null,null,"Bottom Stile Reinf.",{"$f":"IF(OR(Frame_Width>48,Frame_Height>84,EXTTYPE=\"Steel\"),((TRUNC((CDIM3001-2)/2)*2)/12)*2,0)","v":0},0.45600000000000002,0,null,"Top Bead",0,0,0,null,null,null,{"$error":"#N/A"},{"$error":"#N/A"},{"$f":"IF(AND(AP129=36,$AN$4>=35,$AN$4<=37),AP129&\"F\",0)","v":{"$error":"#N/A"}},null,null,{"$error":"#N/A"},{"$error":"#N/A"},{"$f":"IF(AND(AU129=36,$AS$4>=35,$AS$4<=37),AU129&\"F\",0)","v":{"$error":"#N/A"}},null,null,null,null,null,null,null,null,{"$error":"#N/A"},{"$error":"#N/A"},{"$f":"IF(AND(BF129=40,$BD$4>=38,$BD$4<=40),BF129&\"G\",0)","v":{"$error":"#N/A"}},null,null,{"$error":"#N/A"},{"$error":"#N/A"},{"$f":"IF(AND(BK129=40,$BI$4>=38,$BI$4<=40),BK129&\"G\",0)","v":{"$error":"#N/A"}}]
[null,60,7779,4,null,60,"6888",4,null,null,null,null,null,null,null,null,null,null,null,null,null,null,null,null,null,null,null,null,"Bottom Glass",{"$f":"(CMR!$E$104*CMR!$E$106)/144","v":7.3187934027777776E-2},{"$f":"$L$12","v":""},{"$error":"#VALUE!"},null,"Bottom Top Rail",{"$f":"(Frame_Width-2.1875)/12","v":-0.18229166666666666},0.224,-4.0833333333333333E-2,null,null,null,{"$error":"#N/A"},{"$error":"#N/A"},{"$f":"IF(AND(AP130=36,$AN$4>=38,$AN$4<=40),AP130&\"G\",0)","v":{"$error":"#N/A"}},null,null,{"$error":"#N/A"},{"$error":"#N/A"},{"$f":"IF(AND(AU130=36,$AS$4>=38,$AS$4<=40),AU130&\"G\",0)","v":{"$error":"#N/A"}},null,null,null,null,null,null,null,null,{"$error":"#N/A"},{"$error":"#N/A"},{"$f":"IF(AND(BF130=40,$BD$4>=41,$BD$4<=42),BF130&\"H\",0)","v":{"$error":"#N/A"}},null,null,{"$error":"#N/A"},{"$error":"#N/A"},{"$f":"IF(AND(BK130=40,$BI$4>=41,$BI$4<=42),BK130&\"H\",0)","v":{"$error":"#N/A"}}]
[null,61,6799,4,null,61,"7888",4,null,null,null,null,null,null,null,null,null,null,null,null,null,null,null,null,null,null,null,null,"Bottom Spacer",{"$f":"((CMR!$E$104*2)+(CMR!$E$106*2))/12","v":-1.1614583333333333},5.3600000000000002E-2,-6.2254166666666666E-2,null,"Bottom Bottom Rail",{"$f":"(Frame_Width-2.1875)/12","v":-0.18229166666666666},0.19900000000000001,-3.6276041666666668E-2,null,null,null,{"$error":"#N/A"},{"$error":"#N/A"},{"$f":"IF(AND(AP131=36,$AN$4>=41,$AN$4<=43),AP131&\"H\",0)","v":{"$error":"#N/A"}},null,null,{"$error":"#N/A"},{"$error":"#N/A"},{"$f":"IF(AND(AU131=36,$AS$4>=41,$AS$4<=43),AU131&\"H\",0)","v":{"$error":"#N/A"}},null,null,null,null,null,null,null,null,{"$error":"#N/A"},{"$error":"#N/A"},{"$f":"IF(AND(BF131=40,$BD$4>=43,$BD$4<=45),BF131&\"I\",0)","v":{"$error":"#N/A"}},null,null,{"$error":"#N/A"},{"$error":"#N/A"},{"$f":"IF(AND(BK131=40,$BI$4>=43,$BI$4<=45),BK131&\"I\",0)","v":{"$error":"#N/A"}}]
[null,62,6799,4,null,62,"7888",4,null,null,null,null,null,null,null,null,null,null,null,null,null,null,null,null,null,null,null,null,"Bottom Hardware",1,0.36,0.36,null,"Bottom Stile",{"$f":"((V200_CDIM-0.875)*2)/12","v":-0.14583333333333334},0.19900000000000001,-2.9020833333333336E-2,null,null,null,{"$error":"#N/A"},{"$error":"#N/A"},{"$f":"IF(AND(AP132=36,$AN$4>=44,$AN$4<=45),AP132&\"I\",0)","v":{"$error":"#N/A"}},null,null,{"$error":"#N/A"},{"$error":"#N/A"},{"$f":"IF(AND(AU132=36,$AS$4>=44,$AS$4<=45),AU132&\"I\",0)","v":{"$error":"#N/A"}},null,null,null,null,null,null,null,null,{"$error":"#N/A"},{"$f":"IF(AND($BE$4<=42,$BE$4>40),42,0)","v":{"$error":"#N/A"}},{"$f":"IF(AND(BF132=42,$BD$4>=11,$BD$4<=16),BF132&\"A\",0)","v":{"$error":"#N/A"}},null,null,{"$error":"#N/A"},{"$f":"IF(AND($BJ$4<=42,$BJ$4>40),42,0)","v":{"$error":"#N/A"}},{"$f":"IF(AND(BK132=42,$BI$4>=11,$BI$4<=16),BK132&\"A\",0)","v":{"$error":"#N/A"}}]
[null,63,7799,4,null,63,"8888",4,null,null,null,null,null,null,null,null,null,null,null,null,null,null,null,null,null,null,null,null,"Bottom Bead",{"$f":"(((Frame_Width-4.125)*2)+((CDIM3001-3.3125)*2))/12","v":-1.2395833333333333},7.1999999999999995E-2,-8.9249999999999982E-2,null,"Bottom Rail Reinf.",{"$f":"(TRUNC(((Frame_Width-3.625)-0.5)/2)*2-2)/12","v":-0.5},0.13300000000000001,-6.6500000000000004E-2,null,null,null,{"$error":"#N/A"},{"$f":"IF(AND($AO$4<=38,$AO$4>36),38,0)","v":{"$error":"#N/A"}},{"$f":"IF(AND(AP133=38,$AN$4>=11,$AN$4<=16),AP133&\"A\",0)","v":{"$error":"#N/A"}},null,null,{"$error":"#N/A"},{"$f":"IF(AND($AT$4<=38,$AT$4>36),38,0)","v":{"$error":"#N/A"}},{"$f":"IF(AND(AU133=38,$AS$4>=11,$AS$4<=16),AU133&\"A\",0)","v":{"$error":"#N/A"}},null,null,null,null,null,null,null,null,{"$f":"IF(AND(BF133>0,BG133>0),BF133,0)","v":{"$error":"#N/A"}},{"$error":"#N/A"},{"$f":"IF(AND(BF133=42,$BD$4>=17,$BD$4<=22),BF133&\"B\",0)","v":{"$error":"#N/A"}},null,null,{"$f":"IF(AND(BK133>0,BL133>0),BK133,0)","v":{"$error":"#N/A"}},{"$error":"#N/A"},{"$f":"IF(AND(BK133=42,$BI$4>=17,$BI$4<=22),BK133&\"B\",0)","v":{"$error":"#N/A"}}]
[null,64,7799,4,null,64,"8888",4,null,null,null,null,null,null,null,null,null,null,null,null,null,null,null,null,null,null,null,null,null,null,"Top Sash",{"$f":"IF(ModelNo=\"3001\",SUM(AF116:AF124),0)","v":0},null,"Bottom Stile Reinf.",{"$f":"(TRUNC((((TRUNC(((V200_CDIM-0.8125)*32+0.5))/32-0.0625)-1.46875)-0.25)/2)*2)/12","v":-0.16666666666666666},0.10100000000000001,-1.6833333333333332E-2,null,null,null,{"$f":"IF(AND(AP134>0,AQ134>0),AP134,0)","v":{"$error":"#N/A"}},{"$error":"#N/A"},{"$f":"IF(AND(AP134=38,$AN$4>=17,$AN$4<=22),AP134&\"B\",0)","v":{"$error":"#N/A"}},null,null,{"$f":"IF(AND(AU134>0,AV134>0),AU134,0)","v":{"$error":"#N/A"}},{"$error":"#N/A"},{"$f":"IF(AND(AU134=38,$AS$4>=17,$AS$4<=22),AU134&\"B\",0)","v":{"$error":"#N/A"}},null,null,null,null,null,null,null,null,{"$error":"#N/A"},{"$error":"#N/A"},{"$f":"IF(AND(BF134=42,$BD$4>=23,$BD$4<=27),BF134&\"C\",0)","v":{"$error":"#N/A"}},null,null,{"$error":"#N/A"},{"$error":"#N/A"},{"$f":"IF(AND(BK134=42,$BI$4>=23,$BI$4<=27),BK134&\"C\",0)","v":{"$error":"#N/A"}}]
[null,65,7899,4,null,65,"8889",4,null,null,null,null,null,null,null,null,null,null,null,null,null,null,null,null,null,null,null,null,null,null,"Bottom Sash",{"$f":"IF(ModelNo=\"3001\",SUM(AF125:AF133),0)","v":0},null,"Bottom Glass",{"$f":"(V200_BGW*V200_BGH)/144","v":5.46875E-2},{"$f":"$L$12","v":""},{"$error":"#VALUE!"},null,null,null,{"$error":"#N/A"},{"$error":"#N/A"},{"$f":"IF(AND(AP135=38,$AN$4>=23,$AN$4<=27),AP135&\"C\",0)","v":{"$error":"#N/A"}},null,null,{"$error":"#N/A"},{"$error":"#N/A"},{"$f":"IF(AND(AU135=38,$AS$4>=23,$AS$4<=27),AU135&\"C\",0)","v":{"$error":"#N/A"}},null,null,null,null,null,null,null,null,{"$error":"#N/A"},{"$error":"#N/A"},{"$f":"IF(AND(BF135=42,$BD$4>=28,$BD$4<=31),BF135&\"D\",0)","v":{"$error":"#N/A"}},null,null,{"$error":"#N/A"},{"$error":"#N/A"},{"$f":"IF(AND(BK135=42,$BI$4>=28,$BI$4<=31),BK135&\"D\",0)","v":{"$error":"#N/A"}}]
[null,66,7899,4,null,66,"8889",4,null,null,null,null,null,null,null,null,null,null,null,null,null,null,null,null,null,null,null,null,null,null,null,null,null,"Bottom Spacer",{"$f":"((V200_BGW*2)+(V200_BGH*2))/12","v":-0.95833333333333337},5.3600000000000002E-2,-5.1366666666666672E-2,null,null,null,{"$error":"#N/A"},{"$error":"#N/A"},{"$f":"IF(AND(AP136=38,$AN$4>=28,$AN$4<=32),AP136&\"D\",0)","v":{"$error":"#N/A"}},null,null,{"$error":"#N/A"},{"$error":"#N/A"},{"$f":"IF(AND(AU136=38,$AS$4>=28,$AS$4<=32),AU136&\"D\",0)","v":{"$error":"#N/A"}},null,null,null,null,null,null,null,null,{"$error":"#N/A"},{"$error":"#N/A"},{"$f":"IF(AND(BF136=42,$BD$4>=32,$BD$4<=34),BF136&\"E\",0)","v":{"$error":"#N/A"}},null,null,{"$error":"#N/A"},{"$error":"#N/A"},{"$f":"IF(AND(BK136=42,$BI$4>=32,$BI$4<=34),BK136&\"E\",0)","v":{"$error":"#N/A"}}]
[null,67,8899,4,null,67,"8899",4,null,null,null,null,null,null,null,null,null,null,null,null,null,null,null,null,null,null,null,null,"03A0","Length","Weight/ft","Weight",null,"Bottom Hardware",1,0.36,0.36,null,null,null,{"$error":"#N/A"},{"$error":"#N/A"},{"$f":"IF(AND(AP137=38,$AN$4>=33,$AN$4<=34),AP137&\"E\",0)","v":{"$error":"#N/A"}},null,null,{"$error":"#N/A"},{"$error":"#N/A"},{"$f":"IF(AND(AU137=38,$AS$4>=33,$AS$4<=34),AU137&\"E\",0)","v":{"$error":"#N/A"}},null,null,null,null,null,null,null,null,{"$error":"#N/A"},{"$error":"#N/A"},{"$f":"IF(AND(BF137=42,$BD$4>=35,$BD$4<=37),BF137&\"F\",0)","v":{"$error":"#N/A"}},null,null,{"$error":"#N/A"},{"$error":"#N/A"},{"$f":"IF(AND(BK137=42,$BI$4>=35,$BI$4<=37),BK137&\"F\",0)","v":{"$error":"#N/A"}}]
[null,68,8899,4,null,68,"8899",4,null,null,null,null,null,null,null,null,null,null,null,null,null,null,null,null,null,null,null,null,"Bottom Top Rail",{"$f":"(Frame_Width-3.125)/12","v":-0.26041666666666669},0.29699999999999999,{"$f":"AD138*AE138","v":-7.7343750000000003E-2},null,"Bottom Bead",{"$f":"(((Frame_Width-2.9375)*2)+((V200_CDIM-1.625)*2))/12","v":-0.76041666666666663},2.1000000000000001E-2,-1.596875E-2,null,null,null,{"$error":"#N/A"},{"$error":"#N/A"},{"$f":"IF(AND(AP138=38,$AN$4>=35,$AN$4<=37),AP138&\"F\",0)","v":{"$error":"#N/A"}},null,null,{"$error":"#N/A"},{"$error":"#N/A"},{"$f":"IF(AND(AU138=38,$AS$4>=35,$AS$4<=37),AU138&\"F\",0)","v":{"$error":"#N/A"}},null,null,null,null,null,null,null,null,{"$error":"#N/A"},{"$error":"#N/A"},{"$f":"IF(AND(BF138=42,$BD$4>=38,$BD$4<=40),BF138&\"G\",0)","v":{"$error":"#N/A"}},null,null,{"$error":"#N/A"},{"$error":"#N/A"},{"$f":"IF(AND(BK138=42,$BI$4>=38,$BI$4<=40),BK138&\"G\",0)","v":{"$error":"#N/A"}}]
[null,69,8999,4,null,69,"8999",4,null,null,null,null,null,null,null,null,null,null,null,null,null,null,null,null,null,null,null,null,"Bottom Bottom Rail",{"$f":"(Frame_Width-3.125)/12","v":-0.26041666666666669},0.23200000000000001,-6.0416666666666674E-2,null,null,null,"Top Sash",0,null,null,null,{"$error":"#N/A"},{"$error":"#N/A"},{"$f":"IF(AND(AP139=38,$AN$4>=38,$AN$4<=40),AP139&\"G\",0)","v":{"$error":"#N/A"}},null,null,{"$error":"#N/A"},{"$error":"#N/A"},{"$f":"IF(AND(AU139=38,$AS$4>=38,$AS$4<=40),AU139&\"G\",0)","v":{"$error":"#N/A"}},null,null,null,null,null,null,null,null,{"$error":"#N/A"},{"$error":"#N/A"},{"$f":"IF(AND(BF139=42,$BD$4>=41,$BD$4<=43),BF139&\"H\",0)","v":{"$error":"#N/A"}},null,null,{"$error":"#N/A"},{"$error":"#N/A"},{"$f":"IF(AND(BK139=42,$BI$4>=41,$BI$4<=43),BK139&\"H\",0)","v":{"$error":"#N/A"}}]
[null,70,8999,4,null,70,"8999",4,null,null,null,null,null,null,null,null,null,null,null,null,null,null,null,null,null,null,null,null,"Bottom Stile",{"$f":"(2*(CDIM03A0-1.125))/12","v":-0.1875},0.219,-4.1062500000000002E-2,null,null,null,"Bottom Sash",{"$f":"IF(ModelNo=\"V200\",SUM(AK130:AK138),0)","v":0},null,null,null,{"$error":"#N/A"},{"$error":"#N/A"},{"$f":"IF(AND(AP140=38,$AN$4>=41,$AN$4<=43),AP140&\"H\",0)","v":{"$error":"#N/A"}},null,null,{"$error":"#N/A"},{"$error":"#N/A"},{"$f":"IF(AND(AU140=38,$AS$4>=41,$AS$4<=43),AU140&\"H\",0)","v":{"$error":"#N/A"}},null,null,null,null,null,null,null,null,{"$error":"#N/A"},{"$error":"#N/A"},{"$f":"IF(AND(BF140=42,$BD$4>=44,$BD$4<=45),BF140&\"I\",0)","v":{"$error":"#N/A"}},null,null,{"$error":"#N/A"},{"$error":"#N/A"},{"$f":"IF(AND(BK140=42,$BI$4>=44,$BI$4<=45),BK140&\"I\",0)","v":{"$error":"#N/A"}}]
[null,71,9999,4,null,71,"9999",4,null,null,null,null,null,null,null,null,null,null,null,null,null,null,null,null,null,null,null,null,"Bottom Rail Reinf.",{"$f":"(TRUNC(((Frame_Width-3.125)-6)/2)*2)/12","v":-0.66666666666666663},{"$f":"IF(OR(EXTSELECT=2,Frame_Width<48,Frame_Height<84),0.0516,IF(OR(EXTSELECT=3,Frame_Width>48,Frame_Height>84),0.57,0))","v":5.16E-2},-3.44E-2,null,null,null,null,null,null,null,null,{"$error":"#N/A"},{"$error":"#N/A"},{"$f":"IF(AND(AP141=38,$AN$4>=44,$AN$4<=45),AP141&\"I\",0)","v":{"$error":"#N/A"}},null,null,{"$error":"#N/A"},{"$error":"#N/A"},{"$f":"IF(AND(AU141=38,$AS$4>=44,$AS$4<=45),AU141&\"I\",0)","v":{"$error":"#N/A"}},null,null,null,null,null,null,null,null,{"$error":"#N/A"},{"$f":"IF(AND($BE$4<=44,$BE$4>42),44,0)","v":{"$error":"#N/A"}},{"$f":"IF(AND(BF141=44,$BD$4>=11,$BD$4<=16),BF141&\"A\",0)","v":{"$error":"#N/A"}},null,null,{"$error":"#N/A"},{"$f":"IF(AND($BJ$4<=44,$BJ$4>42),44,0)","v":{"$error":"#N/A"}},{"$f":"IF(AND(BK141=44,$BI$4>=11,$BI$4<=16),BK141&\"A\",0)","v":{"$error":"#N/A"}}]
[null,72,9999,4,null,72,"9999",4,null,null,null,null,null,null,null,null,null,null,null,null,null,null,null,null,null,null,null,null,"Bottom Stile Reinf.",{"$f":"IF(OR(Frame_Width>48,Frame_Height>84,EXTTYPE=\"Steel\"),((TRUNC(((CDIM03A0-1.125)-4)/2)*2)/12)*2,0)","v":0},0.45600000000000002,0,null,null,null,null,null,null,null,null,{"$error":"#N/A"},{"$f":"IF(AND($AO$4<=40,$AO$4>38),40,0)","v":{"$error":"#N/A"}},{"$f":"IF(AND(AP142=40,$AN$4>=11,$AN$4<=16),AP142&\"A\",0)","v":{"$error":"#N/A"}},null,null,{"$error":"#N/A"},{"$f":"IF(AND($AT$4<=40,$AT$4>38),40,0)","v":{"$error":"#N/A"}},{"$f":"IF(AND(AU142=40,$AS$4>=11,$AS$4<=16),AU142&\"A\",0)","v":{"$error":"#N/A"}},null,null,null,null,null,null,null,null,{"$error":"#N/A"},{"$error":"#N/A"},{"$f":"IF(AND(BF142=44,$BD$4>=17,$BD$4<=22),BF142&\"B\",0)","v":{"$error":"#N/A"}},null,null,{"$error":"#N/A"},{"$error":"#N/A"},{"$f":"IF(AND(BK142=44,$BI$4>=17,$BI$4<=22),BK142&\"B\",0)","v":{"$error":"#N/A"}}]
[null,null,null,null,null,null,null,null,null,null,null,null,null,null,null,null,null,null,null,null,null,null,null,null,null,null,null,null,"Bottom Glass",{"$f":"(CMR!$E$120*CMR!$E$122)/144","v":8.9680989583333329E-2},{"$f":"$L$12","v":""},{"$error":"#VALUE!"},null,"1700","Length","Weight/ft","Weight",null,null,null,{"$error":"#N/A"},{"$error":"#N/A"},{"$f":"IF(AND(AP143=40,$AN$4>=17,$AN$4<=22),AP143&\"B\",0)","v":{"$error":"#N/A"}},null,null,{"$error":"#N/A"},{"$error":"#N/A"},{"$f":"IF(AND(AU143=40,$AS$4>=17,$AS$4<=22),AU143&\"B\",0)","v":{"$error":"#N/A"}},null,null,null,null,null,null,null,null,{"$error":"#N/A"},{"$error":"#N/A"},{"$f":"IF(AND(BF143=44,$BD$4>=23,$BD$4<=27),BF143&\"C\",0)","v":{"$error":"#N/A"}},null,null,{"$error":"#N/A"},{"$error":"#N/A"},{"$f":"IF(AND(BK143=44,$BI$4>=23,$BI$4<=27),BK143&\"C\",0)","v":{"$error":"#N/A"}}]
[null,null,null,null,null,null,null,null,null,null,null,null,null,null,null,null,null,null,null,null,null,null,null,null,null,null,null,null,"Bottom Spacer",{"$f":"((CMR!$E$120*2)+(CMR!$E$122*2))/12","v":-1.2447916666666667},5.3600000000000002E-2,-6.672083333333334E-2,null,"Bottom Top Rail",{"$f":"(Frame_Width-2.1875)/12","v":-0.18229166666666666},0.221,{"$f":"AI144*AJ144","v":-4.028645833333333E-2},null,null,null,{"$error":"#N/A"},{"$error":"#N/A"},{"$f":"IF(AND(AP144=40,$AN$4>=23,$AN$4<=27),AP144&\"C\",0)","v":{"$error":"#N/A"}},null,null,{"$error":"#N/A"},{"$error":"#N/A"},{"$f":"IF(AND(AU144=40,$AS$4>=23,$AS$4<=27),AU144&\"C\",0)","v":{"$error":"#N/A"}},null,null,null,null,null,null,null,null,{"$error":"#N/A"},{"$error":"#N/A"},{"$f":"IF(AND(BF144=44,$BD$4>=28,$BD$4<=32),BF144&\"D\",0)","v":{"$error":"#N/A"}},null,null,{"$error":"#N/A"},{"$error":"#N/A"},{"$f":"IF(AND(BK144=44,$BI$4>=28,$BI$4<=32),BK144&\"D\",0)","v":{"$error":"#N/A"}}]
[null,null,null,null,null,null,null,null,null,null,null,null,null,null,null,null,null,null,null,null,null,null,null,null,null,null,null,null,"Bottom Hardware",1,0.36,0.36,null,"Bottom Bottom Rail",{"$f":"(Frame_Width-2.1875)/12","v":-0.18229166666666666},0.19600000000000001,-3.5729166666666666E-2,null,null,null,{"$error":"#N/A"},{"$error":"#N/A"},{"$f":"IF(AND(AP145=40,$AN$4>=28,$AN$4<=32),AP145&\"D\",0)","v":{"$error":"#N/A"}},null,null,{"$error":"#N/A"},{"$error":"#N/A"},{"$f":"IF(AND(AU145=40,$AS$4>=28,$AS$4<=32),AU145&\"D\",0)","v":{"$error":"#N/A"}},null,null,null,null,null,null,null,null,{"$error":"#N/A"},{"$error":"#N/A"},{"$f":"IF(AND(BF145=44,$BD$4>=33,$BD$4<=34),BF145&\"E\",0)","v":{"$error":"#N/A"}},null,null,{"$error":"#N/A"},{"$error":"#N/A"},{"$f":"IF(AND(BK145=44,$BI$4>=33,$BI$4<=34),BK145&\"E\",0)","v":{"$error":"#N/A"}}]
[null,null,null,null,null,null,null,null,null,null,null,null,null,null,null,null,null,null,null,null,null,null,null,null,null,null,null,null,"Bottom Bead",{"$f":"(((Frame_Width-4.125)*2)+((CDIM03A0-3.3125)*2))/12","v":-1.2395833333333333},7.1999999999999995E-2,-8.9249999999999982E-2,null,"Bottom Stile",{"$f":"((CDIM_1700-0.875)*2)/12","v":-0.14583333333333334},0.19600000000000001,-2.8583333333333336E-2,null,null,null,{"$error":"#N/A"},{"$error":"#N/A"},{"$f":"IF(AND(AP146=40,$AN$4>=33,$AN$4<=34),AP146&\"E\",0)","v":{"$error":"#N/A"}},null,null,{"$error":"#N/A"},{"$error":"#N/A"},{"$f":"IF(AND(AU146=40,$AS$4>=33,$AS$4<=34),AU146&\"E\",0)","v":{"$error":"#N/A"}},null,null,null,null,null,null,null,null,{"$error":"#N/A"},{"$error":"#N/A"},{"$f":"IF(AND(BF146=44,$BD$4>=35,$BD$4<=37),BF146&\"F\",0)","v":{"$error":"#N/A"}},null,null,{"$error":"#N/A"},{"$error":"#N/A"},{"$f":"IF(AND(BK146=44,$BI$4>=35,$BI$4<=37),BK146&\"F\",0)","v":{"$error":"#N/A"}}]
[null,null,null,null,null,null,null,null,null,null,null,null,null,null,null,null,null,null,null,null,null,null,null,null,null,null,null,null,null,null,"Bottom Sash",{"$f":"IF(OR(ModelNo=\"03A0\",ModelNo=\"S140\",ModelNo=\"S144\",ModelNo=\"S146\",ModelNo=\"S140 (HP)\",ModelNo=\"S144 (HP)\",ModelNo=\"S146 (HP)\"),SUM(AF138:AF146),0)","v":0},null,"Bottom Rail Reinf.",{"$f":"IF(STILE_REINF>0,(TRUNC(((Frame_Width-3.625)-0.5)/2)*2-2)/12,0)","v":0},0.13300000000000001,0,null,null,null,{"$error":"#N/A"},{"$error":"#N/A"},{"$f":"IF(AND(AP147=40,$AN$4>=35,$AN$4<=37),AP147&\"F\",0)","v":{"$error":"#N/A"}},null,null,{"$error":"#N/A"},{"$error":"#N/A"},{"$f":"IF(AND(AU147=40,$AS$4>=35,$AS$4<=37),AU147&\"F\",0)","v":{"$error":"#N/A"}},null,null,null,null,null,null,null,null,{"$error":"#N/A"},{"$error":"#N/A"},{"$f":"IF(AND(BF147=44,$BD$4>=38,$BD$4<=40),BF147&\"G\",0)","v":{"$error":"#N/A"}},null,null,{"$error":"#N/A"},{"$error":"#N/A"},{"$f":"IF(AND(BK147=44,$BI$4>=38,$BI$4<=40),BK147&\"G\",0)","v":{"$error":"#N/A"}}]
[null,null,null,null,null,null,null,null,null,null,null,null,null,null,null,null,null,null,null,null,null,null,null,null,null,null,null,null,null,null,null,null,null,"Bottom Stile Reinf.",{"$f":"IF(STILE_REINF>0,(((((CDIM_1700-4.03125))/2)*2)/12)*2,0)","v":0},0.13300000000000001,0,null,null,null,{"$error":"#N/A"},{"$error":"#N/A"},{"$f":"IF(AND(AP148=40,$AN$4>=38,$AN$4<=40),AP148&\"G\",0)","v":{"$error":"#N/A"}},null,null,{"$error":"#N/A"},{"$error":"#N/A"},{"$f":"IF(AND(AU148=40,$AS$4>=38,$AS$4<=40),AU148&\"G\",0)","v":{"$error":"#N/A"}},null,null,null,null,null,null,null,null,{"$error":"#N/A"},{"$error":"#N/A"},{"$f":"IF(AND(BF148=44,$BD$4>=41,$BD$4<=43),BF148&\"H\",0)","v":{"$error":"#N/A"}},null,null,{"$error":"#N/A"},{"$error":"#N/A"},{"$f":"IF(AND(BK148=44,$BI$4>=41,$BI$4<=43),BK148&\"H\",0)","v":{"$error":"#N/A"}}]
[null,null,null,null,null,null,null,null,null,null,null,null,null,null,null,null,null,null,null,null,null,null,null,null,null,null,null,null,null,null,null,null,null,"Bottom Glass",{"$f":"(Data!D1101*Data!D1102)/144","v":5.1188151041666664E-2},{"$f":"$L$12","v":""},{"$error":"#VALUE!"},null,null,null,{"$error":"#N/A"},{"$error":"#N/A"},{"$f":"IF(AND(AP149=40,$AN$4>=41,$AN$4<=43),AP149&\"H\",0)","v":{"$error":"#N/A"}},null,null,{"$error":"#N/A"},{"$error":"#N/A"},{"$f":"IF(AND(AU149=40,$AS$4>=41,$AS$4<=43),AU149&\"H\",0)","v":{"$error":"#N/A"}},null,null,null,null,null,null,null,null,{"$error":"#N/A"},{"$error":"#N/A"},{"$f":"IF(AND(BF149=44,$BD$4>=44,$BD$4<=45),BF149&\"I\",0)","v":{"$error":"#N/A"}},null,null,{"$error":"#N/A"},{"$error":"#N/A"},{"$f":"IF(AND(BK149=44,$BI$4>=44,$BI$4<=45),BK149&\"I\",0)","v":{"$error":"#N/A"}}]
[null,null,null,null,null,null,null,null,null,null,null,null,null,null,null,null,null,null,null,null,null,null,null,null,null,null,null,null,"1900","Length","Weight/ft","Weight",null,"Bottom Spacer",{"$f":"((Data!D1101*2)+(Data!D1102*2))/12","v":-0.93229166666666663},5.3600000000000002E-2,-4.9970833333333332E-2,null,null,null,{"$error":"#N/A"},{"$error":"#N/A"},{"$f":"IF(AND(AP150=40,$AN$4>=44,$AN$4<=45),AP150&\"I\",0)","v":{"$error":"#N/A"}},null,null,{"$error":"#N/A"},{"$error":"#N/A"},{"$f":"IF(AND(AU150=40,$AS$4>=44,$AS$4<=45),AU150&\"I\",0)","v":{"$error":"#N/A"}}]
[null,null,null,null,null,null,null,null,null,null,null,null,null,null,null,null,null,null,null,null,null,null,null,null,null,null,null,null,"Bottom Top Rail",{"$f":"(Frame_Width-2.1875)/12","v":-0.18229166666666666},0.221,{"$f":"AD151*AE151","v":-4.028645833333333E-2},null,"Bottom Hardware",1,0.36,0.36,null,null,null,{"$error":"#N/A"},{"$f":"IF(AND($AO$4<=42,$AO$4>40),42,0)","v":{"$error":"#N/A"}},{"$f":"IF(AND(AP151=42,$AN$4>=11,$AN$4<=16),AP151&\"A\",0)","v":{"$error":"#N/A"}},null,null,{"$error":"#N/A"},{"$f":"IF(AND($AT$4<=42,$AT$4>40),42,0)","v":{"$error":"#N/A"}},{"$f":"IF(AND(AU151=42,$AS$4>=11,$AS$4<=16),AU151&\"A\",0)","v":{"$error":"#N/A"}}]
[null,null,null,null,null,null,null,null,null,null,null,null,null,null,null,null,null,null,null,null,null,null,null,null,null,null,null,null,"Bottom Bottom Rail",{"$f":"(Frame_Width-2.1875)/12","v":-0.18229166666666666},0.19600000000000001,-3.5729166666666666E-2,null,"Bottom Bead",{"$f":"(((Frame_Width-2.9375)*2)+((CDIM_1700-1.625)*2))/12","v":-0.76041666666666663},2.1000000000000001E-2,-1.596875E-2,null,null,null,{"$error":"#N/A"},{"$error":"#N/A"},{"$f":"IF(AND(AP152=42,$AN$4>=17,$AN$4<=22),AP152&\"B\",0)","v":{"$error":"#N/A"}},null,null,{"$error":"#N/A"},{"$error":"#N/A"},{"$f":"IF(AND(AU152=42,$AS$4>=17,$AS$4<=22),AU152&\"B\",0)","v":{"$error":"#N/A"}}]
[null,null,null,null,null,null,null,null,null,null,null,null,null,null,null,null,null,null,null,null,null,null,null,null,null,null,null,null,"Bottom Stile",{"$f":"((CDIM_1900-0.844)*2)/12","v":-0.14066666666666666},0.19600000000000001,-2.7570666666666667E-2,null,null,null,"Bottom Sash",{"$f":"IF(OR(ModelNo=\"1700\",ModelNo=\"S140\",ModelNo=\"S144\",ModelNo=\"S146\"),SUM(AK144:AK152),0)","v":0},null,null,null,{"$error":"#N/A"},{"$error":"#N/A"},{"$f":"IF(AND(AP153=42,$AN$4>=23,$AN$4<=27),AP153&\"C\",0)","v":{"$error":"#N/A"}},null,null,{"$error":"#N/A"},{"$error":"#N/A"},{"$f":"IF(AND(AU153=42,$AS$4>=23,$AS$4<=27),AU153&\"C\",0)","v":{"$error":"#N/A"}}]
[null,null,null,null,null,null,null,null,null,null,null,null,null,null,null,null,null,null,null,null,null,null,null,null,null,null,null,null,"Bottom Rail Reinf.",{"$f":"IF(STILE_REINF>0,(TRUNC(((Frame_Width-8.688)-0.5)/2)*2)/12,0)","v":0},0.13300000000000001,0,null,null,null,null,null,null,null,null,{"$error":"#N/A"},{"$error":"#N/A"},{"$f":"IF(AND(AP154=42,$AN$4>=28,$AN$4<=32),AP154&\"D\",0)","v":{"$error":"#N/A"}},null,null,{"$error":"#N/A"},{"$error":"#N/A"},{"$f":"IF(AND(AU154=42,$AS$4>=28,$AS$4<=32),AU154&\"D\",0)","v":{"$error":"#N/A"}}]
[null,null,null,null,null,null,null,null,null,null,null,null,null,null,null,null,null,null,null,null,null,null,null,null,null,null,null,null,"Bottom Stile Reinf.",{"$f":"IF(STILE_REINF>0,(((((CDIM_1900-4.094))/2)*2)/12)*2,0)","v":0},0.13300000000000001,0,null,"1720","Length","Weight/ft","Weight",null,null,null,{"$error":"#N/A"},{"$error":"#N/A"},{"$f":"IF(AND(AP155=42,$AN$4>=33,$AN$4<=34),AP155&\"E\",0)","v":{"$error":"#N/A"}},null,null,{"$error":"#N/A"},{"$error":"#N/A"},{"$f":"IF(AND(AU155=42,$AS$4>=33,$AS$4<=34),AU155&\"E\",0)","v":{"$error":"#N/A"}}]
[null,null,null,null,null,null,null,null,null,null,null,null,null,null,null,null,null,null,null,null,null,null,null,null,null,null,null,null,"Bottom Glass",{"$f":"(Data!D1185*Data!D1186)/144","v":4.9981011284722224E-2},{"$f":"$L$12","v":""},{"$error":"#VALUE!"},null,"Bottom Top Rail",{"$f":"(Frame_Width-2.4375)/12","v":-0.203125},0.221,{"$f":"AI156*AJ156","v":-4.4890625000000003E-2},null,null,null,{"$error":"#N/A"},{"$error":"#N/A"},{"$f":"IF(AND(AP156=42,$AN$4>=35,$AN$4<=37),AP156&\"F\",0)","v":{"$error":"#N/A"}},null,null,{"$error":"#N/A"},{"$error":"#N/A"},{"$f":"IF(AND(AU156=42,$AS$4>=35,$AS$4<=37),AU156&\"F\",0)","v":{"$error":"#N/A"}}]
[null,null,null,null,null,null,null,null,null,null,null,null,null,null,null,null,null,null,null,null,null,null,null,null,null,null,null,null,"Bottom Spacer",{"$f":"((Data!D1185*2)+(Data!D1186*2))/12","v":-0.921875},5.3600000000000002E-2,-4.9412500000000005E-2,null,"Bottom Bottom Rail",{"$f":"(Frame_Width-2.4375)/12","v":-0.203125},0.19600000000000001,-3.9812500000000001E-2,null,null,null,{"$error":"#N/A"},{"$error":"#N/A"},{"$f":"IF(AND(AP157=42,$AN$4>=38,$AN$4<=40),AP157&\"G\",0)","v":{"$error":"#N/A"}},null,null,{"$error":"#N/A"},{"$error":"#N/A"},{"$f":"IF(AND(AU157=42,$AS$4>=38,$AS$4<=40),AU157&\"G\",0)","v":{"$error":"#N/A"}}]
[null,null,null,null,null,null,null,null,null,null,null,null,null,null,null,null,null,null,null,null,null,null,null,null,null,null,null,null,"Bottom Hardware",1,0.36,0.36,null,"Bottom Stile",{"$f":"((CDIM_1720-0.84375)*2)/12","v":-0.140625},0.19600000000000001,-2.75625E-2,null,null,null,{"$error":"#N/A"},{"$error":"#N/A"},{"$f":"IF(AND(AP158=42,$AN$4>=41,$AN$4<=43),AP158&\"H\",0)","v":{"$error":"#N/A"}},null,null,{"$error":"#N/A"},{"$error":"#N/A"},{"$f":"IF(AND(AU158=42,$AS$4>=41,$AS$4<=43),AU158&\"H\",0)","v":{"$error":"#N/A"}}]
[null,null,null,null,null,null,null,null,null,null,null,null,null,null,null,null,null,null,null,null,null,null,null,null,null,null,null,null,"Bottom Bead",{"$f":"(((Frame_Width-2.9375)*2)+((DDIM_1900-1.625)*2))/12","v":-0.76041666666666663},2.1000000000000001E-2,-1.596875E-2,null,"Bottom Rail Reinf.",{"$f":"IF(STILE_REINF>0,(TRUNC((((Frame_Width/2-2.4375)-6.25)-0.5)/2)*2)/12,0)","v":0},0.13300000000000001,0,null,null,null,{"$error":"#N/A"},{"$error":"#N/A"},{"$f":"IF(AND(AP159=42,$AN$4>=44,$AN$4<=45),AP159&\"I\",0)","v":{"$error":"#N/A"}},null,null,{"$error":"#N/A"},{"$error":"#N/A"},{"$f":"IF(AND(AU159=42,$AS$4>=44,$AS$4<=45),AU159&\"I\",0)","v":{"$error":"#N/A"}}]
[null,null,null,null,null,null,null,null,null,null,null,null,null,null,null,null,null,null,null,null,null,null,null,null,null,null,null,null,null,null,"Bottom Sash",{"$f":"IF(OR(ModelNo=\"1900\",ModelNo=\"S140\",ModelNo=\"S144\",ModelNo=\"S146\"),SUM(AF151:AF159),0)","v":0},null,"Bottom Stile Reinf.",{"$f":"IF(STILE_REINF>0,(((((CDIM_1720-4.03125))/2)*2)/12)*2,0)","v":0},0.13300000000000001,0,null,null,null,{"$error":"#N/A"},{"$f":"IF(AND($AO$4<=44,$AO$4>42),44,0)","v":{"$error":"#N/A"}},{"$f":"IF(AND(AP160=44,$AN$4>=11,$AN$4<=16),AP160&\"A\",0)","v":{"$error":"#N/A"}},null,null,{"$error":"#N/A"},{"$f":"IF(AND($AT$4<=44,$AT$4>42),44,0)","v":{"$error":"#N/A"}},{"$f":"IF(AND(AU160=44,$AS$4>=11,$AS$4<=16),AU160&\"A\",0)","v":{"$error":"#N/A"}}]
[null,null,null,null,null,null,null,null,null,null,null,null,null,null,null,null,null,null,null,null,null,null,null,null,null,null,null,null,null,null,null,null,null,"Bottom Glass",{"$f":"(Data!D1157*Data!D1158)/144","v":5.3615993923611112E-2},{"$f":"$L$12","v":""},{"$error":"#VALUE!"},null,null,null,{"$error":"#N/A"},{"$error":"#N/A"},{"$f":"IF(AND(AP161=44,$AN$4>=17,$AN$4<=22),AP161&\"B\",0)","v":{"$error":"#N/A"}},null,null,{"$error":"#N/A"},{"$error":"#N/A"},{"$f":"IF(AND(AU161=44,$AS$4>=17,$AS$4<=22),AU161&\"B\",0)","v":{"$error":"#N/A"}}]
[null,null,null,null,null,null,null,null,null,null,null,null,null,null,null,null,null,null,null,null,null,null,null,null,null,null,null,null,"1920","Length","Weight/ft","Weight",null,"Bottom Spacer",{"$f":"((Data!D1157*2)+(Data!D1158*2))/12","v":-0.96354166666666663},5.3600000000000002E-2,-5.1645833333333335E-2,null,null,null,{"$error":"#N/A"},{"$error":"#N/A"},{"$f":"IF(AND(AP162=44,$AN$4>=23,$AN$4<=27),AP162&\"C\",0)","v":{"$error":"#N/A"}},null,null,{"$error":"#N/A"},{"$error":"#N/A"},{"$f":"IF(AND(AU162=44,$AS$4>=23,$AS$4<=27),AU162&\"C\",0)","v":{"$error":"#N/A"}}]
[null,null,null,null,null,null,null,null,null,null,null,null,null,null,null,null,null,null,null,null,null,null,null,null,null,null,null,null,"Bottom Top Rail",{"$f":"(Frame_Width/2-2.4375)/12","v":-0.203125},0.221,{"$f":"AD163*AE163","v":-4.4890625000000003E-2},null,"Bottom Hardware",1,0.36,0.36,null,null,null,{"$error":"#N/A"},{"$error":"#N/A"},{"$f":"IF(AND(AP163=44,$AN$4>=28,$AN$4<=32),AP163&\"D\",0)","v":{"$error":"#N/A"}},null,null,{"$error":"#N/A"},{"$error":"#N/A"},{"$f":"IF(AND(AU163=44,$AS$4>=28,$AS$4<=32),AU163&\"D\",0)","v":{"$error":"#N/A"}}]
[null,null,null,null,null,null,null,null,null,null,null,null,null,null,null,null,null,null,null,null,null,null,null,null,null,null,null,null,"Bottom Bottom Rail",{"$f":"(Frame_Width/2-2.4375)/12","v":-0.203125},0.19600000000000001,-3.9812500000000001E-2,null,"Bottom Bead",{"$f":"(((Data!D1375-0.75)*2)+((Data!D1376-0.781)*2))/12","v":-0.25516666666666671},2.1000000000000001E-2,-5.3585000000000013E-3,null,null,null,{"$error":"#N/A"},{"$error":"#N/A"},{"$f":"IF(AND(AP164=44,$AN$4>=33,$AN$4<=34),AP164&\"E\",0)","v":{"$error":"#N/A"}},null,null,{"$error":"#N/A"},{"$error":"#N/A"},{"$f":"IF(AND(AU164=44,$AS$4>=33,$AS$4<=34),AU164&\"E\",0)","v":{"$error":"#N/A"}}]
[null,null,null,null,null,null,null,null,null,null,null,null,null,null,null,null,null,null,null,null,null,null,null,null,null,null,null,null,"Bottom Stile",{"$f":"((CDIM_1920-0.844)*2)/12","v":-0.14066666666666666},0.19600000000000001,-2.7570666666666667E-2,null,null,null,"Bottom Sash",{"$f":"IF(ModelNo=\"1720\",SUM(AK156:AK164),0)","v":0},null,null,null,{"$error":"#N/A"},{"$error":"#N/A"},{"$f":"IF(AND(AP165=44,$AN$4>=35,$AN$4<=37),AP165&\"F\",0)","v":{"$error":"#N/A"}},null,null,{"$error":"#N/A"},{"$error":"#N/A"},{"$f":"IF(AND(AU165=44,$AS$4>=35,$AS$4<=37),AU165&\"F\",0)","v":{"$error":"#N/A"}}]
[null,null,null,null,null,null,null,null,null,null,null,null,null,null,null,null,null,null,null,null,null,null,null,null,null,null,null,null,"Bottom Rail Reinf.",{"$f":"IF(STILE_REINF>0,(TRUNC(((Frame_Width/2-8.9375)-0.5)/2)*2)/12,0)","v":0},0.13300000000000001,0,null,null,null,null,null,null,null,null,{"$error":"#N/A"},{"$error":"#N/A"},{"$f":"IF(AND(AP166=44,$AN$4>=38,$AN$4<=40),AP166&\"G\",0)","v":{"$error":"#N/A"}},null,null,{"$error":"#N/A"},{"$error":"#N/A"},{"$f":"IF(AND(AU166=44,$AS$4>=38,$AS$4<=40),AU166&\"G\",0)","v":{"$error":"#N/A"}}]
[null,null,null,null,null,null,null,null,null,null,null,null,null,null,null,null,null,null,null,null,null,null,null,null,null,null,null,null,"Bottom Stile Reinf.",{"$f":"IF(STILE_REINF>0,(((((CDIM_1920-4.094))/2)*2)/12)*2,0)","v":0},0.13300000000000001,0,null,"1730","Length","Weight/ft","Weight",null,null,null,{"$error":"#N/A"},{"$error":"#N/A"},{"$f":"IF(AND(AP167=44,$AN$4>=41,$AN$4<=43),AP167&\"H\",0)","v":{"$error":"#N/A"}},null,null,{"$error":"#N/A"},{"$error":"#N/A"},{"$f":"IF(AND(AU167=44,$AS$4>=41,$AS$4<=43),AU167&\"H\",0)","v":{"$error":"#N/A"}}]
[null,null,null,null,null,null,null,null,null,null,null,null,null,null,null,null,null,null,null,null,null,null,null,null,null,null,null,null,"Bottom Glass",{"$f":"(Data!D1241*Data!D1242)/144","v":5.3615993923611112E-2},{"$f":"$L$12","v":""},{"$error":"#VALUE!"},null,"Bottom Top Rail",{"$f":"(Frame_Width/3-2.53125)/12","v":-0.2109375},0.221,{"$f":"AI168*AJ168","v":-4.6617187499999997E-2},null,null,null,{"$error":"#N/A"},{"$error":"#N/A"},{"$f":"IF(AND(AP168=44,$AN$4>=44,$AN$4<=45),AP168&\"I\",0)","v":{"$error":"#N/A"}},null,null,{"$error":"#N/A"},{"$error":"#N/A"},{"$f":"IF(AND(AU168=44,$AS$4>=44,$AS$4<=45),AU168&\"I\",0)","v":{"$error":"#N/A"}}]
[null,null,null,null,null,null,null,null,null,null,null,null,null,null,null,null,null,null,null,null,null,null,null,null,null,null,null,null,"Bottom Spacer",{"$f":"((Data!D1241*2)+(Data!D1242*2))/12","v":-0.96354166666666663},5.3600000000000002E-2,-5.1645833333333335E-2,null,"Bottom Bottom Rail",{"$f":"(Frame_Width/3-2.53125)/12","v":-0.2109375},0.19600000000000001,-4.1343749999999999E-2]
[null,null,null,null,null,null,null,null,null,null,null,null,null,null,null,null,null,null,null,null,null,null,null,null,null,null,null,null,"Bottom Hardware",1,0.36,0.36,null,"Bottom Stile",{"$f":"((CDIM_1730-0.84375)*2)/12","v":-0.140625},0.19600000000000001,-2.75625E-2]
[null,null,null,null,null,null,null,null,null,null,null,null,null,null,null,null,null,null,null,null,null,null,null,null,null,null,null,null,"Bottom Bead",{"$f":"(((Frame_Width/2-3.2)*2)+((DDIM_1920-1.625)*2))/12","v":-0.8041666666666667},2.1000000000000001E-2,-1.6887500000000003E-2,null,"Bottom Rail Reinf.",{"$f":"IF(STILE_REINF>0,(TRUNC((((Frame_Width/3-2.53125)-7)-0.5)/2)*2)/12,0)","v":0},0.13300000000000001,0]
[null,null,null,null,null,null,null,null,null,null,null,null,null,null,null,null,null,null,null,null,null,null,null,null,null,null,null,null,null,null,"Bottom Sash",{"$f":"IF(ModelNo=\"1920\",SUM(AF163:AF171),0)","v":0},null,"Bottom Stile Reinf.",{"$f":"IF(STILE_REINF>0,(((((CDIM_1730-4.03125))/2)*2)/12)*2,0)","v":0},0.13300000000000001,0]
[null,null,null,null,null,null,null,null,null,null,null,null,null,null,null,null,null,null,null,null,null,null,null,null,null,null,null,null,null,null,null,null,null,"Bottom Glass",{"$f":"(Data!D1171*Data!D1172)/144","v":5.5433485243055552E-2},{"$f":"$L$12","v":""},{"$error":"#VALUE!"}]
[null,null,null,null,null,null,null,null,null,null,null,null,null,null,null,null,null,null,null,null,null,null,null,null,null,null,null,null,"1930","Length","Weight/ft","Weight",null,"Bottom Spacer",{"$f":"((Data!D1171*2)+(Data!D1172*2))/12","v":-0.984375},5.3600000000000002E-2,-5.2762500000000004E-2]
[null,null,null,null,null,null,null,null,null,null,null,null,null,null,null,null,null,null,null,null,null,null,null,null,null,null,null,null,"Bottom Top Rail",{"$f":"(Frame_Width/3-2.53125)/12","v":-0.2109375},0.221,{"$f":"AD175*AE175","v":-4.6617187499999997E-2},null,"Bottom Hardware",1,0.36,0.36]
[null,null,null,null,null,null,null,null,null,null,null,null,null,null,null,null,null,null,null,null,null,null,null,null,null,null,null,null,"Bottom Bottom Rail",{"$f":"(Frame_Width/3-2.53125)/12","v":-0.2109375},0.19600000000000001,-4.1343749999999999E-2,null,"Bottom Bead",{"$f":"(((Data!D1389-0.75)*2)+((Data!D1390-0.781)*2))/12","v":-0.25516666666666671},2.1000000000000001E-2,-5.3585000000000013E-3]
[null,null,null,null,null,null,null,null,null,null,null,null,null,null,null,null,null,null,null,null,null,null,null,null,null,null,null,null,"Bottom Stile",{"$f":"((CDIM_1930-0.844)*2)/12","v":-0.14066666666666666},0.19600000000000001,-2.7570666666666667E-2,null,null,null,"Bottom Sash",{"$f":"IF(ModelNo=\"1730\",SUM(AK168:AK176),0)","v":0}]
[null,null,null,null,null,null,null,null,null,null,null,null,null,null,null,null,null,null,null,null,null,null,null,null,null,null,null,null,"Bottom Rail Reinf.",{"$f":"IF(STILE_REINF>0,(TRUNC(((Frame_Width/3-8.9375)-0.5)/2)*2)/12,0)","v":0},0.13300000000000001,0]
[null,null,null,null,null,null,null,null,null,null,null,null,null,null,null,null,null,null,null,null,null,null,null,null,null,null,null,null,"Bottom Stile Reinf.",{"$f":"IF(STILE_REINF>0,(((((CDIM_1930-4.094))/2)*2)/12)*2,0)","v":0},0.13300000000000001,0,null,"1901/1921/1931","Length","Weight/ft","Weight"]
[null,null,null,null,null,null,null,null,null,null,null,null,null,null,null,null,null,null,null,null,null,null,null,null,null,null,null,null,"Bottom Glass",{"$f":"(Data!D1255*Data!D1256)/144","v":5.4979112413194448E-2},{"$f":"$L$12","v":""},{"$error":"#VALUE!"},null,"Top Top Rail",{"$f":"IF(ModelNo=\"1901\",(Frame_Width-3.4375)/12,IF(ModelNo=\"1921\",(Frame_Width/2-3.6875)/12,IF(ModelNo=\"1931\",(Frame_Width/3-3.75)/12,0)))","v":0},0.20799999999999999,{"$f":"AI180*AJ180","v":0}]
[null,null,null,null,null,null,null,null,null,null,null,null,null,null,null,null,null,null,null,null,null,null,null,null,null,null,null,null,"Bottom Spacer",{"$f":"((Data!D1255*2)+(Data!D1256*2))/12","v":-0.97916666666666663},5.3600000000000002E-2,-5.2483333333333333E-2,null,"Top Bottom Rail",{"$f":"IF(ModelNo=\"1901\",(Frame_Width-3.4375)/12,IF(ModelNo=\"1921\",(Frame_Width/2-3.6875)/12,IF(ModelNo=\"1931\",(Frame_Width/3-3.75)/12,0)))","v":0},0.23799999999999999,0]
[null,null,null,null,null,null,null,null,null,null,null,null,null,null,null,null,null,null,null,null,null,null,null,null,null,null,null,null,"Bottom Hardware",1,0.36,0.36,null,"Top Stile",{"$f":"(2*(CDIM_1901-0.90625))/12","v":-0.15104166666666666},0.19600000000000001,-2.9604166666666668E-2]
[null,null,null,null,null,null,null,null,null,null,null,null,null,null,null,null,null,null,null,null,null,null,null,null,null,null,null,null,"Bottom Bead",{"$f":"(((Frame_Width/3-3.281)*2)+((DDIM_1930-1.625)*2))/12","v":-0.81766666666666676},2.1000000000000001E-2,-1.7171000000000002E-2,null,"Top Rail Reinf.",{"$f":"IF(ModelNo=\"1901\",(Frame_Width-9.4375)/12,IF(ModelNo=\"1921\",(Frame_Width/2-9.6875)/12,IF(ModelNo=\"1931\",(Frame_Width/3-9.75)/12,0)))","v":0},0.10100000000000001,0]
[null,null,null,null,null,null,null,null,null,null,null,null,null,null,null,null,null,null,null,null,null,null,null,null,null,null,null,null,null,null,"Bottom Sash",{"$f":"IF(ModelNo=\"1930\",SUM(AF175:AF183),0)","v":0},null,"Top Stile Reinf",{"$f":"IF(STILE_REINF>0,(((((DDIM_1901-11))/2)*2)/12)*2,0)","v":0},0.13300000000000001,0]
[null,null,null,null,null,null,null,null,null,null,null,null,null,null,null,null,null,null,null,null,null,null,null,null,null,null,null,null,null,null,null,null,null,"Top Glass",{"$f":"IF(ModelNo=\"1901\",(Data!D1271*Data!D1272)/144,IF(ModelNo=\"1921\",(Data!D1288*Data!D1289)/144,IF(ModelNo=\"1931\",(Data!D1305*Data!D1306)/144,0)))","v":0},{"$f":"$L$12","v":""},{"$error":"#VALUE!"}]
[null,null,null,null,null,null,null,null,null,null,null,null,null,null,null,null,null,null,null,null,null,null,null,null,null,null,null,null,null,null,null,null,null,"Top Spacer",{"$f":"IF(ModelNo=\"1901\",((Data!D1271*2)+(Data!D1272*2))/12,IF(ModelNo=\"1921\",((Data!D1288*2)+(Data!D1289*2))/12,IF(ModelNo=\"1931\",((Data!D1305*2)+(Data!D1306*2))/12,0)))","v":0},5.3600000000000002E-2,0]
[null,null,null,null,null,null,null,null,null,null,null,null,null,null,null,null,null,null,null,null,null,null,null,null,null,null,null,null,null,null,null,null,null,"Top Hardware",1,0.2,0.2]
[null,null,null,null,null,null,null,null,null,null,null,null,null,null,null,null,null,null,null,null,null,null,null,null,null,null,null,null,null,null,null,null,null,"Top Bead",{"$f":"(((Frame_Width-4.2)*2)+((DDIM_1901-1.75)*2))/12","v":-0.9916666666666667},2.1000000000000001E-2,-2.0825000000000003E-2]
[null,null,null,null,null,null,null,null,null,null,null,null,null,null,null,null,null,null,null,null,null,null,null,null,null,null,null,null,null,null,null,null,null,"Bottom Top Rail",{"$f":"IF(ModelNo=\"1901\",(Frame_Width-2.1875)/12,IF(ModelNo=\"1921\",(Frame_Width/2-2.4375)/12,IF(ModelNo=\"1931\",(Frame_Width/3-2.5)/12,0)))","v":0},0.221,0]
[null,null,null,null,null,null,null,null,null,null,null,null,null,null,null,null,null,null,null,null,null,null,null,null,null,null,null,null,null,null,null,null,null,"Bottom Bottom Rail",{"$f":"IF(ModelNo=\"1901\",(Frame_Width-2.1875)/12,IF(ModelNo=\"1921\",(Frame_Width/2-2.4375)/12,IF(ModelNo=\"1931\",(Frame_Width/3-2.5)/12,0)))","v":0},0.19600000000000001,0]
[null,null,null,null,null,null,null,null,null,null,null,null,null,null,null,null,null,null,null,null,null,null,null,null,null,null,null,null,null,null,null,null,null,"Bottom Stile",{"$f":"(2*(CDIM_1901-0.90625))/12","v":-0.15104166666666666},0.19600000000000001,-2.9604166666666668E-2]
[null,null,null,null,null,null,null,null,null,null,null,null,null,null,null,null,null,null,null,null,null,null,null,null,null,null,null,null,null,null,null,null,null,"Bottom Rail Reinf.",{"$f":"IF(AND(ModelNo=\"1901\",STILE_REINF>0),(Frame_Width-8.4375)/12,IF(AND(ModelNo=\"1921\",STILE_REINF>0),(Frame_Width/2-8.6875)/12,IF(AND(ModelNo=\"1931\",STILE_REINF>0),(Frame_Width/3-8.75)/12,0)))","v":0},0.13300000000000001,0]
[null,null,null,null,null,null,null,null,null,null,null,null,null,null,null,null,null,null,null,null,null,null,null,null,null,null,null,null,null,null,null,null,null,"Bottom Stile Reinf.",{"$f":"IF(STILE_REINF>0,(((((CDIM_1901-4.25))/2)*2)/12)*2,0)","v":0},0.13300000000000001,0]
[null,null,null,null,null,null,null,null,null,null,null,null,null,null,null,null,null,null,null,null,null,null,null,null,null,null,null,null,null,null,null,null,null,"Bottom Glass",{"$f":"IF(ModelNo=\"1901\",(Data!D1273*Data!D1274)/144,IF(ModelNo=\"1921\",(Data!D1290*Data!D1291)/144,IF(ModelNo=\"1931\",(Data!D1307*Data!D1308)/144,0)))","v":0},{"$f":"$L$12","v":""},{"$error":"#VALUE!"}]
[null,null,null,null,null,null,null,null,null,null,null,null,null,null,null,null,null,null,null,null,null,null,null,null,null,null,null,null,null,null,null,null,null,"Bottom Spacer",{"$f":"IF(ModelNo=\"1901\",((Data!D1273*2)+(Data!D1274*2))/12,IF(ModelNo=\"1921\",((Data!D1290*2)+(Data!D1291*2))/12,IF(ModelNo=\"1931\",((Data!D1307*2)+(Data!D1308*2))/12,0)))","v":0},5.3600000000000002E-2,0]
[null,null,null,null,null,null,null,null,null,null,null,null,null,null,null,null,null,null,null,null,null,null,null,null,null,null,null,null,null,null,null,null,null,"Bottom Hardware",1,0.36,0.36]
[null,null,null,null,null,null,null,null,null,null,null,null,null,null,null,null,null,null,null,null,null,null,null,null,null,null,null,null,null,null,null,null,null,"Bottom Bead",{"$f":"(((Frame_Width-2.95)*2)+((CDIM_1901-1.75)*2))/12","v":-0.78333333333333333},2.1000000000000001E-2,-1.6449999999999999E-2]
[null,null,null,null,null,null,null,null,null,null,null,null,null,null,null,null,null,null,null,null,null,null,null,null,null,null,null,null,null,null,null,null,null,null,null,"Top Sash",{"$f":"IF(OR(ModelNo=\"1901\",ModelNo=\"1921\",ModelNo=\"1931\"),(SUM(AK180:AK188))+3,0)","v":0}]
[null,null,null,null,null,null,null,null,null,null,null,null,null,null,null,null,null,null,null,null,null,null,null,null,null,null,null,null,null,null,null,null,null,null,null,"Bottom Sash",{"$f":"IF(OR(ModelNo=\"1901\",ModelNo=\"1921\",ModelNo=\"1931\"),SUM(AK189:AK197),0)","v":0}]

{"sheet":"CMR","index":2,"n_rows":189,"n_cols":50,"rows_kept":189,"cut":false,"hidden":true,"merged":[[120,1,120,3],[121,1,121,3],[105,1,105,3],[107,4,107,5],[115,1,115,2],[116,1,116,2],[118,1,118,3],[119,1,119,3],[91,4,91,5],[99,1,99,2],[100,1,100,2],[102,1,102,3],[103,1,103,3],[104,1,104,3],[103,8,103,10],[104,8,104,10],[106,11,106,12],[107,8,107,9],[113,8,113,10],[108,8,108,9],[110,8,110,10],[111,8,111,10],[112,8,112,10],[74,8,74,9],[76,8,76,10],[90,11,90,12],[98,8,98,9],[99,8,99,9],[101,8,101,10],[102,8,102,10],[81,11,81,12],[82,8,82,9],[83,8,83,9],[85,8,85,10],[86,8,86,10],[87,8,87,10],[76,1,76,3],[88,1,88,3],[89,1,89,3],[81,3,81,4],[86,1,86,3],[87,1,87,3],[83,1,83,2],[84,1,84,2],[77,8,77,10],[78,8,78,10],[79,8,79,10],[77,1,77,3],[78,1,78,3],[79,1,79,3],[88,8,88,10],[47,8,47,10],[46,8,46,10],[73,8,73,9],[42,1,42,2],[44,1,44,3],[45,1,45,3],[46,1,46,3],[42,8,42,9],[65,11,65,12],[44,8,44,10],[45,8,45,10],[47,1,47,3],[33,11,33,12],[41,8,41,9],[41,1,41,2],[30,8,30,10],[31,8,31,10],[33,4,33,5],[1,11,1,12],[9,8,9,9],[10,8,10,9],[12,8,12,10],[1,4,1,5],[17,4,17,5],[13,8,13,10],[14,8,14,10],[15,8,15,10],[25,8,25,9],[26,8,26,9],[28,8,28,10],[29,8,29,10],[9,15,9,16],[10,15,10,16],[25,15,25,16],[26,15,26,16],[30,15,30,17],[28,15,28,17],[29,15,29,17],[30,1,30,3],[31,1,31,3],[25,1,25,2],[26,1,26,2],[12,1,12,3],[13,1,13,3],[14,1,14,3],[15,1,15,3],[17,11,17,12],[9,1,9,2],[10,1,10,2],[28,1,28,3],[29,1,29,3],[17,18,17,19],[57,15,57,16],[58,15,58,16],[60,15,60,17],[61,15,61,17],[49,18,49,19],[31,15,31,17],[45,15,45,17],[46,15,46,17],[47,15,47,17],[62,15,62,17],[63,15,63,17],[79,15,79,17],[73,15,73,16],[81,18,81,19],[94,15,94,17],[33,18,33,19],[41,15,41,16],[42,15,42,16],[44,15,44,17],[65,18,65,19],[95,15,95,17],[89,15,89,16],[90,15,90,16],[92,15,92,17],[93,15,93,17],[74,15,74,16],[76,15,76,17],[77,15,77,17],[78,15,78,17]]}
[]
[null,null,"W",null,"0100 / 0700",null,null,null,null,"W",null,"S140, S144, S146",null,null,null,null,null,null,null,"SashW","SashH","GlassW","GlassH","Radius","Weight",null,null,null,null,null,null,null,null,null,null,null,null,null,null,null,null,"1700","1720","1730","1900","1920","1930","1901","1921","1931"]
[null,null,{"$f":"IF(TYPE=1,$C$2,IF(TYPE= \"\",$C$2,\" \"))","v":"W"},1,{"$f":"Frame_Height/2","v":0},{"$f":"TRUNC($E$3*16+0.5)/16","v":0},null,null,null,{"$f":"IF(TYPE=1,$J$2,IF(TYPE= \"\",$J$2,\" \"))","v":"W"},1,{"$f":"Frame_Height/2-CMRD","v":6},{"$f":"TRUNC($L$3*16+0.5)/16","v":6},null,null,"Frame Cut Leg",{"$f":"LEG+6","v":6},null,2,{"$f":"Frame_Width-3.125","v":-3.125},{"$f":"CDIMS140-1.125","v":-1.125},{"$f":"T3-1.6875","v":-4.8125},{"$f":"U3-1.625","v":-2.75},12.5,{"$f":"BSW03A0","v":0},null,null,null,null,null,null,null,null,null,null,null,null,null,null,null,"TGW",{"$f":"IF(AD20>40.5,1,0)","v":0},{"$f":"IF(AD21>40.25,1,0)","v":0},{"$f":"IF(AD22>25.5,1,0)","v":0},{"$f":"IF(AD23>40.5,1,0)","v":0},{"$f":"IF(AD24>40.25,1,0)","v":0},{"$f":"IF(AD25>25.5,1,0)","v":0},{"$f":"IF(AD26>39.25,1,0)","v":0},{"$f":"IF(AD27>39,1,0)","v":0},{"$f":"IF(AD28>30.9375,1,0)","v":0}]
[null,null,{"$f":"IF(TYPE=5,$C$2,IF(TYPE=2,IF(Frame_Height>=54.5,IF(Frame_Height<72.5,$C$2,\"\"),\"\"),\"\"))","v":""},2,{"$f":"CEILING(((Frame_Height/5-0.093)*3-0.03125),0.0625)","v":-0.25},{"$f":"TRUNC($E4*16+0.5)/16","v":-0.1875},5,null,null,{"$f":"IF(TYPE=5,$J$2,IF(TYPE=2,IF(Frame_Height>=54.5,IF(Frame_Height<72.5,$J$2,\"\"),\"\"),\"\"))","v":""},2,{"$f":"CEILING(((Frame_Height/3-0.22)*2-0.03125),0.0625)-CMRD","v":5.5625},{"$f":"TRUNC($L$4*16+0.5)/16","v":5.5625},5,null,"CMRD",{"$f":"Frame_Height-Q3","v":-6},null,3,{"$f":"Frame_Width-3.125","v":-3.125},{"$f":"CDIMS140-1.125","v":-1.125},{"$f":"T4-1.6875","v":-4.8125},{"$f":"U4-1.625","v":-2.75},13,{"$f":"BSW03A0","v":0},null,null,null,null,null,null,null,null,null,null,null,null,null,null,null,"TGH",{"$f":"IF(AE20>35.34375,1,0)","v":0},{"$f":"IF(AE21>35.34375,1,0)","v":0},{"$f":"IF(AE22>35.34375,1,0)","v":0},{"$f":"IF(AE23>35.34375,1,0)","v":0},{"$f":"IF(AE24>35.34375,1,0)","v":0},{"$f":"IF(AE25>35.34375,1,0)","v":0},{"$f":"IF(AE26>35.1875,1,0)","v":0},{"$f":"IF(AE27>35.1875,1,0)","v":0},{"$f":"IF(AE28>35.1875,1,0)","v":0}]
[null,null,{"$f":"IF(TYPE=6,$C$2,IF(AND(TYPE=2,OR(Frame_Height<54.5,Frame_Height>=72.5)),$C$2,\"\"))","v":""},null,{"$f":"TRUNC((Frame_Height/3-0.22)*32+0.5)/16","v":-0.375},{"$f":"TRUNC($E$5*16+0.5)/16","v":-0.3125},6,null,null,{"$f":"IF(TYPE=6,$J$2,IF(AND(TYPE=2,OR(Frame_Height<54.5,Frame_Height>=72.5)),$J$2,\"\"))","v":""},null,{"$f":"TRUNC((Frame_Height/5-0.093)*32+0.5)/16-CMRD","v":5.875},{"$f":"TRUNC($L$5*16+0.5)/16","v":5.875},6,null,"Sash Cut back",{"$f":"IF(OR(EXTSELECT=2,EXTSELECT=3),3.125,IF(OR(EXTSELECT=4,EXTSELECT=5),2.3125,IF(EXTSELECT=6,2.25,0)))","v":0},null,4,{"$f":"Frame_Width-2.3125","v":-2.3125},{"$f":"CDIMS140+0.125","v":0.125},{"$f":"Frame_Width-4","v":-4},{"$f":"CDIMS140-1.5625","v":-1.5625},10,{"$f":"Balance!AF23","v":0},null,"Model","TSW","TSH","TGW","TGH","TGSF","BSW","BSH","BGW","BGH","BGSF",null,null,null,"BGW",{"$f":"IF(AI20>40.5,1,0)","v":0},{"$f":"IF(AI21>40.25,1,0)","v":0},{"$f":"IF(AI22>25.46875,1,0)","v":0},{"$f":"IF(AI23>40.5,1,0)","v":0},{"$f":"IF(AI24>40.25,1,0)","v":0},{"$f":"IF(AI25>25.5,1,0)","v":0},{"$f":"IF(AG26>40.5,1,0)","v":0},{"$f":"IF(AI27>40.25,1,0)","v":0},{"$f":"IF(AI28>32.1875,1,0)","v":0}]
[null,null,{"$f":"IF(TYPE=7,$C$2,IF(TYPE=3,IF(Frame_Height>=54.5,IF(Frame_Height<72.5,$C$2,\"\"),\"\"),\"\"))","v":""},3,{"$f":"TRUNC((Frame_Height/5+0.156)*32+0.5)/16","v":0.3125},{"$f":"TRUNC($E$6*16+0.5)/16","v":0.3125},7,null,null,{"$f":"IF(TYPE=7,$J$2,IF(TYPE=3,IF(Frame_Height>=54.5,IF(Frame_Height<72.5,$J$2,\"\"),\"\"),\"\"))","v":""},3,{"$f":"TRUNC((Frame_Height/3+0.44)*32+0.5)/16","v":0.875},{"$f":"TRUNC($L$6*16+0.5)/16","v":0.875},7,null,null,null,null,5,{"$f":"Frame_Width-2.3125","v":-2.3125},{"$f":"CDIMS140+0.125","v":0.125},{"$f":"Frame_Width-4","v":-4},{"$f":"CDIMS140-1.5625","v":-1.5625},10,{"$f":"Balance!AF23","v":0},null,"0100",null,null,null,null,{"$f":"(AD6*AE6)/144","v":0},{"$f":"Data!D2","v":-2.3125},{"$f":"Data!D3","v":0.125},{"$f":"Data!D4","v":-3.9375},{"$f":"Data!D5","v":-1.5},{"$f":"(AI6*AJ6)/144","v":4.1015625E-2},null,null,null,"BGH",{"$f":"IF(AJ20>35.34375,1,0)","v":0},{"$f":"IF(AJ21>35.34375,1,0)","v":0},{"$f":"IF(AJ22>35.34375,1,0)","v":0},{"$f":"IF(AJ23>35.3125,1,0)","v":0},{"$f":"IF(AJ24>35.34375,1,0)","v":0},{"$f":"IF(AJ25>35.3125,1,0)","v":0},{"$f":"IF(AJ26>35.1875,1,0)","v":0},{"$f":"IF(AJ27>35.1875,1,0)","v":0},{"$f":"IF(AJ28>35.1875,1,0)","v":0}]
[null,null,{"$f":"IF(TYPE=8,$C$2,IF(AND(TYPE=3,OR(Frame_Height<54.5,Frame_Height>=72.5)),$C$2,\"\"))","v":""},null,{"$f":"TRUNC((Frame_Height/3+0.44)*16+0.5)/16","v":0.4375},{"$f":"TRUNC($E$7*16+0.5)/16","v":0.4375},8,null,null,{"$f":"IF(TYPE=8,$J$2,IF(AND(TYPE=3,OR(Frame_Height<54.5,Frame_Height>=72.5)),$J$2,\"\"))","v":""},null,{"$f":"TRUNC((Frame_Height/5+0.156)*16+0.5)/16-CMRD","v":6.125},{"$f":"TRUNC($L$7*16+0.5)/16","v":6.125},8,null,null,null,null,6,{"$f":"Frame_Width-2.25","v":-2.25},{"$f":"CDIMS140-0.75","v":-0.75},{"$f":"Frame_Width-3.9375","v":-3.9375},{"$f":"CDIMS140-2.4375","v":-2.4375},11.75,{"$f":"Balance!AF67","v":0},null,"01HP",null,null,null,null,{"$f":"(AD7*AE7)/144","v":0},{"$f":"Data!D16","v":-2.3125},{"$f":"Data!D17","v":0.125},{"$f":"Data!D18","v":-3.9375},{"$f":"Data!D19","v":-1.5},{"$f":"(AI7*AJ7)/144","v":4.1015625E-2},null,null,null,null,{"$f":"MAX(AP3:AP6)","v":0},0,0,0,0,0,0,0,0]
[null,null,{"$f":"IF(TYPE=4,$C$2,\"\")","v":""},4,{"$f":"CMR","v":0},{"$f":"TRUNC($E$8*16+0.5)/16","v":0},null,null,null,{"$f":"IF(TYPE=4,$J$2,\"\")","v":""},4,{"$f":"CMR-CMRD","v":6},{"$f":"TRUNC($L$8*16+0.5)/16","v":6},null,null,null,null,null,7,{"$f":"Frame_Width-2.1875","v":-2.1875},{"$f":"CDIMS140-0.84375","v":-0.84375},{"$f":"T8-1.3125","v":-3.5},{"$f":"U8-1.3125","v":-2.15625},12,{"$f":"Balance!AK153","v":0},null,"0301",{"$f":"Data!D321","v":-3.25},{"$f":"Data!D322","v":-1.625},{"$f":"Data!D325","v":-4.875},{"$f":"Data!D326","v":-3.25},0.11002604166666667,{"$f":"Data!D323","v":-2.25},{"$f":"Data!D324","v":-0.625},{"$f":"Data!D327","v":-3.875},{"$f":"Data!D328","v":-2.25},6.0546875E-2,null,null,"Stile Reinf. Driver >>",{"$f":"MAX(AP8:AX8,AO9,AO10)","v":0},{"$f":"IF(ModelNo=\"1700\",HLOOKUP(Model_Select,REINF_CHART,6,FALSE),0)","v":0},{"$f":"IF(ModelNo=\"1720\",HLOOKUP(Model_Select,REINF_CHART,6,FALSE),0)","v":0},{"$f":"IF(ModelNo=\"1730\",HLOOKUP(Model_Select,REINF_CHART,6,FALSE),0)","v":0},{"$f":"IF(ModelNo=\"1900\",HLOOKUP(Model_Select,REINF_CHART,6,FALSE),0)","v":0},{"$f":"IF(ModelNo=\"1920\",HLOOKUP(Model_Select,REINF_CHART,6,FALSE),0)","v":0},{"$f":"IF(ModelNo=\"1930\",HLOOKUP(Model_Select,REINF_CHART,6,FALSE),0)","v":0},{"$f":"IF(ModelNo=\"1901\",HLOOKUP(Model_Select,REINF_CHART,6,FALSE),0)","v":0},{"$f":"IF(ModelNo=\"1921\",HLOOKUP(Model_Select,REINF_CHART,6,FALSE),0)","v":0},{"$f":"IF(ModelNo=\"1931\",HLOOKUP(Model_Select,REINF_CHART,6,FALSE),0)","v":0}]
[null,null,null,null,null,null,null,null,null,null,null,null,null,null,null,null,null,null,8,{"$f":"Frame_Width-2.1875","v":-2.1875},{"$f":"CDIMS140-1.03125","v":-1.03125},{"$f":"T9-1.3125","v":-3.5},{"$f":"U9-1.3125","v":-2.34375},12,{"$f":"Balance!AF160","v":0},null,"0501",{"$f":"Data!D355","v":-4.25},{"$f":"Data!D356","v":-2.25},{"$f":"Data!D359","v":-6.0625},{"$f":"Data!D360","v":-4.0625},0.17103407118055555,{"$f":"Data!D357","v":-3.25},{"$f":"Data!D358","v":-1.25},{"$f":"Data!D361","v":-6.0625},{"$f":"Data!D362","v":-4.0625},0.17103407118055555,null,null,"Oriel >>",{"$f":"IF(TYPE>1,1,0)","v":0}]
[null,"Dim.,\"D\"",null,"=",{"$f":"IF($C$3=$C$2,$F$3,IF($C$4=$C$2,$F$4,IF($C$5=$C$2,$F$5,IF($C$6=$C$2,$F$6,IF($C$7=$C$2,$F$7,IF($C$8=$C$2,$F$8,$F$3))))))","v":0},null,null,null,"Dim.,\"D\"",null,"=",{"$f":"IF($J$3=$J$2,$M$3,IF($J$4=$J$2,$M$4,IF($J$5=$J$2,$M$5,IF($J$6=$J$2,$M$6,IF($J$7=$J$2,$M$7,IF($J$8=$J$2,$M$8,$M$3))))))","v":6},null,null,null,null,null,null,null,{"$f":"VLOOKUP(EXTSELECT,$S$3:$Y$9,2,FALSE)","v":{"$error":"#N/A"}},{"$f":"VLOOKUP(EXTSELECT,$S$3:$Y$9,3,FALSE)","v":{"$error":"#N/A"}},{"$f":"VLOOKUP(EXTSELECT,$S$3:$Y$9,4,FALSE)","v":{"$error":"#N/A"}},{"$f":"VLOOKUP(EXTSELECT,$S$3:$Y$9,5,FALSE)","v":{"$error":"#N/A"}},{"$f":"VLOOKUP(EXTSELECT,$S$3:$Y$9,6,FALSE)","v":{"$error":"#N/A"}},{"$f":"VLOOKUP(EXTSELECT,$S$3:$Y$9,7,FALSE)","v":{"$error":"#N/A"}},null,"0700",null,null,null,null,0,{"$f":"Data!D449","v":-2.3125},{"$f":"Data!D450","v":0.125},{"$f":"Data!D451","v":-3.9375},{"$f":"Data!D452","v":-1.5},4.1015625E-2,null,null,"HP >>",{"$f":"IF(EXTTYPE=\"HP Package\",1,0)","v":0}]
[null,"Dim.,\"C\"",null,"=",{"$f":"Frame_Height-$E$10","v":0},null,null,null,"Dim.,\"C\"",null,"=",{"$f":"Q3-DDIMS140","v":0},null,null,null,null,null,null,null,null,null,null,null,null,null,null,"07HP",null,null,null,null,0,{"$f":"Data!D463","v":-2.3125},{"$f":"Data!D464","v":0.125},{"$f":"Data!D465","v":-3.9375},{"$f":"Data!D466","v":-1.5},4.1015625E-2]
[null,null,null,null,null,null,null,null,null,null,null,null,null,null,null,null,null,null,null,null,null,null,null,null,null,null,"i201",{"$f":"Data!D628","v":-3.25},{"$f":"Data!D629","v":-1.5625},{"$f":"Data!D632","v":-4.875},{"$f":"Data!D633","v":-3.15625},0.10685221354166667,{"$f":"Data!D630","v":-2.25},{"$f":"Data!D631","v":-0.5625},{"$f":"Data!D634","v":-3.875},{"$f":"Data!D635","v":-2.15625},5.8024088541666664E-2]
[null,"Top Glass Width",null,null,{"$f":"TRUNC((Frame_Width-2)*16+0.5)/16","v":-1.9375},null,null,null,"Top Glass Width",null,null,{"$f":"TRUNC((Frame_Width-2*EXT)*16+0.5)/16","v":0},"Glass R:",{"$f":"FrameR-EXT","v":{"$error":"#DIV/0!"}},"F",{"$f":"IF(Frame_Width>=(Frame_Height-LEG),2*(ASIN((EXT*2)/(2*N13))),2*(ASIN(((N13-(Frame_Width-2*EXT))*2)/(2*N13))))","v":{"$error":"#DIV/0!"}},null,null,null,null,null,null,null,null,null,null,"S140",null,null,null,null,null,{"$f":"IF(AND(Frame_Width>0,Frame_Height>0,LEG>0),BSW_S140,0)","v":0},{"$f":"IF(AND(Frame_Width>0,Frame_Height>0,LEG>0),BSH_S140,0)","v":0},{"$f":"IF(AND(Frame_Width>0,Frame_Height>0,LEG>0),BGW_S140,0)","v":0},{"$f":"IF(AND(Frame_Width>0,Frame_Height>0,LEG>0),BGH_S140,0)","v":0},{"$f":"IF(AND(Frame_Width>0,Frame_Height>0,LEG>0),(AI13*AJ13)/144,0)","v":0}]
[null,"Bottom Glass Width",null,null,{"$f":"TRUNC((Frame_Width-4)*16+0.5)/16","v":-3.9375},null,null,null,"Bottom Glass Width",null,null,{"$f":"IF(EXTSELECT=5,$L$30,IF(EXTSELECT=2,$E$120,TRUNC((Frame_Width-4)*16+0.5)/16))","v":-3.9375}," Glass h:",{"$f":"IF(ModelNo=\"S146\",N13-(SQRT((4*N13^2)-(L13*2+(2*EXT))^2))/2,N13-(SQRT((4*N13^2)-(L13)^2)/2))","v":{"$error":"#DIV/0!"}},"d",{"$f":"N13*COS(P13/2)","v":{"$error":"#DIV/0!"}},null,null,null,null,null,null,null,null,null,null,"S144",null,null,null,null,null,{"$f":"IF(AND(Frame_Width>0,Frame_Height>0,LEG>0),BSW_S140,0)","v":0},{"$f":"IF(AND(Frame_Width>0,Frame_Height>0,LEG>0),BSH_S140,0)","v":0},{"$f":"IF(AND(Frame_Width>0,Frame_Height>0,LEG>0),BGW_S140,0)","v":0},{"$f":"IF(AND(Frame_Width>0,Frame_Height>0,LEG>0),BGH_S140,0)","v":0},{"$f":"IF(AND(Frame_Width>0,Frame_Height>0,LEG>0),(AI14*AJ14)/144,0)","v":0}]
[null,"Top Glass Height",null,null,{"$f":"TRUNC(($E$10-1.9375)*16+0.5)/16","v":-1.875},null,null,null,"Top Glass Height",null,null,{"$f":"IF(ModelNo=\"S146\",Frame_Height-($L$11+$N$15+EXT+P15),Frame_Height-($L$11+N15+EXT))","v":-0.51370000000000005},null,{"$f":"IF(OR(EXTSELECT=4,EXTSELECT=5),0.9198,IF(OR(EXTSELECT=2,EXTSELECT=3),0.264,IF(OR(EXTSELECT=7,EXTSELECT=8),0.407,0.5137)))","v":0.51370000000000005},"h",{"$f":"N13-P14","v":{"$error":"#DIV/0!"}},null,null,null,null,null,null,null,null,null,null,"S146",null,null,null,null,null,{"$f":"IF(AND(Frame_Width>0,Frame_Height>0,LEG>0),BSW_S140,0)","v":0},{"$f":"IF(AND(Frame_Width>0,Frame_Height>0,LEG>0),BSH_S140,0)","v":0},{"$f":"IF(AND(Frame_Width>0,Frame_Height>0,LEG>0),BGW_S140,0)","v":0},{"$f":"IF(AND(Frame_Width>0,Frame_Height>0,LEG>0),BGH_S140,0)","v":0},{"$f":"IF(AND(Frame_Width>0,Frame_Height>0,LEG>0),(AI15*AJ15)/144,0)","v":0}]
[null,"Bottom Glass Height",null,null,{"$f":"TRUNC(($E$11-1.5625)*16+0.5)/16","v":-1.5},null,null,null,"Bottom Glass Height",null,null,{"$f":"IF(EXTSELECT=5,$L$32,IF(EXTSELECT=2,$E$122,TRUNC(($L$11-1.5625)*16+0.5)/16))","v":-1.5},"Top Glass Leg:",{"$f":"IF(ModelNo=\"S146\",L15-N14+P15,L15-N14)","v":{"$error":"#DIV/0!"}},null,{"$f":"IF(ModelNo=\"S146\",((Frame_Height-LEG)/2)+(((Frame_Width*2)^2)/(8*(Frame_Height-LEG))),((Frame_Height-LEG)/2)+((Frame_Width^2)/(8*(Frame_Height-LEG))))","v":{"$error":"#DIV/0!"}},null,null,null,null,null,null,null,null,null,null,"3100",null,null,null,null,0,{"$f":"Data!D585","v":-2.125},{"$f":"Data!D586","v":-0.34375},{"$f":"Data!D587","v":-4.75},{"$f":"Data!D588","v":-2.96875},9.7927517361111105E-2]
[null,null,null,null,null,null,null,null,null,null,null,null,null,null,null,null,null,null,null,null,null,null,null,null,null,null,"03A0",null,null,null,null,0,{"$f":"Data!D1049","v":-3.125},{"$f":"Data!D1050","v":-1.125},{"$f":"Data!D1051","v":-4.75},{"$f":"Data!D1052","v":-2.71875},8.9680989583333329E-2]
[null,null,"W",null,"0201",null,null,null,null,"W",null,"02A0",null,null,null,null,null,null,null,null,null,null,null,null,null,null,"L201",{"$f":"Data!D211","v":-3.25},{"$f":"Data!D212","v":-1.5625},{"$f":"Data!D215","v":-4.875},{"$f":"Data!D216","v":-3.15625},0.10685221354166667,{"$f":"Data!D213","v":-2.25},{"$f":"Data!D214","v":-0.5625},{"$f":"Data!D217","v":-3.875},{"$f":"Data!D218","v":-2.15625},5.8024088541666664E-2]
[null,null,{"$f":"IF(TYPE=1,C18,IF(TYPE= \"\",C18,\"\"))","v":"W"},1,{"$f":"Frame_Height/2","v":0},{"$f":"TRUNC(E19*16+0.5)/16","v":0},null,null,null,{"$f":"IF(TYPE=1,$J$18,IF(TYPE= \"\",$J$18,\" \"))","v":"W"},1,{"$f":"Frame_Height/2","v":0},{"$f":"TRUNC($L$19*16+0.5)/16","v":0},null,null,null,null,null,null,null,null,null,null,null,null,null,"3001",{"$f":"Data!D991","v":-4.125},{"$f":"Data!D992","v":-1.625},{"$f":"Data!D995","v":-5.75},{"$f":"Data!D996","v":-3.21875},0.12852647569444445,{"$f":"Data!D993","v":-3.125},{"$f":"Data!D994","v":-0.625},{"$f":"Data!D997","v":-4.75},{"$f":"Data!D998","v":-2.21875},7.3187934027777776E-2]
[null,null,{"$f":"IF(TYPE=5,C18,IF(TYPE=2,IF(Frame_Height>=54.5,IF(Frame_Height<72.5,C18,\"\"),\"\"),\"\"))","v":""},2,{"$f":"INT((Frame_Height/5)*48+0.5)/16","v":0},0,5,null,null,{"$f":"IF(TYPE=5,$J$18,IF(TYPE=2,IF(Frame_Height>=54.5,IF(Frame_Height<72.5,$J$18,\"\"),\"\"),\"\"))","v":""},2,{"$f":"INT((Frame_Height/5)*48+0.5)/16","v":0},{"$f":"TRUNC($L$20*16+0.5)/16","v":0},5,null,null,null,null,null,null,null,null,null,null,null,null,"1700",null,null,{"$f":"Data!D1103","v":-3.46875},{"$f":"Data!D1104","v":-2.125},5.1188151041666664E-2,{"$f":"Data!D1099","v":-2.15625},{"$f":"Data!D1100","v":-0.8125},{"$f":"Data!D1101","v":-3.46875},{"$f":"Data!D1102","v":-2.125},5.1188151041666664E-2]
[null,null,{"$f":"IF(TYPE=6,C18,IF(AND(TYPE=2,OR(Frame_Height<54.5,Frame_Height>=72.5)),C18,\"\"))","v":""},null,{"$f":"INT((Frame_Height/3-0.22)*32+0.5)/16","v":-0.4375},-0.375,6,null,null,{"$f":"IF(TYPE=6,$J$18,IF(AND(TYPE=2,OR(Frame_Height<54.5,Frame_Height>=72.5)),$J$18,\"\"))","v":""},null,{"$f":"INT((Frame_Height/3-0.22)*32+0.5)/16","v":-0.4375},{"$f":"TRUNC($L$21*16+0.5)/16","v":-0.375},6,null,null,null,null,null,null,null,null,null,null,null,null,"1720",null,null,{"$f":"Data!D1159","v":-3.71875},{"$f":"Data!D1160","v":-2.125},5.4877387152777776E-2,{"$f":"Data!D1155","v":-2.40625},{"$f":"Data!D1156","v":-0.8125},{"$f":"Data!D1157","v":-3.6875},{"$f":"Data!D1158","v":-2.09375},5.3615993923611112E-2]
[null,null,{"$f":"IF(TYPE=7,C18,IF(TYPE=3,IF(Frame_Height>=54.5,IF(Frame_Height<72.5,C18,\"\"),\"\"),\"\"))","v":""},3,{"$f":"INT((Frame_Height/5+0.55)*32+0.5)/16","v":1.125},1.125,7,null,null,{"$f":"IF(TYPE=7,$J$18,IF(TYPE=3,IF(Frame_Height>=54.5,IF(Frame_Height<72.5,$J$18,\"\"),\"\"),\"\"))","v":""},3,{"$f":"INT((Frame_Height/5+0.55)*32+0.5)/16","v":1.125},{"$f":"TRUNC($L$22*16+0.5)/16","v":1.125},7,null,null,null,null,null,null,null,null,null,null,null,null,"1730",null,null,{"$f":"Data!D1173","v":-3.8125},{"$f":"Data!D1174","v":-2.125},5.6260850694444448E-2,{"$f":"Data!D1169","v":-2.5},{"$f":"Data!D1170","v":-0.8125},{"$f":"Data!D1171","v":-3.8125},{"$f":"Data!D1172","v":-2.09375},5.5433485243055552E-2]
[null,null,{"$f":"IF(TYPE=8,C18,IF(AND(TYPE=3,OR(Frame_Height<54.5,Frame_Height>=72.5)),C18,\"\"))","v":""},null,{"$f":"INT((Frame_Height/3+1.4)*16+0.5)/16","v":1.375},1.375,8,null,null,{"$f":"IF(TYPE=8,$J$18,IF(AND(TYPE=3,OR(Frame_Height<54.5,Frame_Height>=72.5)),$J$18,\"\"))","v":""},null,{"$f":"INT((Frame_Height/3+1.4)*16+0.5)/16","v":1.375},{"$f":"TRUNC($L$23*16+0.5)/16","v":1.375},8,null,null,null,null,null,null,null,null,null,null,null,null,"1900",null,null,{"$f":"Data!D1187","v":-3.46875},{"$f":"Data!D1188","v":-2.125},5.1188151041666664E-2,{"$f":"Data!D1183","v":-2.15625},{"$f":"Data!D1184","v":-0.8125},{"$f":"Data!D1185","v":-3.4375},{"$f":"Data!D1186","v":-2.09375},4.9981011284722224E-2]
[null,null,{"$f":"IF(TYPE=4,C18,\"\")","v":""},4,{"$f":"CMR","v":0},0,null,null,null,{"$f":"IF(TYPE=4,$J$18,\"\")","v":""},4,{"$f":"CMR","v":0},{"$f":"TRUNC($L$24*16+0.5)/16","v":0},null,null,null,null,null,null,null,null,null,null,null,null,null,"1920",null,null,{"$f":"Data!D1243","v":-3.71875},{"$f":"Data!D1244","v":-2.125},5.4877387152777776E-2,{"$f":"Data!D1239","v":-2.40625},{"$f":"Data!D1240","v":-0.8125},{"$f":"Data!D1241","v":-3.6875},{"$f":"Data!D1242","v":-2.09375},5.3615993923611112E-2]
[null,null,null,null,null,null,null,null,null,null,null,null,null,null,null,null,null,null,null,null,null,null,null,null,null,null,"1930",null,null,{"$f":"Data!D1257","v":-3.8125},{"$f":"Data!D1258","v":-2.125},5.6260850694444448E-2,{"$f":"Data!D1253","v":-2.5},{"$f":"Data!D1254","v":-0.8125},{"$f":"Data!D1255","v":-3.78125},{"$f":"Data!D1256","v":-2.09375},5.4979112413194448E-2]
[null,"Dim.,\"D\"",null,"=",{"$f":"TRUNC((IF(C19=C18,F19,IF(C20=C18,F20,IF(C21=C18,F21,IF(C22=C18,F22,IF(C23=C18,F23,IF(C24=C18,F24,F19)))))))*32+0.5)/32","v":0},null,null,null,"Dim.,\"D\"",null,"=",{"$f":"IF($J$19=$J$18,$M$19,IF($J$20=$J$18,$M$20,IF($J$21=$J$18,$M$21,IF($J$22=$J$18,$M$22,IF($J$23=$J$18,$M$23,IF($J$24=$J$18,$M$24,$M$19))))))","v":0},null,null,null,null,null,null,null,null,null,null,null,null,null,null,"1901",{"$f":"Data!D1267","v":-3.4375},{"$f":"Data!D1268","v":-0.90625},{"$f":"Data!D1271","v":-4.75},{"$f":"Data!D1272","v":-2.21875},7.3187934027777776E-2,{"$f":"Data!D1269","v":-2.1875},{"$f":"Data!D1270","v":-0.90625},{"$f":"Data!D1273","v":-3.5},{"$f":"Data!D1274","v":-2.21875},5.3927951388888888E-2]
[null,"Dim.,\"C\"",null,"=",{"$f":"TRUNC((Frame_Height-E26)*32+0.5)/32","v":0},null,null,null,"Dim.,\"C\"",null,"=",{"$f":"Frame_Height-$L$26","v":0},null,null,null,null,null,null,null,null,null,null,null,null,null,null,"1921",{"$f":"Data!D1284","v":-3.6875},{"$f":"Data!D1285","v":-0.90625},{"$f":"Data!D1288","v":-5},{"$f":"Data!D1289","v":-2.21875},7.7039930555555552E-2,{"$f":"Data!D1286","v":-2.4375},{"$f":"Data!D1287","v":-0.90625},{"$f":"Data!D1290","v":-3.75},{"$f":"Data!D1291","v":-2.21875},5.7779947916666664E-2]
[null,null,null,null,null,null,null,null,null,null,null,null,null,null,null,null,null,null,null,null,null,null,null,null,null,null,"1931",{"$f":"Data!D1301","v":-3.75},{"$f":"Data!D1302","v":-0.90625},{"$f":"Data!D1305","v":-5.0625},{"$f":"Data!D1306","v":-2.21875},{"$f":"(AD28*AE28)/144","v":7.80029296875E-2},{"$f":"Data!D1303","v":-2.5},{"$f":"Data!D1304","v":-0.90625},{"$f":"Data!D1307","v":-3.8125},{"$f":"Data!D1308","v":-2.21875},5.8742947048611112E-2]
[null,"Top Glass Width",null,null,{"$f":"TRUNC((Frame_Width-4.9375)*16+0.5)/16","v":-4.875},null,null,null,"Top Glass Width",null,null,{"$f":"TRUNC((Frame_Width-3.4375)*16+0.5)/16","v":-3.375},null,null,null,null,null,null,null,null,null,null,null,null,null,null,{"$f":"ModelNo","v":"Select Model"},{"$f":"VLOOKUP(ModelNo,ORL_LIMIT,2,FALSE)","v":{"$error":"#N/A"}},{"$f":"VLOOKUP(ModelNo,ORL_LIMIT,3,FALSE)","v":{"$error":"#N/A"}},{"$f":"VLOOKUP(ModelNo,ORL_LIMIT,4,FALSE)","v":{"$error":"#N/A"}},{"$f":"VLOOKUP(ModelNo,ORL_LIMIT,5,FALSE)","v":{"$error":"#N/A"}},{"$f":"VLOOKUP(ModelNo,ORL_LIMIT,6,FALSE)","v":{"$error":"#N/A"}},{"$f":"VLOOKUP(ModelNo,ORL_LIMIT,7,FALSE)","v":{"$error":"#N/A"}},{"$f":"VLOOKUP(ModelNo,ORL_LIMIT,8,FALSE)","v":{"$error":"#N/A"}},{"$f":"VLOOKUP(ModelNo,ORL_LIMIT,9,FALSE)","v":{"$error":"#N/A"}},{"$f":"VLOOKUP(ModelNo,ORL_LIMIT,10,FALSE)","v":{"$error":"#N/A"}},{"$f":"VLOOKUP(ModelNo,ORL_LIMIT,11,FALSE)","v":{"$error":"#N/A"}}]
[null,"Bottom Glass Width",null,null,{"$f":"TRUNC((Frame_Width-3.9375)*16+0.5)/16","v":-3.875},null,null,null,"Bottom Glass Width",null,null,{"$f":"TRUNC((Frame_Width-3.90625)*16+0.5)/16","v":-3.875}]
[null,"Top Glass Height",null,null,{"$f":"TRUNC((E26-3.1875)*32+0.5)/32","v":-3.15625},null,null,null,"Top Glass Height",null,null,{"$f":"TRUNC(($L$26-2.25)*16+0.5)/16","v":-2.1875}]
[null,"Bottom Glass Height",null,null,{"$f":"TRUNC((E27-2.1875)*32+0.5)/32","v":-2.15625},null,null,null,"Bottom Glass Height",null,null,{"$f":"TRUNC(($L$27-2.40625)*16+0.5)/16","v":-2.375}]
[]
[null,null,"W",null,"0301",null,null,null,null,"W",null,"0501"]
[null,null,{"$f":"IF(TYPE=1,$C34,IF(TYPE= \"\",$C34,\" \"))","v":"W"},1,{"$f":"Frame_Height/2","v":0},{"$f":"TRUNC($E35*16+0.5)/16","v":0},null,null,null,{"$f":"IF(TYPE=1,J34,IF(TYPE= \"\",J34,\" \"))","v":"W"},1,{"$f":"Frame_Height/2","v":0},{"$f":"TRUNC(L35*16+0.5)/16","v":0}]
[null,null,{"$f":"IF(TYPE=5,$C34,IF(TYPE=2,IF(Frame_Height>=54.5,IF(Frame_Height<72.5,$C34,\"\"),\"\"),\"\"))","v":""},2,{"$f":"INT((Frame_Height/5)*48+0.5)/16","v":0},0,5,null,null,{"$f":"IF(TYPE=5,J34,IF(TYPE=2,IF(Frame_Height>=54.5,IF(Frame_Height<72.5,J34,\"\"),\"\"),\"\"))","v":""},2,{"$f":"CEILING(((Frame_Height/5-0.24)*3-0.03125),0.0625)","v":-0.75},-0.6875,5]
[null,null,{"$f":"IF(TYPE=6,$C34,IF(AND(TYPE=2,OR(Frame_Height<54.5,Frame_Height>=72.5)),$C34,\"\"))","v":""},null,{"$f":"INT((Frame_Height/3-0.22)*32+0.5)/16","v":-0.4375},-0.375,6,null,null,{"$f":"IF(TYPE=6,J34,IF(AND(TYPE=2,OR(Frame_Height<54.5,Frame_Height>=72.5)),J34,\"\"))","v":""},null,{"$f":"TRUNC((Frame_Height/3-0.62)*32+0.5)/16","v":-1.1875},-1.125,6]
[null,null,{"$f":"IF(TYPE=7,$C34,IF(TYPE=3,IF(Frame_Height>=54.5,IF(Frame_Height<72.5,$C34,\"\"),\"\"),\"\"))","v":""},3,{"$f":"INT((Frame_Height/5+0.55)*32+0.5)/16","v":1.125},1.125,7,null,null,{"$f":"IF(TYPE=7,J34,IF(TYPE=3,IF(Frame_Height>=54.5,IF(Frame_Height<72.5,J34,\"\"),\"\"),\"\"))","v":""},3,{"$f":"TRUNC((Frame_Height/5+0.38)*32+0.5)/16","v":0.75},0.75,7]
[null,null,{"$f":"IF(TYPE=8,$C34,IF(AND(TYPE=3,OR(Frame_Height<54.5,Frame_Height>=72.5)),$C34,\"\"))","v":""},null,{"$f":"INT((Frame_Height/3+1.4)*16+0.5)/16","v":1.375},1.375,8,null,null,{"$f":"IF(TYPE=8,J34,IF(AND(TYPE=3,OR(Frame_Height<54.5,Frame_Height>=72.5)),J34,\"\"))","v":""},null,{"$f":"TRUNC((Frame_Height/3+1.3)*16+0.5)/16","v":1.3125},1.3125,8]
[null,null,{"$f":"IF(TYPE=4,$C34,\"\")","v":""},4,{"$f":"CMR","v":0},0,null,null,null,{"$f":"IF(TYPE=4,J34,\"\")","v":""},4,{"$f":"CMR","v":0},0]
[]
[null,"Dim.,\"D\"",null,"=",{"$f":"IF($C35=$C34,$F35,IF($C36=$C34,$F36,IF($C37=$C34,$F37,IF($C38=$C34,$F38,IF($C39=$C34,$F39,IF($C40=$C34,$F40))))))","v":0},null,null,null,"Dim.,\"D\"",null,"=",{"$f":"IF(J35=J34,M35,IF(J36=J34,M36,IF(J37=J34,M37,IF(J38=J34,M38,IF(J39=J34,M39,IF(J40=J34,M40,M35))))))","v":0}]
[null,"Dim.,\"C\"",null,"=",{"$f":"Frame_Height-$E42","v":0},null,null,null,"Dim.,\"C\"",null,"=",{"$f":"Frame_Height-L42","v":0}]
[]
[null,"Top Glass Width",null,null,{"$f":"TRUNC((Frame_Width-4.9375)*16+0.5)/16","v":-4.875},null,null,null,"Top Glass Width",null,null,{"$f":"TRUNC((Frame_Width-6.125)*16+0.5)/16","v":-6.0625}]
[null,"Bottom Glass Width",null,null,{"$f":"TRUNC((Frame_Width-3.9375)*16+0.5)/16","v":-3.875},null,null,null,"Bottom Glass Width",null,null,{"$f":"TRUNC((Frame_Width-6.125)*16+0.5)/16","v":-6.0625}]
[null,"Top Glass Height",null,null,{"$f":"TRUNC(($E42-3.3125)*16+0.5)/16","v":-3.25},null,null,null,"Top Glass Height",null,null,{"$f":"TRUNC((L42-4.125)*16+0.5)/16","v":-4.0625}]
[null,"Bottom Glass Height",null,null,{"$f":"TRUNC(($E43-2.3125)*16+0.5)/16","v":-2.25},null,null,null,"Bottom Glass Height",null,null,{"$f":"TRUNC((L43-4.125)*16+0.5)/16","v":-4.0625}]
[]
[null,null,"W",null,"0901, 0981, 09A1, 09B1",null,null,null,null,"W",null,"8001"]
[null,null,{"$f":"IF(TYPE=1,C50,IF(TYPE= \"\",C50,\" \"))","v":"W"},1,{"$f":"Frame_Height/2","v":0},{"$f":"TRUNC(E51*16+0.5)/16","v":0},null,null,null,{"$f":"IF(TYPE=1,J50,IF(TYPE= \"\",J50,\" \"))","v":"W"},1,{"$f":"Frame_Height/2","v":0},{"$f":"TRUNC(L51*16+0.5)/16","v":0}]
[null,null,{"$f":"IF(TYPE=5,C50,IF(TYPE=2,IF(Frame_Height>=54.5,IF(Frame_Height<72.5,C50,\"\"),\"\"),\"\"))","v":""},2,{"$f":"(Frame_Height/3-0.31)*2","v":-0.62},-0.5625,5,null,null,{"$f":"IF(TYPE=5,J50,IF(TYPE=2,IF(Frame_Height>=54.5,IF(Frame_Height<72.5,J50,\"\"),\"\"),\"\"))","v":""},2,{"$f":"CEILING(((Frame_Height/5-0.24)*3-0.03125),0.0625)","v":-0.75},-0.6875,5]
[null,null,{"$f":"IF(TYPE=6,C50,IF(AND(TYPE=2,OR(Frame_Height<54.5,Frame_Height>=72.5)),C50,\"\"))","v":""},null,{"$f":"(Frame_Height/5-0.2)*3","v":-0.60000000000000009},-0.5625,6,null,null,{"$f":"IF(TYPE=6,J50,IF(AND(TYPE=2,OR(Frame_Height<54.5,Frame_Height>=72.5)),J50,\"\"))","v":""},null,{"$f":"TRUNC((Frame_Height/3-0.62)*32+0.5)/16","v":-1.1875},-1.125,6]
[null,null,{"$f":"IF(TYPE=7,C50,IF(TYPE=3,IF(Frame_Height>=54.5,IF(Frame_Height<72.5,C50,\"\"),\"\"),\"\"))","v":""},3,{"$f":"(Frame_Height/3+0.65)","v":0.65},0.625,7,null,null,{"$f":"IF(TYPE=7,J50,IF(TYPE=3,IF(Frame_Height>=54.5,IF(Frame_Height<72.5,J50,\"\"),\"\"),\"\"))","v":""},3,{"$f":"TRUNC((Frame_Height/5+0.38)*32+0.5)/16","v":0.75},0.75,7]
[null,null,{"$f":"IF(TYPE=8,C50,IF(AND(TYPE=3,OR(Frame_Height<54.5,Frame_Height>=72.5)),C50,\"\"))","v":""},null,{"$f":"(Frame_Height/5+0.31)*2","v":0.62},0.625,8,null,null,{"$f":"IF(TYPE=8,J50,IF(AND(TYPE=3,OR(Frame_Height<54.5,Frame_Height>=72.5)),J50,\"\"))","v":""},null,{"$f":"TRUNC((Frame_Height/3+1.3)*16+0.5)/16","v":1.3125},1.3125,8]
[null,null,{"$f":"IF(TYPE=4,C50,\"\")","v":""},4,{"$f":"CMR","v":0},0,null,null,null,{"$f":"IF(TYPE=4,J50,\"\")","v":""},4,{"$f":"CMR","v":0},0]
[]
[null,null,"Dim.,\"D\"","=",{"$f":"IF(C51=C50,F51,IF(C52=C50,F52,IF(C53=C50,F53,IF(C54=C50,F54,IF(C55=C50,F55,IF(C56=C50,F56,F51))))))","v":0},null,null,null,null,"Dim.,\"D\"","=",{"$f":"IF(J51=J50,M51,IF(J52=J50,M52,IF(J53=J50,M53,IF(J54=J50,M54,IF(J55=J50,M55,IF(J56=J50,M56,M51))))))","v":0}]
[null,null,"Dim.,\"C\"","=",{"$f":"Frame_Height-E58","v":0},null,null,null,null,"Dim.,\"C\"","=",{"$f":"Frame_Height-L58","v":0}]
[]
[null,null,null,"Top Glass Width",{"$f":"TRUNC((Frame_Width-4.875)*16+0.5)/16","v":-4.8125},null,null,null,null,null,"Top Glass Width",{"$f":"TRUNC((Frame_Width-6.8125)*16+0.5)/16","v":-6.75}]
[null,null,null,"Bottom Glass Width",{"$f":"TRUNC((Frame_Width-4.875)*16+0.5)/16","v":-4.8125},null,null,null,null,null,"Bottom Glass Width",{"$f":"TRUNC((Frame_Width-6.8125)*16+0.5)/16","v":-6.75}]
[null,null,null,"Top Glass Height",{"$f":"TRUNC((E58-3.0625)*16+0.5)/16","v":-3},null,null,null,null,null,"Top Glass Height",{"$f":"TRUNC((L58-3.5625)*16+0.5)/16","v":-3.5}]
[null,null,null,"Bottom Glass Height",{"$f":"TRUNC((E59-3.0625)*16+0.5)/16","v":-3},null,null,null,null,null,"Bottom Glass Height",{"$f":"TRUNC((L59-3.5625)*16+0.5)/16","v":-3.5}]
[]
[null,null,"W",null,"3100",null,null,null,null,"W",null,"9001"]
[null,null,{"$f":"IF(TYPE=1,$C66,IF(TYPE= \"\",$C66,\" \"))","v":"W"},1,{"$f":"Frame_Height/2","v":0},{"$f":"TRUNC($E67*16+0.5)/16","v":0},null,null,null,{"$f":"IF(TYPE=1,J66,IF(TYPE= \"\",J66,\" \"))","v":"W"},1,{"$f":"Frame_Height/2","v":0},{"$f":"TRUNC(L67*16+0.5)/16","v":0}]
[null,null,{"$f":"IF(TYPE=5,$C66,IF(TYPE=2,IF(Frame_Height>=54.5,IF(Frame_Height<72.5,$C66,\"\"),\"\"),\"\"))","v":""},2,{"$f":"INT((Frame_Height/5)*16+0.5)/16","v":0},0,5,null,null,{"$f":"IF(TYPE=5,J66,IF(TYPE=2,IF(Frame_Height>=54.5,IF(Frame_Height<72.5,J66,\"\"),\"\"),\"\"))","v":""},2,{"$f":"CEILING(((Frame_Height/5-0.24)*3-0.03125),0.0625)","v":-0.75},-0.6875,5]
[null,null,{"$f":"IF(TYPE=6,$C66,IF(AND(TYPE=2,OR(Frame_Height<54.5,Frame_Height>=72.5)),$C66,\"\"))","v":""},null,{"$f":"INT((Frame_Height/3-0.22)*32+0.5)/16","v":-0.4375},-0.375,6,null,null,{"$f":"IF(TYPE=6,J66,IF(AND(TYPE=2,OR(Frame_Height<54.5,Frame_Height>=72.5)),J66,\"\"))","v":""},null,{"$f":"TRUNC((Frame_Height/3-0.62)*32+0.5)/16","v":-1.1875},-1.125,6]
[null,null,{"$f":"IF(TYPE=7,$C66,IF(TYPE=3,IF(Frame_Height>=54.5,IF(Frame_Height<72.5,$C66,\"\"),\"\"),\"\"))","v":""},3,{"$f":"INT((Frame_Height/5+0.55)*32+0.5)/16","v":1.125},1.125,7,null,null,{"$f":"IF(TYPE=7,J66,IF(TYPE=3,IF(Frame_Height>=54.5,IF(Frame_Height<72.5,J66,\"\"),\"\"),\"\"))","v":""},3,{"$f":"TRUNC((Frame_Height/5+0.38)*32+0.5)/16","v":0.75},0.75,7]
[null,null,{"$f":"IF(TYPE=8,$C66,IF(AND(TYPE=3,OR(Frame_Height<54.5,Frame_Height>=72.5)),$C66,\"\"))","v":""},null,{"$f":"INT((Frame_Height/3+1.4)*16+0.5)/16","v":1.375},1.375,8,null,null,{"$f":"IF(TYPE=8,J66,IF(AND(TYPE=3,OR(Frame_Height<54.5,Frame_Height>=72.5)),J66,\"\"))","v":""},null,{"$f":"TRUNC((Frame_Height/3+1.3)*16+0.5)/16","v":1.3125},1.3125,8]
[null,null,{"$f":"IF(TYPE=4,$C66,\"\")","v":""},4,{"$f":"CMR","v":0},0,null,null,null,{"$f":"IF(TYPE=4,J66,\"\")","v":""},4,{"$f":"CMR","v":0},0]
[]
[null,null,"Dim.,\"D\"","=",{"$f":"IF(C67=C66,F67,IF(C68=C66,F68,IF(C69=C66,F69,IF(C70=C66,F70,IF(C71=C66,F71,IF(C72=C66,F72,F67))))))","v":0},null,null,null,"Dim.,\"D\"",null,"=",{"$f":"IF(J67=J66,M67,IF(J68=J66,M68,IF(J69=J66,M69,IF(J70=J66,M70,IF(J71=J66,M71,IF(J72=J66,M72,M67))))))","v":0}]
[null,null,"Dim.,\"C\"","=",{"$f":"Frame_Height-$E74","v":0},null,null,null,"Dim.,\"C\"",null,"=",{"$f":"Frame_Height-L74","v":0}]
[]
[null,"Top Glass Width",null,null,{"$f":"TRUNC((Frame_Width-4.03125)*32+0.5)/32","v":-4},null,null,null,"Top Glass Width",null,null,{"$f":"TRUNC((Frame_Width-6.8125)*16+0.5)/16","v":-6.75}]
[null,"Bottom Glass Width",null,null,{"$f":"TRUNC((Frame_Width-4.76815)*32+0.5)/32","v":-4.75},null,null,null,"Bottom Glass Width",null,null,{"$f":"TRUNC((Frame_Width-6.8125)*16+0.5)/16","v":-6.75}]
[null,"Top Glass Height",null,null,{"$f":"TRUNC(($E74-3.0625)*32+0.5)/32","v":-3.03125},null,null,null,"Top Glass Height",null,null,{"$f":"TRUNC((L74-3.9375)*16+0.5)/16","v":-3.875}]
[null,"Bottom Glass Height",null,null,{"$f":"TRUNC(($E75-3.00375)*32+0.5)/32","v":-2.96875},null,null,null,"Bottom Glass Height",null,null,{"$f":"TRUNC((L75-3.9375)*16+0.5)/16","v":-3.875}]
[]
[null,null,null,3102,null,null,null,null,null,null,null,"V100"]
[null,null,null,null,null,null,null,null,"Dim.,\"D\"",null,"=",{"$f":"IF(TYPE=1,(Frame_Height/2),IF(TYPE=2,CMR))","v":0}]
[null,"Dim.,\"D\"",null,"=",{"$f":"IF(TYPE=1,(Frame_Width/2),IF(TYPE=4,CMR))","v":0},null,null,null,"Dim.,\"C\"",null,"=",{"$f":"Frame_Height-L83","v":0}]
[null,"Dim.,\"C\"",null,"=",{"$f":"Frame_Width-$E84","v":0}]
[null,null,null,null,null,null,null,null,"Top Glass Width",null,null,{"$f":"TRUNC((Frame_Width-3.5)*32+0.5)/32","v":-3.46875}]
[null,"Fixed Glass Width",null,null,{"$f":"$E$84-3.09375","v":-3.09375},null,null,null,"Bottom Glass Width",null,null,{"$f":"TRUNC(((TRUNC((Frame_Width-2.188)*32+0.5)/32)-1.3125)*32+0.5)/32","v":-3.4375}]
[null,"Sash Glass Width",null,null,{"$f":"(TRUNC(($E$85-0.7)*16+0.5)/16)-1.625","v":-2.25},null,null,null,"Top Glass Height",null,null,{"$f":"TRUNC((L83-2.157)*32+0.5)/32","v":-2.125}]
[null,"Fixed Glass Height",null,null,{"$f":"Frame_Height-5.09375","v":-5.09375},null,null,null,"Bottom Glass Height",null,null,{"$f":"TRUNC(((TRUNC(((L84-1.0625)*16+0.5))/16)-1.312)*32+0.5)/32","v":-2.28125}]
[null,"Sash Glass Height",null,null,{"$f":"(TRUNC((Frame_Height-3.4)*16+0.5)/16)-1.625","v":-4.9375}]
[null,null,null,null,null,null,null,null,null,"W",null,"V101"]
[null,null,"W",null,"3001",null,null,null,null,{"$f":"IF(TYPE=1,$J91,IF(TYPE=\"\",$J91,\" \"))","v":"W"},1,{"$f":"Frame_Height/2","v":0},{"$f":"TRUNC($L92*16+0.5)/16","v":0}]
[null,null,{"$f":"IF(TYPE=1,C92,IF(TYPE= \"\",C92,\"\"))","v":"W"},1,{"$f":"Frame_Height/2","v":0},{"$f":"TRUNC(E93*16+0.5)/16","v":0},null,null,null,{"$f":"IF(TYPE=5,$J91,IF(TYPE=2,IF(Frame_Height>=54.5,IF(Frame_Height<72.5,$J91,\"\"),\"\"),\"\"))","v":""},2,{"$f":"INT((Frame_Height/5)*48+0.5)/16","v":0},0,5]
[null,null,{"$f":"IF(TYPE=5,C92,IF(TYPE=2,IF(Frame_Height>=54.5,IF(Frame_Height<72.5,C92,\"\"),\"\"),\"\"))","v":""},2,{"$f":"INT((Frame_Height/5)*48+0.5)/16","v":0},0,5,null,null,{"$f":"IF(TYPE=6,$J91,IF(AND(TYPE=2,OR(Frame_Height<54.5,Frame_Height>=72.5)),$J91,\"\"))","v":""},null,{"$f":"INT((Frame_Height/3-0.22)*32+0.5)/16","v":-0.4375},-0.375,6]
[null,null,{"$f":"IF(TYPE=6,C92,IF(AND(TYPE=2,OR(Frame_Height<54.5,Frame_Height>=72.5)),C92,\"\"))","v":""},null,{"$f":"INT((Frame_Height/3-0.22)*32+0.5)/16","v":-0.4375},-0.375,6,null,null,{"$f":"IF(TYPE=7,$J91,IF(TYPE=3,IF(Frame_Height>=54.5,IF(Frame_Height<72.5,$J91,\"\"),\"\"),\"\"))","v":""},3,{"$f":"INT((Frame_Height/5+0.55)*32+0.5)/16","v":1.125},1.125,7]
[null,null,{"$f":"IF(TYPE=7,C92,IF(TYPE=3,IF(Frame_Height>=54.5,IF(Frame_Height<72.5,C92,\"\"),\"\"),\"\"))","v":""},3,{"$f":"INT((Frame_Height/5+0.55)*32+0.5)/16","v":1.125},1.125,7,null,null,{"$f":"IF(TYPE=8,$J91,IF(AND(TYPE=3,OR(Frame_Height<54.5,Frame_Height>=72.5)),$J91,\"\"))","v":""},null,{"$f":"INT((Frame_Height/3+1.4)*16+0.5)/16","v":1.375},1.375,8]
[null,null,{"$f":"IF(TYPE=8,C92,IF(AND(TYPE=3,OR(Frame_Height<54.5,Frame_Height>=72.5)),C92,\"\"))","v":""},null,{"$f":"INT((Frame_Height/3+1.4)*16+0.5)/16","v":1.375},1.375,8,null,null,{"$f":"IF(TYPE=4,$J91,\"\")","v":""},4,{"$f":"CMR","v":0},0]
[null,null,{"$f":"IF(TYPE=4,C92,\"\")","v":""},4,{"$f":"CMR","v":0},0]
[null,null,null,null,null,null,null,null,"Dim.,\"D\"",null,"=",{"$f":"IF($J92=$J91,$M92,IF($J93=$J91,$M93,IF($J94=$J91,$M94,IF($J95=$J91,$M95,IF($J96=$J91,$M96,IF($J97=$J91,$M97))))))","v":0}]
[null,"Dim.,\"D\"",null,"=",{"$f":"TRUNC((IF(C93=C92,F93,IF(C94=C92,F94,IF(C95=C92,F95,IF(C96=C92,F96,IF(C97=C92,F97,IF(C98=C92,F98,F93)))))))*32+0.5)/32","v":0},null,null,null,"Dim.,\"C\"",null,"=",{"$f":"Frame_Height-$L99","v":0}]
[null,"Dim.,\"C\"",null,"=",{"$f":"TRUNC((Frame_Height-E100)*32+0.5)/32","v":0}]
[null,null,null,null,null,null,null,null,"Top Glass Width",null,null,{"$f":"TRUNC((Frame_Width-4.75)*16+0.5)/16","v":-4.6875}]
[null,"Top Glass Width",null,null,{"$f":"TRUNC((Frame_Width-5.8125)*16+0.5)/16","v":-5.75},null,null,null,"Bottom Glass Width",null,null,{"$f":"TRUNC((Frame_Width-3.5)*16+0.5)/16","v":-3.4375}]
[null,"Bottom Glass Width",null,null,{"$f":"TRUNC((Frame_Width-4.8125)*16+0.5)/16","v":-4.75},null,null,null,"Top Glass Height",null,null,{"$f":"TRUNC(($L99-2.9375)*16+0.5)/16","v":-2.875}]
[null,"Top Glass Height",null,null,{"$f":"TRUNC((E100-3.25)*32+0.5)/32","v":-3.21875},null,null,null,"Bottom Glass Height",null,null,{"$f":"TRUNC(($L100-1.6875)*16+0.5)/16","v":-1.625}]
[null,"Bottom Glass Height",null,null,{"$f":"TRUNC((E101-2.25)*32+0.5)/32","v":-2.21875}]
[null,null,null,null,null,null,null,null,null,null,null,"V200"]
[null,null,"W",null,"03A0",null,null,null,"Dim.,\"D\"",null,"=",{"$f":"IF(TYPE=1,(Frame_Height/2),IF(TYPE=2,CMR))","v":0}]
[null,null,{"$f":"IF(TYPE=1,C108,IF(TYPE= \"\",C108,\"\"))","v":"W"},1,{"$f":"Frame_Height/2","v":0},{"$f":"TRUNC(E109*16+0.5)/16","v":0},null,null,"Dim.,\"C\"",null,"=",{"$f":"Frame_Height-L108","v":0}]
[null,null,{"$f":"IF(TYPE=5,C108,IF(TYPE=2,IF(Frame_Height>=54.5,IF(Frame_Height<72.5,C108,\"\"),\"\"),\"\"))","v":""},2,{"$f":"INT((Frame_Height/5)*48+0.5)/16","v":0},0,5]
[null,null,{"$f":"IF(TYPE=6,C108,IF(AND(TYPE=2,OR(Frame_Height<54.5,Frame_Height>=72.5)),C108,\"\"))","v":""},null,{"$f":"INT((Frame_Height/3-0.22)*32+0.5)/16","v":-0.4375},-0.375,6,null,"Top Glass Width",null,null,{"$f":"TRUNC((Frame_Width-3.5625)*32+0.5)/32","v":-3.53125}]
[null,null,{"$f":"IF(TYPE=7,C108,IF(TYPE=3,IF(Frame_Height>=54.5,IF(Frame_Height<72.5,C108,\"\"),\"\"),\"\"))","v":""},3,{"$f":"INT((Frame_Height/5+0.55)*32+0.5)/16","v":1.125},1.125,7,null,"Bottom Glass Width",null,null,{"$f":"TRUNC(((TRUNC((Frame_Width-2.1875)*32+0.5)/32)-1.375)*32+0.5)/32","v":-3.5}]
[null,null,{"$f":"IF(TYPE=8,C108,IF(AND(TYPE=3,OR(Frame_Height<54.5,Frame_Height>=72.5)),C108,\"\"))","v":""},null,{"$f":"INT((Frame_Height/3+1.4)*16+0.5)/16","v":1.375},1.375,8,null,"Top Glass Height",null,null,{"$f":"TRUNC((L108-2.25)*32+0.5)/32","v":-2.21875}]
[null,null,{"$f":"IF(TYPE=4,C108,\"\")","v":""},4,{"$f":"CMR","v":0},0,null,null,"Bottom Glass Height",null,null,{"$f":"TRUNC(((TRUNC(((L109-0.8125)*32+0.5))/32-0.0625)-1.4375)*32+0.5)/32","v":-2.25}]
[]
[null,"Dim.,\"D\"",null,"=",{"$f":"TRUNC((IF(C109=C108,F109,IF(C110=C108,F110,IF(C111=C108,F111,IF(C112=C108,F112,IF(C113=C108,F113,IF(C114=C108,F114,F109)))))))*32+0.5)/32","v":0},null,null,null,null,null,null,"1700"]
[null,"Dim.,\"C\"",null,"=",{"$f":"TRUNC((Frame_Height-E116)*32+0.5)/32","v":0},null,null,null,null,"Dim.,\"D\"","=",{"$f":"IF(TYPE=1,(Frame_Height/2),IF(TYPE=2,CMR))","v":0}]
[null,null,null,null,null,null,null,null,null,"Dim.,\"C\"","=",{"$f":"Frame_Height-L117","v":0}]
[null,"Top Glass Width",null,null,{"$f":"TRUNC((Frame_Width-4.75)*16+0.5)/16","v":-4.6875}]
[null,"Bottom Glass Width",null,null,{"$f":"TRUNC((Frame_Width-4.8125)*16+0.5)/16","v":-4.75}]
[null,"Top Glass Height",null,null,{"$f":"TRUNC((E116-2.625)*32+0.5)/32","v":-2.59375},null,null,null,null,null,null,"1702"]
[null,"Bottom Glass Height",null,null,{"$f":"TRUNC((E117-2.75)*32+0.5)/32","v":-2.71875},null,null,null,null,"Dim.,\"D\"","=",{"$f":"IF(TYPE=1,(Frame_Width/2),IF(TYPE=2,CMR))","v":0}]
[null,null,null,null,null,null,null,null,null,"Dim.,\"C\"","=",{"$f":"Frame_Width-L122","v":0}]
[]
[]
[null,null,null,null,null,null,null,null,null,null,null,"1720"]
[null,null,null,null,null,null,null,null,null,"Dim.,\"D\"","=",{"$f":"IF(TYPE=1,(Frame_Height/2),IF(TYPE=2,CMR))","v":0}]
[null,null,null,null,null,null,null,null,null,"Dim.,\"C\"","=",{"$f":"Frame_Height-L127","v":0}]
[]
[]
[null,null,null,null,null,null,null,null,null,null,null,"1730"]
[null,null,null,null,null,null,null,null,null,"Dim.,\"D\"","=",{"$f":"IF(TYPE=1,(Frame_Height/2),IF(TYPE=2,CMR))","v":0}]
[null,null,null,null,null,null,null,null,null,"Dim.,\"C\"","=",{"$f":"Frame_Height-L132","v":0}]
[]
[]
[null,null,null,null,null,null,null,null,null,null,null,"1900"]
[null,null,null,null,null,null,null,null,null,"Dim.,\"D\"","=",{"$f":"IF(TYPE=1,(Frame_Height/2),IF(TYPE=2,CMR))","v":0}]
[null,null,null,null,null,null,null,null,null,"Dim.,\"C\"","=",{"$f":"Frame_Height-DDIM_1900","v":0}]
[]
[]
[null,null,null,null,null,null,null,null,null,null,null,"1902"]
[null,null,null,null,null,null,null,null,null,"Dim.,\"D\"","=",{"$f":"IF(TYPE=1,(Frame_Width/2),IF(TYPE=2,CMR))","v":0}]
[null,null,null,null,null,null,null,null,null,"Dim.,\"C\"","=",{"$f":"Frame_Width-DDIM_1902","v":0}]
[]
[]
[null,null,null,null,null,null,null,null,null,null,null,"1920"]
[null,null,null,null,null,null,null,null,null,"Dim.,\"D\"","=",{"$f":"IF(TYPE=1,(Frame_Height/2),IF(TYPE=2,CMR))","v":0}]
[null,null,null,null,null,null,null,null,null,"Dim.,\"C\"","=",{"$f":"Frame_Height-DDIM_1920","v":0}]
[]
[]
[null,null,null,null,null,null,null,null,null,null,null,"1930"]
[null,null,null,null,null,null,null,null,null,"Dim.,\"D\"","=",{"$f":"IF(TYPE=1,(Frame_Height/2),IF(TYPE=2,CMR))","v":0}]
[null,null,null,null,null,null,null,null,null,"Dim.,\"C\"","=",{"$f":"Frame_Height-DDIM_1930","v":0}]
[]
[]
[null,null,null,null,null,null,null,null,null,"W",null,"1901"]
[null,null,null,null,null,null,null,null,null,{"$f":"IF(TYPE=1,$J156,IF(TYPE=\"\",$J156,\" \"))","v":"W"},1,{"$f":"Frame_Height/2","v":0},{"$f":"TRUNC($L157*16+0.5)/16","v":0}]
[null,null,null,null,null,null,null,null,null,{"$f":"IF(TYPE=5,$J156,IF(TYPE=2,IF(Frame_Height>=54.5,IF(Frame_Height<72.5,$J156,\"\"),\"\"),\"\"))","v":""},2,{"$f":"INT((Frame_Height/5)*48+0.5)/16","v":0},0,5]
[null,null,null,null,null,null,null,null,null,{"$f":"IF(TYPE=6,$J156,IF(AND(TYPE=2,OR(Frame_Height<54.5,Frame_Height>=72.5)),$J156,\"\"))","v":""},null,{"$f":"INT((Frame_Height/3-0.22)*32+0.5)/16","v":-0.4375},-0.375,6]
[null,null,null,null,null,null,null,null,null,{"$f":"IF(TYPE=7,$J156,IF(TYPE=3,IF(Frame_Height>=54.5,IF(Frame_Height<72.5,$J156,\"\"),\"\"),\"\"))","v":""},3,{"$f":"INT((Frame_Height/5+0.55)*32+0.5)/16","v":1.125},1.125,7]
[null,null,null,null,null,null,null,null,null,{"$f":"IF(TYPE=8,$J156,IF(AND(TYPE=3,OR(Frame_Height<54.5,Frame_Height>=72.5)),$J156,\"\"))","v":""},null,{"$f":"INT((Frame_Height/3+1.4)*16+0.5)/16","v":1.375},1.375,8]
[null,null,null,null,null,null,null,null,null,{"$f":"IF(TYPE=4,$J156,\"\")","v":""},4,{"$f":"CMR","v":0},0]
[]
[null,null,null,null,null,null,null,null,null,"Dim.,\"D\"","=",{"$f":"IF($J157=$J156,$M157,IF($J158=$J156,$M158,IF($J159=$J156,$M159,IF($J160=$J156,$M160,IF($J161=$J156,$M161,IF($J162=$J156,$M162))))))","v":0}]
[null,null,null,null,null,null,null,null,null,"Dim.,\"C\"","=",{"$f":"Frame_Height-DDIM_1901","v":0}]
[]
[]
[null,null,null,null,null,null,null,null,null,"W",null,"1921"]
[null,null,null,null,null,null,null,null,null,{"$f":"IF(TYPE=1,$J168,IF(TYPE=\"\",$J168,\" \"))","v":"W"},1,{"$f":"Frame_Height/2","v":0},{"$f":"TRUNC($L169*16+0.5)/16","v":0}]
[null,null,null,null,null,null,null,null,null,{"$f":"IF(TYPE=5,$J168,IF(TYPE=2,IF(Frame_Height>=54.5,IF(Frame_Height<72.5,$J168,\"\"),\"\"),\"\"))","v":""},2,{"$f":"INT((Frame_Height/5)*48+0.5)/16","v":0},0,5]
[null,null,null,null,null,null,null,null,null,{"$f":"IF(TYPE=6,$J168,IF(AND(TYPE=2,OR(Frame_Height<54.5,Frame_Height>=72.5)),$J168,\"\"))","v":""},null,{"$f":"INT((Frame_Height/3-0.22)*32+0.5)/16","v":-0.4375},-0.375,6]
[null,null,null,null,null,null,null,null,null,{"$f":"IF(TYPE=7,$J168,IF(TYPE=3,IF(Frame_Height>=54.5,IF(Frame_Height<72.5,$J168,\"\"),\"\"),\"\"))","v":""},3,{"$f":"INT((Frame_Height/5+0.55)*32+0.5)/16","v":1.125},1.125,7]
[null,null,null,null,null,null,null,null,null,{"$f":"IF(TYPE=8,$J168,IF(AND(TYPE=3,OR(Frame_Height<54.5,Frame_Height>=72.5)),$J168,\"\"))","v":""},null,{"$f":"INT((Frame_Height/3+1.4)*16+0.5)/16","v":1.375},1.375,8]
[null,null,null,null,null,null,null,null,null,{"$f":"IF(TYPE=4,$J168,\"\")","v":""},4,{"$f":"CMR","v":0},0]
[]
[null,null,null,null,null,null,null,null,null,"Dim.,\"D\"","=",{"$f":"IF($J169=$J168,$M169,IF($J170=$J168,$M170,IF($J171=$J168,$M171,IF($J172=$J168,$M172,IF($J173=$J168,$M173,IF($J174=$J168,$M174))))))","v":0}]
[null,null,null,null,null,null,null,null,null,"Dim.,\"C\"","=",{"$f":"Frame_Height-DDIM_1921","v":0}]
[]
[]
[null,null,null,null,null,null,null,null,null,"W",null,"1931"]
[null,null,null,null,null,null,null,null,null,{"$f":"IF(TYPE=1,$J180,IF(TYPE=\"\",$J180,\" \"))","v":"W"},1,{"$f":"Frame_Height/2","v":0},{"$f":"TRUNC($L181*16+0.5)/16","v":0}]
[null,null,null,null,null,null,null,null,null,{"$f":"IF(TYPE=5,$J180,IF(TYPE=2,IF(Frame_Height>=54.5,IF(Frame_Height<72.5,$J180,\"\"),\"\"),\"\"))","v":""},2,{"$f":"INT((Frame_Height/5)*48+0.5)/16","v":0},0,5]
[null,null,null,null,null,null,null,null,null,{"$f":"IF(TYPE=6,$J180,IF(AND(TYPE=2,OR(Frame_Height<54.5,Frame_Height>=72.5)),$J180,\"\"))","v":""},null,{"$f":"INT((Frame_Height/3-0.22)*32+0.5)/16","v":-0.4375},-0.375,6]
[null,null,null,null,null,null,null,null,null,{"$f":"IF(TYPE=7,$J180,IF(TYPE=3,IF(Frame_Height>=54.5,IF(Frame_Height<72.5,$J180,\"\"),\"\"),\"\"))","v":""},3,{"$f":"INT((Frame_Height/5+0.55)*32+0.5)/16","v":1.125},1.125,7]
[null,null,null,null,null,null,null,null,null,{"$f":"IF(TYPE=8,$J180,IF(AND(TYPE=3,OR(Frame_Height<54.5,Frame_Height>=72.5)),$J180,\"\"))","v":""},null,{"$f":"INT((Frame_Height/3+1.4)*16+0.5)/16","v":1.375},1.375,8]
[null,null,null,null,null,null,null,null,null,{"$f":"IF(TYPE=4,$J180,\"\")","v":""},4,{"$f":"CMR","v":0},0]
[]
[null,null,null,null,null,null,null,null,null,"Dim.,\"D\"","=",{"$f":"IF($J181=$J180,$M181,IF($J182=$J180,$M182,IF($J183=$J180,$M183,IF($J184=$J180,$M184,IF($J185=$J180,$M185,IF($J186=$J180,$M186))))))","v":0}]
[null,null,null,null,null,null,null,null,null,"Dim.,\"C\"","=",{"$f":"Frame_Height-DDIM_1931","v":0}]

{"sheet":"Data","index":3,"n_rows":1320,"n_cols":60,"rows_kept":1320,"cut":false,"hidden":true,"merged":[]}
[null,"Model","Description","Value"]
[{"$f":"IF(ModelNo=B2,1,\"\")","v":""},"0100","Bottom Sash Width",{"$f":"Frame_Width-2.3125","v":-2.3125},null,{"$f":"G192","v":"Select Model"},"Models","Description","W cut-back","H-cut-back","Width","Height","Min W","Min H","Max W","Max H","Max UI","Type1","Type2","Type3","Type4","Screen1","Screen2","Screen3","Ext./Reinf.","Ext./Reinf.","Ext./Reinf.","Ext./Reinf.","Ext./Reinf.","Ext./Reinf.","Ext./Reinf.","Ext./Reinf.","Glass1","Glass2","Glass3","Glass4","Glass5","Glass6","Glass7","Glass8","Opening"]
[{"$f":"IF(ModelNo=B3,2,\"\")","v":""},"0100","Bottom Sash Height",{"$f":"CMR!$E$11+0.125","v":0.125},null,1,"Select Model"]
[{"$f":"IF(ModelNo=B4,3,\"\")","v":""},"0100","Bottom Glass Width",{"$f":"CMR!$E$14","v":-3.9375},null,2,"0100","New Const. Single Hung",0.5,0.5,null,null,14.375,23.75,52,77,129,"Standard","Oriel (2/3 - 1/3)","Cottage (1/3 - 2/3)","Custom","Half",null,null,null,null,null,null,null,null,null,null,"Single Strength (2.5 mm)","Double Strength (3 mm)","Triple Strength (5 mm)",null,null,"Laminated",null,null,"<< Select Opening",null,1,"Single Strength (2.5 mm)",null,null,null,"SS (2.2)","DS (3.2)","4 mm","TS (5.0)",null,null,null,null,"Min. W","Min. H","Max. W","Max. H","Max. UI"]
[{"$f":"IF(ModelNo=B5,4,\"\")","v":""},"0100","Bottom Glass Height",{"$f":"CMR!$E$16","v":-1.5},null,3,"01HP","New Const. Single Hung High Performance",0.5,0.5,null,null,14.375,23.75,52,84,129,"Standard","Oriel (2/3 - 1/3)","Cottage (1/3 - 2/3)","Custom","Half",null,null,null,null,null,null,null,null,null,null,null,"Double Strength (3 mm)","Triple Strength (5 mm)",null,null,"Laminated",null,null,"<< Select Opening",null,2,"Double Strength (3 mm)",null,null,"Max. Short",{"$f":"IF(TG2W>41,0,41)","v":41},{"$f":"IF(TG2W>56,0,56)","v":56},{"$f":"IF(TG2W>67,0,67)","v":67},{"$f":"IF(TG2W>70,0,70)","v":70},"Annealed",null,null,"Mezzo",25,40]
[{"$f":"IF(ModelNo=B6,5,\"\")","v":""},"0100","Top Glass Width",{"$f":"CMR!$E$13","v":-1.9375},null,4,"0102","New Const. Single Slider",0.5,0.5,null,null,23.5,14.25,72,60,132,"Standard",null,null,null,"Half",null,null,null,null,null,null,null,null,null,null,"Single Strength (2.5 mm)","Double Strength (3 mm)","Triple Strength (5 mm)",null,null,"Laminated",null,null,"<< Select Opening",null,3,"Triple Strength (5 mm)",null,null,"Max. Long",{"$f":"IF(TG2H>62,0,62)","v":62},{"$f":"IF(TG2H>76,0,76)","v":76},{"$f":"IF(TG2H>90,0,90)","v":90},{"$f":"IF(TG2H>102,0,102)","v":102},"Annealed",null,null,"Mezzo/N.F",26,41]
[{"$f":"IF(ModelNo=B7,6,\"\")","v":""},"0100","Top Glass Height",{"$f":"CMR!$E$15","v":-1.875},null,5,"0103","New Const. Three Lite Slider (1/4-1/2-1/4)",0.5,0.5,null,null,48,14.25,108,60,168,"Standard (1/4-1/2-1/4)",null,null,null,"Half",null,null,null,null,null,null,null,null,null,null,"Single Strength (2.5 mm)","Double Strength (3 mm)","Triple Strength (5 mm)",null,null,"Laminated",null,null,"<< Select Opening",null,4,"Triple IG Single Strrength",null,null,"Max Sq.Ft.",{"$f":"IF(TG2A>12,0,12)","v":12},{"$f":"IF(TG2A>22,0,22)","v":22},{"$f":"IF(TG2A>32,0,32)","v":32},{"$f":"IF(TG2A>35,0,35)","v":35},"Annealed",null,null,"New Construction",20,36]
[{"$f":"IF(ModelNo=B8,7,\"\")","v":""},"0100","Astragal Length",{"$f":"TRUNC((Frame_Width-1.218)*32+0.5)/32","v":-1.1875},null,6,"0104","New Const. Picture Window",0.5,0.5,null,null,11.5,11.5,95,95,154,"Standard",null,null,null,null,null,null,null,null,null,null,null,null,null,null,null,"Double Strength (3 mm)","Triple Strength (5 mm)",null,null,"Laminated",null,null,"<< Select Opening",null,5,"Triple IG Double Strength",null,null,"Max. Short",0,{"$f":"IF(TG2W>42,0,42)","v":42},{"$f":"IF(TG2W>70,0,70)","v":70},{"$f":"IF(TG2W>70,0,70)","v":70},"Tempered",null,null,"0700 Series",20,36]
[{"$f":"IF(ModelNo=B9,8,\"\")","v":""},"0100","Screen Width",{"$f":"TRUNC((Frame_Width-1.75)*32+0.5)/32","v":-1.71875},null,7,"0109","New Const. Three Lite Slider Equal Lite",0.5,0.5,null,null,34.75,14.25,108,60,168,"Standard (1/3-1/3-1/3)",null,null,null,"Half",null,null,null,null,null,null,null,null,null,null,"Single Strength (2.5 mm)","Double Strength (3 mm)","Triple Strength (5 mm)",null,null,"Laminated",null,null,"<< Select Opening",null,6,"Laminated",null,null,"Max. Long",0,{"$f":"IF(TG2H>84,0,84)","v":84},{"$f":"IF(TG2H>129,0,129)","v":129},{"$f":"IF(TG2H>129,0,129)","v":129},"Tempered",null,null,"Fusion",23.5,38]
[{"$f":"IF(ModelNo=B10,9,\"\")","v":""},"0100","Screen Height",{"$f":"TRUNC((CMR!$E$11-1.1875)*32+0.5)/32","v":-1.15625},null,8,"0151","New Const. Single Vent Awning",0.5,0.5,null,null,19,16,48,48,96,"Standard",null,null,null,null,"Full",null,null,null,null,null,null,null,null,null,null,"Double Strength (3 mm)","Triple Strength (5 mm)",null,null,"Laminated",null,null,"<< Select Opening",null,7,"HP Package",null,null,"Max Sq.Ft.",0,{"$f":"IF(TG2A>24.5,0,24.5)","v":24.5},{"$f":"IF(TG2A>42,0,42)","v":42},{"$f":"IF(TG2A>42,0,42)","v":42},"Tempered",null,null,1700,24]
[{"$f":"IF(ModelNo=B11,10,\"\")","v":""},"0100","Bottom Sash Weight",{"$f":"BTM_WGT&\" \"&\"lb\"","v":{"$error":"#N/A"}},null,9,"0152","New Const. Awning W/ Transom Equal Lite",0.5,0.5,null,null,19,32,48,96,144,"Standard",null,null,null,"Half",null,null,null,null,null,null,null,null,null,null,null,"Double Strength (3 mm)","Triple Strength (5 mm)",null,null,"Laminated",null,null,"<< Select Opening",null,8,"Impact Laminated",null,null,null,{"$f":"IF(AND(AV5>0,AV6>0,AV7>0),1,0)","v":1},{"$f":"IF(AND(AW5>0,AW6>0,AW7>0),1,0)","v":1},{"$f":"IF(AND(AX5>0,AX6>0,AX7>0),1,0)","v":1},{"$f":"IF(AND(AY5>0,AY6>0,AY7>0),1,0)","v":1},{"$f":"IF(AV11>0,\"≥SS Annealed\",IF(AW11>0,\"≥DS Annealed\",IF(AY11>0,\"TS Annealed\",\"\")))","v":"≥SS Annealed"},null,null,1900,24]
[{"$f":"IF(ModelNo=B12,11,\"\")","v":""},"0100","Balance Size",{"$f":"IF(ISERROR((VLOOKUP(BTM_WGT,CFB,2,FALSE))&(VLOOKUP(BTM_WGT,CFB,3,FALSE))),\"N/A\",(VLOOKUP(BTM_WGT,CFB,2,FALSE))&(VLOOKUP(BTM_WGT,CFB,3,FALSE)))","v":"N/A"},null,10,"0153","New Const. Awning W/ Transom (1/3-2/3)",0.5,0.5,null,null,19,48,48,96,144,"Standard",null,null,null,"Half",null,null,null,null,null,null,null,null,null,null,null,"Double Strength (3 mm)","Triple Strength (5 mm)",null,null,"Laminated",null,null,"<< Select Opening",null,null,null,null,null,null,null,{"$f":"IF(AND(AW8>0,AW9>0,AW10>0),1,0)","v":1},{"$f":"IF(AND(AX8>0,AX9>0,AX10>0),1,0)","v":1},{"$f":"IF(AND(AY8>0,AY9>0,AY10>0),1,0)","v":1},{"$f":"IF(AW12>0,\"≥DS Tempered\",IF(AY12>0,\"TS Tempered\",\"\"))","v":"≥DS Tempered"}]
[{"$f":"IF(ModelNo=B13,12,\"\")","v":""},"0100","Egress Opening Width",{"$f":"EW","v":{"$error":"#N/A"}},null,11,"0154","New Const. Single Vent Awning W/ Bottom Transom",0.5,0.5,null,null,19,32,48,96,144,"Standard",null,null,null,"Half",null,null,null,null,null,null,null,null,null,null,null,"Double Strength (3 mm)","Triple Strength (5 mm)",null,null,"Laminated",null,null,"<< Select Opening",null,null,null,null,null,null,"2.5 mm","3.2 mm","4 mm","5 mm"]
[{"$f":"IF(ModelNo=B14,13,\"\")","v":""},"0100","Egress Opening Height",{"$f":"EH","v":{"$error":"#N/A"}},null,12,"0155","New Const. Dual Vent Equal Lite",0.5,0.5,null,null,19,32,48,96,144,"Standard",null,null,null,"Half",null,null,null,null,null,null,null,null,null,null,null,"Double Strength (3 mm)","Triple Strength (5 mm)",null,null,"Laminated",null,null,"<< Select Opening",null,null,null,null,null,"Max. Short",{"$f":"IF(TG2H>41,0,41)","v":41},{"$f":"IF(TG2H>56,0,56)","v":56},{"$f":"IF(TG2H>67,0,67)","v":67},{"$f":"IF(TG2H>70,0,70)","v":70},"Annealed"]
[{"$f":"IF(ModelNo=B15,14,\"\")","v":""},"0100","Egress Opening Area (sq.ft.)",{"$f":"EO","v":{"$error":"#N/A"}},null,13,"0170","New Const. Casement Picture Window",0.5,0.5,null,null,13,11.5,96,96,154,"Standard",null,null,null,null,null,null,null,null,null,null,null,null,null,null,null,"Double Strength (3 mm)","Triple Strength (5 mm)",null,null,"Laminated",null,null,"<< Select Opening",null,null,null,null,null,"Max. Long",{"$f":"IF(TG2W>62,0,62)","v":62},{"$f":"IF(TG2W>76,0,76)","v":76},{"$f":"IF(TG2W>90,0,90)","v":90},{"$f":"IF(TG2W>102,0,102)","v":102},"Annealed"]
[{"$f":"IF(ModelNo=B16,1,\"\")","v":""},"01HP","Bottom Sash Width",{"$f":"Frame_Width-2.3125","v":-2.3125},null,14,"0171","New Const. Single Vent Casement",0.5,0.5,null,null,16,19,36,78,114,"Standard",null,null,null,null,"Full",null,null,null,null,null,null,null,null,null,null,"Double Strength (3 mm)","Triple Strength (5 mm)",null,null,"Laminated",null,null,"<< Select Opening",null,null,null,null,null,"Max Sq.Ft.",{"$f":"IF(TG2A>12,0,12)","v":12},{"$f":"IF(TG2A>22,0,22)","v":22},{"$f":"IF(TG2A>32,0,32)","v":32},{"$f":"IF(TG2A>35,0,35)","v":35},"Annealed"]
[{"$f":"IF(ModelNo=B17,2,\"\")","v":""},"01HP","Bottom Sash Height",{"$f":"CMR!$E$11+0.125","v":0.125},null,15,"0172","New Const. Dual Vent Casement",0.5,0.5,null,null,32,19,72,78,150,"Standard",null,null,null,"Half",null,null,null,null,null,null,null,null,null,null,null,"Double Strength (3 mm)","Triple Strength (5 mm)",null,null,"Laminated",null,null,"<< Select Opening",null,null,null,null,null,"Max. Short",0,{"$f":"IF(TG2H>42,0,42)","v":42},{"$f":"IF(TG2H>70,0,70)","v":70},{"$f":"IF(TG2H>70,0,70)","v":70},"Tempered"]
[{"$f":"IF(ModelNo=B18,3,\"\")","v":""},"01HP","Bottom Glass Width",{"$f":"CMR!$E$14","v":-3.9375},null,16,"0173","New Const. Dual Vent Casement (1/4-1/2-1/4)",0.5,0.5,null,null,64,19,120,78,198,"Standard (1/4-1/2-1/4)",null,null,null,"Half",null,null,null,null,null,null,null,null,null,null,null,"Double Strength (3 mm)","Triple Strength (5 mm)",null,null,"Laminated",null,null,"<< Select Opening",null,null,null,null,null,"Max. Long",0,{"$f":"IF(TG2W>84,0,84)","v":84},{"$f":"IF(TG2W>129,0,129)","v":129},{"$f":"IF(TG2W>129,0,129)","v":129},"Tempered"]
[{"$f":"IF(ModelNo=B19,4,\"\")","v":""},"01HP","Bottom Glass Height",{"$f":"CMR!$E$16","v":-1.5},null,17,"0179","New Const. Dual Vent Casement Equal Lite",0.5,0.5,null,null,48,19,108,78,186,"Standard (1/3-1/3-1/3)",null,null,null,"Half",null,null,null,null,null,null,null,null,null,null,null,"Double Strength (3 mm)","Triple Strength (5 mm)",null,null,"Laminated",null,null,"<< Select Opening",null,null,null,null,null,"Max Sq.Ft.",0,{"$f":"IF(TG2A>24.5,0,24.5)","v":24.5},{"$f":"IF(TG2A>42,0,42)","v":42},{"$f":"IF(TG2A>42,0,42)","v":42},"Tempered"]
[{"$f":"IF(ModelNo=B20,5,\"\")","v":""},"01HP","Top Glass Width",{"$f":"CMR!$E$13","v":-1.9375},null,18,"S174","New Construction Four Lite Casement",0.5,0.5,null,null,64,19,120,78,198,"Standard",null,null,null,"Half",null,null,null,null,null,null,null,null,null,null,null,"Double Strength (3 mm)","Triple Strength (5 mm)",null,null,"Laminated",null,null,"<< Select Opening",null,null,null,null,null,null,{"$f":"IF(AND(AV14>0,AV15>0,AV16>0),1,0)","v":1},{"$f":"IF(AND(AW14>0,AW15>0,AW16>0),1,0)","v":1},{"$f":"IF(AND(AX14>0,AX15>0,AX16>0),1,0)","v":1},{"$f":"IF(AND(AY14>0,AY15>0,AY16>0),1,0)","v":1},{"$f":"IF(AV20>0,\"≥SS Annealed\",IF(AW20>0,\"≥DS Annealed\",IF(AY20>0,\"TS Annealed\",\"\")))","v":"≥SS Annealed"}]
[{"$f":"IF(ModelNo=B21,6,\"\")","v":""},"01HP","Top Glass Height",{"$f":"CMR!$E$15","v":-1.875},null,19,"S175","New Construction Five Lite Casement",0.5,0.5,null,null,80,19,120,78,198,"Standard",null,null,null,"Half",null,null,null,null,null,null,null,null,null,null,null,"Double Strength (3 mm)","Triple Strength (5 mm)",null,null,"Laminated",null,null,"<< Select Opening",null,null,null,null,null,null,null,{"$f":"IF(AND(AW17>0,AW18>0,AW19>0),1,0)","v":1},{"$f":"IF(AND(AX17>0,AX18>0,AX19>0),1,0)","v":1},{"$f":"IF(AND(AY17>0,AY18>0,AY19>0),1,0)","v":1},{"$f":"IF(AW21>0,\"≥DS Tempered\",IF(AY21>0,\"TS Tempered\",\"\"))","v":"≥DS Tempered"}]
[{"$f":"IF(ModelNo=B22,7,\"\")","v":""},"01HP","Astragal Length",{"$f":"TRUNC((Frame_Width-1.218)*32+0.5)/32","v":-1.1875},null,20,"0201","Signature Double Hung",0,0,null,null,11,20,52,84,132,"Standard","Oriel (2/3 - 1/3)","Cottage (1/3 - 2/3)","Custom","Half","Full","Locking",null,null,null,null,null,null,null,null,null,"Double Strength (3 mm)","Triple Strength (5 mm)",null,null,"Laminated",null,null,{"$f":"IF(RO=2,\"<< Exact Size Only\",\"\")","v":""},null,null,null,null,null,{"$f":"IF(AND(OR(AZ11=\"≥SS Annealed\",AZ11=\"≥DS Annealed\",AZ12=\"≥DS Tempered\",AZ20=\"≥SS Annealed\",AZ20=\"≥DS Annealed\",AZ21=\"≥DS Tempered\")),\"TIG\",\"\")","v":"TIG"},{"$f":"IF(AND(ANNEALED1=0,ANNEALED2=0,OR(TEMPERED1>0,TEMPERED2>0)),\"Tempered is Required for TIG\",\"\")","v":""}]
[{"$f":"IF(ModelNo=B23,8,\"\")","v":""},"01HP","Screen Width",{"$f":"TRUNC((Frame_Width-1.75)*32+0.5)/32","v":-1.71875},null,21,"0202","Signature Two Lite Slider",0,0,null,null,18,9,84,72,148,"Standard",null,null,null,"Half","Full",null,null,null,null,null,null,null,null,null,null,"Double Strength (3 mm)","Triple Strength (5 mm)",null,null,"Laminated",null,null,"",null,null,null,null,null,"Model","Width","Height","Area","Balance"]
[{"$f":"IF(ModelNo=B24,9,\"\")","v":""},"01HP","Screen Height",{"$f":"TRUNC((CMR!$E$11-1.1875)*32+0.5)/32","v":-1.15625},null,22,"0203","Signature Three Lite Slider (1/4-1/2-1/4)",0,0,null,null,47.5,9,120,72,192,"Standard (1/4-1/2-1/4)",null,null,null,"Half","Full",null,null,null,null,null,null,null,null,null,null,"Double Strength (3 mm)","Triple Strength (5 mm)",null,null,"Laminated",null,null,"",null,null,null,null,{"$f":"IF(ModelNo=AU24,ModelNo,0)","v":0},"3001",{"$f":"MAX($D$995,$D$997)","v":-4.75},{"$f":"MAX($D$996,$D$998)","v":-2.21875},{"$f":"(AV24*AW24)/144","v":7.3187934027777776E-2},{"$f":"IF(AND(OR(Glass=4,Glass=5),OR($D$1002=\"N/A\",$D$1004=\"N/A\")),1,IF(AND(Glass=3,Single_ST=0),1,0))","v":{"$error":"#N/A"}}]
[{"$f":"IF(ModelNo=B25,10,\"\")","v":""},"01HP","Bottom Sash Weight",{"$f":"BTM_WGT&\" \"&\"lb\"","v":{"$error":"#N/A"}},null,23,"0204","Signature Picture Window",0,0,null,null,9,9,112,96,154,"Standard",null,null,null,null,null,null,null,null,null,null,null,null,null,null,null,"Double Strength (3 mm)","Triple Strength (5 mm)",null,null,"Laminated",null,null,"",null,null,null,null,0,"3002",{"$f":"$D$1011","v":-2.5625},{"$f":"$D$1012","v":-5.4375},9.6761067708333329E-2]
[{"$f":"IF(ModelNo=B26,11,\"\")","v":""},"01HP","Balance Size",{"$f":"IF(ISERROR((VLOOKUP(BTM_WGT,CFB,2,FALSE))&(VLOOKUP(BTM_WGT,CFB,3,FALSE))),\"N/A\",(VLOOKUP(BTM_WGT,CFB,2,FALSE))&(VLOOKUP(BTM_WGT,CFB,3,FALSE)))","v":"N/A"},null,24,"0209","Signature Three Lite Slider Equal Lite",0,0,null,null,37.25,9,120,72,192,"Standard (1/3-1/3-1/3)",null,null,null,"Half","Full",null,null,null,null,null,null,null,null,null,null,"Double Strength (3 mm)","Triple Strength (5 mm)",null,null,"Laminated",null,null,"",null,null,null,null,0,"3003",{"$f":"MAX($D$1023,$D$1025)","v":-1.4375},{"$f":"MAX($D$1024,$D$1026)","v":-5.4375},5.4280598958333336E-2]
[{"$f":"IF(ModelNo=B27,12,\"\")","v":""},"01HP","Egress Opening Width",{"$f":"EW","v":{"$error":"#N/A"}},null,25,"02A0","Signature Single Hung",0,0,null,null,11,20,52,84,132,"Standard","Oriel (2/3 - 1/3)","Cottage (1/3 - 2/3)","Custom","Half","Full","Locking",null,null,null,null,null,null,null,null,"Single Strength (2.5 mm)","Double Strength (3 mm)","Triple Strength (5 mm)",null,null,"Laminated",null,null,"",null,null,null,null,0,"3004",{"$f":"$D$1032","v":-4.1875},{"$f":"$D$1033","v":-4.1875},0.12177191840277778]
[{"$f":"IF(ModelNo=B28,13,\"\")","v":""},"01HP","Egress Opening Height",{"$f":"EH","v":{"$error":"#N/A"}},null,26,"02A2","Signature Two Lite Single Slider",0,0,null,null,18,12,84,66,148,"Standard",null,null,null,"Half","Full",null,null,null,null,null,null,null,null,null,"Single Strength (2.5 mm)","Double Strength (3 mm)","Triple Strength (5 mm)",null,null,"Laminated",null,null,"",null,null,null,null,0,"3009",{"$f":"MAX($D$1040,$D$1042)","v":-1.875},{"$f":"MAX($D$1041,$D$1043)","v":-5.4375},7.080078125E-2]
[{"$f":"IF(ModelNo=B29,14,\"\")","v":""},"01HP","Egress Opening Area (sq.ft.)",{"$f":"EO","v":{"$error":"#N/A"}},null,27,"02A3","Signature Three Lite Slider (1/4-1/2-1/4)",0,0,null,null,46,12,116,66,182,"Standard (1/4-1/2-1/4)",null,null,null,"Half","Full",null,null,null,null,null,null,null,null,null,"Single Strength (2.5 mm)","Double Strength (3 mm)","Triple Strength (5 mm)",null,null,"Laminated",null,null,"",null,null,null,null,0,"03A0",{"$f":"MAX($D$1051,$D$1053)","v":-4.6875},{"$f":"MAX($D$1052,$D$1054)","v":-2.59375},8.4431966145833329E-2,{"$f":"IF(AND(OR(Glass=4,Glass=5),$D$1059=\"N/A\"),1,IF(AND(Glass=3,Single_ST=0),1,0))","v":{"$error":"#N/A"}}]
[{"$f":"IF(ModelNo=B30,1,\"\")","v":""},"0102","Sash Width",{"$f":"(Frame_Width/2)+0.25","v":0.25},null,28,"02A4","Signature Picture Window",0,0,null,null,9,9,96,96,154,"Standard",null,null,null,null,null,null,null,null,null,null,null,null,null,null,"Single Strength (2.5 mm)","Double Strength (3 mm)","Triple Strength (5 mm)",null,null,"Laminated",null,null,"",null,null,null,null,0,"03A2",{"$f":"MAX($D$1066,$D$1068)","v":-2.5625},{"$f":"MAX($D$1067,$D$1069)","v":-4.6875},8.3414713541666671E-2]
[{"$f":"IF(ModelNo=B31,2,\"\")","v":""},"0102","Sash Height",{"$f":"Frame_Height-2.25","v":-2.25},null,29,"02A9","Signature Three Lite Slider Equal Lite",0,0,null,null,37.25,12,120,66,182,"Standard (1/3-1/3-1/3)",null,null,null,"Half","Full",null,null,null,null,null,null,null,null,null,"Single Strength (2.5 mm)","Double Strength (3 mm)","Triple Strength (5 mm)",null,null,"Laminated",null,null,"",null,null,null,null,0,"03A3",{"$f":"MAX($D$1078,$D$1080)","v":-1.5},{"$f":"MAX($D$1079,$D$1081)","v":-4.6875},4.8828125E-2]
[{"$f":"IF(ModelNo=B32,3,\"\")","v":""},"0102","Sash Glass Width",{"$f":"(Frame_Width/2)-1.4375","v":-1.4375},null,30,"3001","Signature Elite Double Hung",0,0,null,null,12,20,{"$f":"IF(EXTSELECT=2,48,IF(EXTSELECT=3,52,\"\"))","v":""},{"$f":"IF(EXTSELECT=2,84,IF(EXTSELECT=3,96,\"\"))","v":""},{"$f":"IF(EXTSELECT=2,126,IF(EXTSELECT=3,148,\"\"))","v":""},"Standard","Oriel (2/3 - 1/3)","Cottage (1/3 - 2/3)","Custom","Half","Full","Locking","Select Reinforcement","Composite","Steel",null,null,null,null,null,null,"Double Strength (3 mm)","Triple Strength (5 mm)","Triple IG Single Strength","Triple IG Double Strength","Laminated",null,null,"",null,null,null,null,0,"03A4",{"$f":"$D$1032","v":-4.1875},{"$f":"$D$1033","v":-4.1875},0.12177191840277778]
[{"$f":"IF(ModelNo=B33,4,\"\")","v":""},"0102","Sash Glass Height",{"$f":"Frame_Height-3.9375","v":-3.9375},null,31,"3002","Signature Elite Two Lite Slider",0,0,null,null,18.5,11.25,{"$f":"IF(EXTSELECT=2,72,IF(EXTSELECT=3,96,\"\"))","v":""},{"$f":"IF(EXTSELECT=2,56,IF(EXTSELECT=3,72,\"\"))","v":""},{"$f":"IF(EXTSELECT=2,128,IF(EXTSELECT=3,156,\"\"))","v":""},"Standard",null,null,null,"Half","Full",null,"Select Reinforcement","Composite","Steel",null,null,null,null,null,null,"Double Strength (3 mm)","Triple Strength (5 mm)","Triple IG Single Strength","Triple IG Double Strength","Laminated",null,null,"",null,null,null,null,0,"03A9",{"$f":"MAX($D$1090,$D$1092)","v":-1.875},{"$f":"MAX($D$1091,$D$1093)","v":-4.6875},6.103515625E-2]
[{"$f":"IF(ModelNo=B34,5,\"\")","v":""},"0102","Fixed Glass Width",{"$f":"(Frame_Width/2)-1.9375","v":-1.9375},null,32,"3003","Signature Elite Three Lite Slider (1/4-1/2-1/4)",0,0,null,null,47.5,11.25,{"$f":"IF(EXTSELECT=2,108,IF(EXTSELECT=3,120,\"\"))","v":""},{"$f":"IF(EXTSELECT=2,56,IF(EXTSELECT=3,72,\"\"))","v":""},{"$f":"IF(EXTSELECT=2,164,IF(EXTSELECT=3,192,\"\"))","v":""},"Standard (1/4-1/2-1/4)",null,null,null,"Half","Full",null,"Select Reinforcement","Composite","Steel",null,null,null,null,null,null,"Double Strength (3 mm)","Triple Strength (5 mm)","Triple IG Single Strength","Triple IG Double Strength","Laminated",null,null,"",null,null,null,null,0,"0501",{"$f":"MAX($D$359,$D$361)","v":-6.0625},{"$f":"MAX($D$360,$D$362)","v":-4.0625},0.17103407118055555,{"$f":"IF(AND(OR(Glass=4,Glass=5),OR($D$366=\"N/A\",$D$368=\"N/A\")),1,IF(AND(Glass=3,Single_ST=0),1,0))","v":{"$error":"#N/A"}}]
[{"$f":"IF(ModelNo=B35,6,\"\")","v":""},"0102","Fixed Glass Height",{"$f":"Frame_Height-2","v":-2},null,33,"3004","Signature Elite Picture Window",0,0,null,null,9.5,9.5,112,112,154,"Standard",null,null,null,null,null,null,null,null,null,null,null,null,null,null,null,"Double Strength (3 mm)","Triple Strength (5 mm)","Triple IG Single Strength","Triple IG Double Strength","Laminated",null,null,"",null,null,null,null,0,"0502",{"$f":"$D$375","v":-3.5},{"$f":"$D$376","v":-7.5},0.18229166666666666]
[{"$f":"IF(ModelNo=B36,7,\"\")","v":""},"0102","Astragal Length",{"$f":"TRUNC((Frame_Height-1.218)*16+0.5)/16","v":-1.125},null,34,"3009","Signature Elite Three Lite Slider Equal Lite",0,0,null,null,37.25,11.25,{"$f":"IF(EXTSELECT=2,108,IF(EXTSELECT=3,120,\"\"))","v":""},{"$f":"IF(EXTSELECT=2,56,IF(EXTSELECT=3,72,\"\"))","v":""},{"$f":"IF(EXTSELECT=2,164,IF(EXTSELECT=3,192,\"\"))","v":""},"Standard (1/3-1/3-1/3)",null,null,null,"Half","Full",null,"Select Reinforcement","Composite","Steel",null,null,null,null,null,null,"Double Strength (3 mm)","Triple Strength (5 mm)","Triple IG Single Strength","Triple IG Double Strength","Laminated",null,null,"",null,null,null,null,0,"0503",{"$f":"MAX($D$387,$D$389)","v":-1.9375},{"$f":"MAX($D$388,$D$390)","v":-7.5},0.10091145833333333]
[{"$f":"IF(ModelNo=B37,8,\"\")","v":""},"0102","Roller Track Length",{"$f":"Frame_Width-1","v":-1},null,35,"03A0","Signature Elite Single Hung",0,0,null,null,12,22,{"$f":"IF(EXTSELECT=2,48,IF(EXTSELECT=3,52,\"\"))","v":""},{"$f":"IF(EXTSELECT=2,78,IF(EXTSELECT=3,96,\"\"))","v":""},{"$f":"IF(EXTSELECT=2,126,IF(EXTSELECT=3,148,\"\"))","v":""},"Standard","Oriel (2/3 - 1/3)","Cottage (1/3 - 2/3)","Custom","Half","Full","Locking","Select Reinforcement","Composite","Steel",null,null,null,null,null,null,"Double Strength (3 mm)","Triple Strength (5 mm)","Triple IG Single Strength","Triple IG Double Strength","Laminated",null,null,"",null,null,null,null,0,"0504",{"$f":"$D$120","v":-4.625},{"$f":"$D$121","v":-4.625},0.14854600694444445]
[{"$f":"IF(ModelNo=B38,9,\"\")","v":""},"0102","Screen Width",{"$f":"(Frame_Width/2)-1.1875","v":-1.1875},null,36,"03A2","Signature Elite Two Lite Single Slider",0,0,null,null,18.5,12,{"$f":"IF(EXTSELECT=2,72,IF(EXTSELECT=3,96,\"\"))","v":""},{"$f":"IF(EXTSELECT=2,56,IF(EXTSELECT=3,72,\"\"))","v":""},{"$f":"IF(EXTSELECT=2,128,IF(EXTSELECT=3,148,\"\"))","v":""},"Standard",null,null,null,"Half","Full",null,"Select Reinforcement","Composite","Steel",null,null,null,null,null,null,"Double Strength (3 mm)","Triple Strength (5 mm)","Triple IG Single Strength","Triple IG Double Strength","Laminated",null,null,"",null,null,null,null,0,"0509",{"$f":"MAX($D$401,$D$403)","v":-2.6875},{"$f":"MAX($D$402,$D$404)","v":-7.5},0.13997395833333334]
[{"$f":"IF(ModelNo=B39,10,\"\")","v":""},"0102","Screen Height",{"$f":"Frame_Height-1.75","v":-1.75},null,37,"03A3","Signature Elite Three Lite Slider (1/4-1/2-1/4)",0,0,null,null,52,12,{"$f":"IF(EXTSELECT=2,108,IF(EXTSELECT=3,110,\"\"))","v":""},{"$f":"IF(EXTSELECT=2,56,IF(EXTSELECT=3,72,\"\"))","v":""},{"$f":"IF(EXTSELECT=2,164,IF(EXTSELECT=3,182,\"\"))","v":""},"Standard (1/4-1/2-1/4)",null,null,null,"Half","Full",null,"Select Reinforcement","Composite","Steel",null,null,null,null,null,null,"Double Strength (3 mm)","Triple Strength (5 mm)","Triple IG Single Strength","Triple IG Double Strength","Laminated",null,null,"",null,null,null,null,0,"B501",{"$f":"MAX($D$359,$D$361)","v":-6.0625},{"$f":"MAX($D$360,$D$362)","v":-4.0625},0.17103407118055555,{"$f":"IF(AND(OR(Glass=4,Glass=5),OR($D$366=\"N/A\",$D$368=\"N/A\")),1,IF(AND(Glass=3,Single_ST=0),1,0))","v":{"$error":"#N/A"}}]
[{"$f":"IF(ModelNo=B40,11,\"\")","v":""},"0102","Egress Opening Width",{"$f":"TRUNC(((Frame_Width/2)-3.25)*16+0.5)/16","v":-3.1875},null,38,"03A4","Signature Elite Picture Window",0,0,null,null,9.5,9.5,112,112,154,"Standard",null,null,null,null,null,null,null,null,null,null,null,null,null,null,null,"Double Strength (3 mm)","Triple Strength (5 mm)","Triple IG Single Strength","Triple IG Double Strength","Laminated",null,null,"",null,null,null,null,0,"U501",{"$f":"MAX($D$359,$D$361)","v":-6.0625},{"$f":"MAX($D$360,$D$362)","v":-4.0625},0.17103407118055555,{"$f":"IF(AND(OR(Glass=4,Glass=5),OR($D$366=\"N/A\",$D$368=\"N/A\")),1,IF(AND(Glass=3,Single_ST=0),1,0))","v":{"$error":"#N/A"}}]
[{"$f":"IF(ModelNo=B41,12,\"\")","v":""},"0102","Egress Opening Height",{"$f":"TRUNC((Frame_Height-3.074)*16+0.5)/16","v":-3},null,39,"03A9","Signature Elite Three Lite Slider Equal Lite",0,0,null,null,52,12,{"$f":"IF(EXTSELECT=2,108,IF(EXTSELECT=3,120,\"\"))","v":""},{"$f":"IF(EXTSELECT=2,56,IF(EXTSELECT=3,72,\"\"))","v":""},{"$f":"IF(EXTSELECT=2,164,IF(EXTSELECT=3,192,\"\"))","v":""},"Standard (1/3-1/3-1/3)",null,null,null,"Half","Full",null,"Select Reinforcement","Composite","Steel",null,null,null,null,null,null,"Double Strength (3 mm)","Triple Strength (5 mm)","Triple IG Single Strength","Triple IG Double Strength","Laminated",null,null,"",null,null,null,null,0,"U502",{"$f":"$D$375","v":-3.5},{"$f":"$D$376","v":-7.5},0.18229166666666666]
[{"$f":"IF(ModelNo=B42,13,\"\")","v":""},"0102","Egress Opening Area (sq.ft.)",{"$f":"(D40*D41)/144","v":6.640625E-2},null,40,"L201","Concord Plus Double Hung",0,0,null,null,11,20,48,78,126,"Standard","Oriel (2/3 - 1/3)","Cottage (1/3 - 2/3)","Custom","Half","Full","Locking",null,null,null,null,null,null,null,null,"Single Strength (2.5 mm)","Double Strength (3 mm)","Triple Strength (5 mm)",null,null,null,null,null,"",null,null,null,null,0,"U503",{"$f":"MAX($D$387,$D$389)","v":-1.9375},{"$f":"MAX($D$388,$D$390)","v":-7.5},0.10091145833333333]
[{"$f":"IF(ModelNo=B43,1,\"\")","v":""},"0103","Sash Width",{"$f":"Frame_Width/4","v":0},null,41,"L202","Concord Plus Two Lite Slider",0,0,null,null,18,9,84,56,140,"Standard",null,null,null,"Half","Full",null,null,null,null,null,null,null,null,null,"Single Strength (2.5 mm)","Double Strength (3 mm)","Triple Strength (5 mm)",null,null,null,null,null,"",null,null,null,null,0,"U504",{"$f":"$D$120","v":-4.625},{"$f":"$D$121","v":-4.625},0.14854600694444445]
[{"$f":"IF(ModelNo=B44,2,\"\")","v":""},"0103","Sash Height",{"$f":"Frame_Height-2.25","v":-2.25},null,42,"L203","Cocord Plus Three Lite Slider (1/4-1/2-1/4)",0,0,null,null,48,9,108,56,164,"Standard (1/4-1/2-1/4)",null,null,null,"Half","Full",null,null,null,null,null,null,null,null,null,"Single Strength (2.5 mm)","Double Strength (3 mm)","Triple Strength (5 mm)",null,null,null,null,null,"",null,null,null,null,0,"U509",{"$f":"MAX($D$401,$D$403)","v":-2.6875},{"$f":"MAX($D$402,$D$404)","v":-7.5},0.13997395833333334]
[{"$f":"IF(ModelNo=B45,3,\"\")","v":""},"0103","Sash Glass Width",{"$f":"(TRUNC((Frame_Width/4-0.25)*16+0.5)/16)-1.4375","v":-1.625},null,43,"L204","Concord Plus Picture Window",0,0,null,null,9,9,96,96,154,"Standard",null,null,null,null,null,null,null,null,null,null,null,null,null,null,null,"Double Strength (3 mm)","Triple Strength (5 mm)",null,null,null,null,null,"",null,null,null,null,0,"0951",{"$f":"$D$74","v":-4.625},{"$f":"$D$75","v":-4.625},0.14854600694444445]
[{"$f":"IF(ModelNo=B46,4,\"\")","v":""},"0103","Sash Glass Height",{"$f":"Frame_Height-3.9375","v":-3.9375},null,44,"L209","Cocord Plus Three Lite Slider Equal Lite",0,0,null,null,38,9,108,56,164,"Standard (1/3-1/3-1/3)",null,null,null,"Half","Full",null,null,null,null,null,null,null,null,null,"Single Strength (2.5 mm)","Double Strength (3 mm)","Triple Strength (5 mm)",null,null,null,null,null,"",null,null,null,null,0,"0952",{"$f":"MAX($D$84,$D$86)","v":-4.625},{"$f":"MAX($D$85,$D$87)","v":-4.375},0.14051649305555555]
[{"$f":"IF(ModelNo=B47,5,\"\")","v":""},"0103","Fixed Glass Width",{"$f":"(Frame_Width-2*(TRUNC((Frame_Width/4-0.25)*16+0.5)/16))-1.9375","v":-1.5625},null,45,"0301","New Const. Double Hung",0.5,0.5,null,null,14.25,25.25,48,78,126,"Standard","Oriel (2/3 - 1/3)","Cottage (1/3 - 2/3)","Custom","Half","Full",null,null,null,null,null,null,null,null,null,"Single Strength (2.5 mm)","Double Strength (3 mm)","Triple Strength (5 mm)",null,null,"Laminated",null,null,"<< Select Opening",null,null,null,null,0,"0953",{"$f":"MAX($D$95,$D$97)","v":-4.625},{"$f":"MAX($D$96,$D$98)","v":-4.375},0.14051649305555555]
[{"$f":"IF(ModelNo=B48,6,\"\")","v":""},"0103","Fixed Glass Height",{"$f":"Frame_Height-2","v":-2},null,46,"0501","Sequoia Double Hung",0,0,null,null,15.25,26.75,52,84,136,"Standard","Oriel (2/3 - 1/3)","Cottage (1/3 - 2/3)","Custom","Half","Full","Locking",null,null,null,null,null,null,null,null,null,"Double Strength (3 mm)","Triple Strength (5 mm)","Triple IG Single Strength","Triple IG Double Strength","Laminated",null,null,{"$f":"IF(RO=2,\"<< Exact Size Only\",\"\")","v":""},null,null,null,null,0,"0954",{"$f":"MAX($D$106,$D$108)","v":-4.625},{"$f":"MAX($D$107,$D$109)","v":-4.375},0.14051649305555555]
[{"$f":"IF(ModelNo=B49,7,\"\")","v":""},"0103","Astragal Length",{"$f":"TRUNC((Frame_Height-1.218)*16+0.5)/16","v":-1.125},null,47,"0502","Sequoia Two Lite Slider",0,0,null,null,25.25,16.625,84,68,148,"Standard",null,null,null,"Half","Full",null,null,null,null,null,null,null,null,null,null,"Double Strength (3 mm)","Triple Strength (5 mm)","Triple IG Single Strength","Triple IG Double Strength","Laminated",null,null,"",null,null,null,null,0,"0955",{"$f":"$D$115","v":-4.625},{"$f":"$D$116","v":-4.375},0.14051649305555555]
[{"$f":"IF(ModelNo=B50,8,\"\")","v":""},"0103","Roller Track Length",{"$f":"Frame_Width-1","v":-1},null,48,"0503","Sequoia Three Lite Slider (1/4-1/2-1/4)",0,0,null,null,44.5,16.625,120,68,188,"Standard (1/4-1/2-1/4)",null,null,null,"Half","Full",null,null,null,null,null,null,null,null,null,null,"Double Strength (3 mm)","Triple Strength (5 mm)","Triple IG Single Strength","Triple IG Double Strength","Laminated",null,null,"",null,null,null,null,0,"0970",{"$f":"$D$120","v":-4.625},{"$f":"$D$121","v":-4.625},0.14854600694444445]
[{"$f":"IF(ModelNo=B51,9,\"\")","v":""},"0103","Screen Width",{"$f":"(Frame_Width/4)-1.3125","v":-1.3125},null,49,"0504","Sequoia Picture Window",0,0,null,null,13,13,96,96,154,"Standard",null,null,null,null,null,null,null,null,null,null,null,null,null,null,null,"Double Strength (3 mm)","Triple Strength (5 mm)","Triple IG Single Strength","Triple IG Double Strength","Laminated",null,null,"",null,null,null,null,0,"B970",{"$f":"$D$120","v":-4.625},{"$f":"$D$121","v":-4.625},0.14854600694444445]
[{"$f":"IF(ModelNo=B52,10,\"\")","v":""},"0103","Screen Height",{"$f":"Frame_Height-1.75","v":-1.75},null,50,"0509","Sequoia Three Lite Slider Equal Lite",0,0,null,null,35.5,16.625,112,68,184,"Standard (1/3-1/3-1/3)",null,null,null,"Half","Full",null,null,null,null,null,null,null,null,null,null,"Double Strength (3 mm)","Triple Strength (5 mm)","Triple IG Single Strength","Triple IG Double Strength","Laminated",null,null,"",null,null,null,null,0,"0971",{"$f":"$D$125","v":-4.625},{"$f":"$D$126","v":-4.625},0.14854600694444445]
[{"$f":"IF(ModelNo=B53,11,\"\")","v":""},"0103","Egress Opening Width",{"$f":"(Frame_Width/4)-2.3125","v":-2.3125},null,51,"B501","Sequoia Bay-Bow Double Hung",0,0,null,null,15.25,26.75,52,84,136,"Standard","Oriel (2/3 - 1/3)","Cottage (1/3 - 2/3)","Custom","Half","Full","Locking",null,null,null,null,null,null,null,null,null,"Double Strength (3 mm)","Triple Strength (5 mm)","Triple IG Single Strength","Triple IG Double Strength","Laminated",null,null,"",null,null,null,null,0,"B971",{"$f":"$D$125","v":-4.625},{"$f":"$D$126","v":-4.625},0.14854600694444445]
[{"$f":"IF(ModelNo=B54,12,\"\")","v":""},"0103","Egress Opening Height",{"$f":"TRUNC((Frame_Height-3.074)*16+0.5)/16","v":-3},null,52,"0522","Swing & Clean Two Lite Slider",0,0,null,null,30,20,72,60,120,"Standard",null,null,null,"Half","Full",null,null,null,null,null,null,null,null,null,null,"Double Strength (3 mm)","Triple Strength (5 mm)","Triple IG Single Strength","Triple IG Double Strength","Laminated",null,null,"",null,null,null,null,0,"0972",{"$f":"$D$137","v":-4.375},{"$f":"$D$138","v":-4.625},0.14051649305555555]
[{"$f":"IF(ModelNo=B55,13,\"\")","v":""},"0103","Egress Opening Area (sq.ft.)",{"$f":"(D53*D54)/144","v":4.8177083333333336E-2},null,53,"0523","Swing & Clean Three Lite Slider (1/4-1/2-1/4)",0,0,null,null,48,20,84,60,144,"Standard (1/4-1/2-1/4)",null,null,null,"Half","Full",null,null,null,null,null,null,null,null,null,null,"Double Strength (3 mm)","Triple Strength (5 mm)","Triple IG Single Strength","Triple IG Double Strength","Laminated",null,null,"",null,null,null,null,0,"0973",{"$f":"MAX($D$151,$D$153)","v":-4.125},{"$f":"MAX($D$152,$D$154)","v":-4.625},0.13248697916666666]
[{"$f":"IF(ModelNo=B56,1,\"\")","v":""},"0104","Glass Width",{"$f":"Frame_Width-1.9375","v":-1.9375},null,54,"0529","Swing & Clean Three Lite Slider Equal Lite",0,0,null,null,48,20,84,60,144,"Standard (1/3-1/3-1/3)",null,null,null,"Half","Full",null,null,null,null,null,null,null,null,null,null,"Double Strength (3 mm)","Triple Strength (5 mm)","Triple IG Single Strength","Triple IG Double Strength","Laminated",null,null,"",null,null,null,null,{"$f":"IF(ModelNo=AU56,ModelNo,0)","v":0},"0974",{"$f":"MAX($D$183,$D$185)","v":-4.25},{"$f":"MAX($D$184,$D$186)","v":-4.625},{"$f":"(AV56*AW56)/144","v":0.1365017361111111}]
[{"$f":"IF(ModelNo=B57,2,\"\")","v":""},"0104","Glass Height",{"$f":"Frame_Height-1.9375","v":-1.9375},null,55,"0700","0700 Series Single Hung",0,0,null,null,14.375,23.75,52,72,120,"Standard","Oriel (2/3 - 1/3)","Cottage (1/3 - 2/3)","Custom","Half",null,null,null,null,null,null,null,null,null,null,"Single Strength (2.5 mm)","Double Strength (3 mm)","Triple Strength (5 mm)",null,null,"Laminated",null,null,"",null,null,null,null,0,"0975",{"$f":"MAX($D$199,$D$201)","v":-4.1875},{"$f":"MAX($D$200,$D$202)","v":-4.625},0.1344943576388889]
[{"$f":"IF(ModelNo=B58,3,\"\")","v":""},"0104","Glass Area (sq.ft.)",{"$f":"(D56*D57)/144","v":2.6068793402777776E-2},null,56,"07HP","0700 Series Single Hung",0,0,null,null,14.375,23.75,52,77,129,"Standard","Oriel (2/3 - 1/3)","Cottage (1/3 - 2/3)","Custom","Half",null,null,null,null,null,null,null,null,null,null,"Single Strength (2.5 mm)","Double Strength (3 mm)","Triple Strength (5 mm)",null,null,"Laminated",null,null,{"$f":"IF(RO=2,\"<< Exact Size Only\",\"\")","v":""},null,null,null,null,0,"0979",{"$f":"MAX($D$167,$D$169)","v":-4.25},{"$f":"MAX($D$168,$D$170)","v":-4.625},0.1365017361111111]
[{"$f":"IF(ModelNo=B59,1,\"\")","v":""},"0109","Sash Width",{"$f":"TRUNC(((Frame_Width/3)+0.4375)*16+0.5)/16","v":0.4375},null,57,"0702","0700 Series Two Lite Slider",0,0,null,null,23.5,14.25,72,60,132,"Standard",null,null,null,"Half",null,null,null,null,null,null,null,null,null,null,"Single Strength (2.5 mm)","Double Strength (3 mm)","Triple Strength (5 mm)",null,null,"Laminated",null,null,"",null,null,null,null,0,"6102",{"$f":"$D$883","v":-3.75},{"$f":"$D$884","v":-8.9375},0.23274739583333334]
[{"$f":"IF(ModelNo=B60,2,\"\")","v":""},"0109","Sash Height",{"$f":"Frame_Height-2.25","v":-2.25},null,58,"0703","0700 Series Three Lite Slider (1/4-1/2-1/4)",0,0,null,null,48,14.25,108,60,168,"Standard (1/4-1/2-1/4)",null,null,null,"Half",null,null,null,null,null,null,null,null,null,null,"Single Strength (2.5 mm)","Double Strength (3 mm)","Triple Strength (5 mm)",null,null,"Laminated",null,null,"",null,null,null,null,0,"6103",{"$f":"$D$895","v":-3.5625},{"$f":"$D$896","v":-8.9375},0.22111002604166666]
[{"$f":"IF(ModelNo=B61,3,\"\")","v":""},"0109","Sash Glass Width",{"$f":"(TRUNC((Frame_Width/3+0.1875)*16+0.5)/16)-1.4375","v":-1.25},null,59,"0704","0700 Series Picture Window",0,0,null,null,12,12,96,96,154,"Standard",null,null,null,null,null,null,null,null,null,null,null,null,null,null,null,"Double Strength (3 mm)","Triple Strength (5 mm)",null,null,"Laminated",null,null,"",null,null,null,null,0,"6104",{"$f":"$D$909","v":-3.25},{"$f":"$D$910","v":-8.9375},0.20171440972222221]
[{"$f":"IF(ModelNo=B62,4,\"\")","v":""},"0109","Sash Glass Height",{"$f":"Frame_Height-3.9375","v":-3.9375},null,60,"0709","0700 Series Three Lite Slider Equal Lite",0,0,null,null,34.75,14.25,108,60,168,"Standard (1/3-1/3-1/3)",null,null,null,"Half",null,null,null,null,null,null,null,null,null,null,"Single Strength (2.5 mm)","Double Strength (3 mm)","Triple Strength (5 mm)",null,null,"Laminated",null,null,"",null,null,null,null,0,"6105",{"$f":"$D$883","v":-3.75},{"$f":"$D$884","v":-8.9375},0.23274739583333334]
[{"$f":"IF(ModelNo=B63,5,\"\")","v":""},"0109","Fixed Glass Width",{"$f":"(Frame_Width-2*(TRUNC((Frame_Width/3+0.1875)*16+0.5)/16))-1.9375","v":-2.3125},null,61,"0901","Concord Double Hung",0,0,null,null,15,22,48,84,132,"Standard","Oriel (2/3 - 1/3)","Cottage (1/3 - 2/3)","Custom","Half","Full","Locking",null,null,null,null,null,null,null,null,null,"Double Strength (3 mm)","Triple Strength (5 mm)",null,null,"Laminated",null,null,"",null,null,null,null,0,"6106",{"$f":"$D$883","v":-3.75},{"$f":"$D$884","v":-8.9375},0.23274739583333334]
[{"$f":"IF(ModelNo=B64,6,\"\")","v":""},"0109","Fixed Glass Height",{"$f":"Frame_Height-2","v":-2},null,62,"0902","Concord Two Lite Slider",0,0,null,null,21.5,15.5,84,66,148,"Standard",null,null,null,"Half","Full",null,null,null,null,null,null,null,null,null,null,"Double Strength (3 mm)","Triple Strength (5 mm)",null,null,"Laminated",null,null,"",null,null,null,null,0,"6108",{"$f":"$D$883","v":-3.75},{"$f":"$D$884","v":-8.9375},0.23274739583333334]
[{"$f":"IF(ModelNo=B65,7,\"\")","v":""},"0109","Astragal Length",{"$f":"TRUNC((Frame_Height-1.218)*16+0.5)/16","v":-1.125},null,63,"0903","Concord Three Lite Slider (1/4-1/2-1/4)",0,0,null,null,39.75,15.5,108,66,164,"Standard (1/4-1/2-1/4)",null,null,null,"Half","Full",null,null,null,null,null,null,null,null,null,null,"Double Strength (3 mm)","Triple Strength (5 mm)",null,null,"Laminated",null,null,"",null,null,null,null,0,"6109",{"$f":"$D$895","v":-3.5625},{"$f":"$D$896","v":-8.9375},0.22111002604166666]
[{"$f":"IF(ModelNo=B66,8,\"\")","v":""},"0109","Roller Track Length",{"$f":"Frame_Width-1","v":-1},null,64,"0907","Concord Single Vent Hopper",0,0,null,null,12,12,37,37,61,"Standard",null,null,null,null,"Full",null,null,null,null,null,null,null,null,null,null,"Double Strength (3 mm)","Triple Strength (5 mm)",null,null,"Laminated",null,null,"",null,null,null,null,0,"6112",{"$f":"$D$909","v":-3.25},{"$f":"$D$910","v":-8.9375},0.20171440972222221]
[{"$f":"IF(ModelNo=B67,9,\"\")","v":""},"0109","Screen Width",{"$f":"TRUNC(((Frame_Width/3)-0.875)*16+0.5)/16","v":-0.8125},null,65,"0909","Concord Three Lite Slider Equal Lite",0,0,null,null,30.25,15.5,120,66,164,"Standard (1/3-1/3-1/3)",null,null,null,"Half","Full",null,null,null,null,null,null,null,null,null,null,"Double Strength (3 mm)","Triple Strength (5 mm)",null,null,"Laminated",null,null,"",null,null,null,null,0,"6122",{"$f":"$D$895","v":-3.5625},{"$f":"$D$896","v":-8.9375},0.22111002604166666]
[{"$f":"IF(ModelNo=B68,10,\"\")","v":""},"0109","Screen Height",{"$f":"Frame_Height-1.75","v":-1.75},null,66,"0914","Concord Picture Window",0,0,null,null,14.5,13,96,84,154,"Standard",null,null,null,null,null,null,null,null,null,null,null,null,null,null,null,"Double Strength (3 mm)","Triple Strength (5 mm)",null,null,"Laminated",null,null,"",null,null,null,null,0,"6175",{"$f":"$D$883","v":-3.75},{"$f":"$D$884","v":-8.9375},0.23274739583333334]
[{"$f":"IF(ModelNo=B69,11,\"\")","v":""},"0109","Egress Opening Width",{"$f":"TRUNC(((Frame_Width/3)-4.3125)*16+0.5)/16","v":-4.25},null,67,"09L1","09L1 Series Double Hung",0,0,null,null,15,22,44,77,121,"Standard","Oriel (2/3 - 1/3)","Cottage (1/3 - 2/3)","Custom","Half","Full","Locking",null,null,null,null,null,null,null,null,"Single Strength (2.5 mm)","Double Strength (3 mm)","Triple Strength (5 mm)",null,null,"Laminated",null,null,"",null,null,null,null,0,"6402",{"$f":"$D$958","v":-5.125},{"$f":"$D$959","v":-8.625},0.30696614583333331]
[{"$f":"IF(ModelNo=B70,12,\"\")","v":""},"0109","Egress Opening Height",{"$f":"TRUNC((Frame_Height-3.074)*16+0.5)/16","v":-3},null,68,"09L2","09L1 Series Two Lite Slider",0,0,null,null,21.5,15.5,72,56,128,"Standard",null,null,null,"Half","Full",null,null,null,null,null,null,null,null,null,"Single Strength (2.5 mm)","Double Strength (3 mm)","Triple Strength (5 mm)",null,null,"Laminated",null,null,"",null,null,null,null,0,"6403",{"$f":"$D$971","v":-5},{"$f":"$D$972","v":-8.625},0.29947916666666669]
[{"$f":"IF(ModelNo=B71,13,\"\")","v":""},"0109","Egress Opening Area (sq.ft.)",{"$f":"(D69*D70)/144","v":8.8541666666666671E-2},null,69,"09L3","09L1 Series Three Lite Slider (1/4-1/2-1/4)",0,0,null,null,39.75,15.5,108,56,164,"Standard (1/4-1/2-1/4)",null,null,null,"Half","Full",null,null,null,null,null,null,null,null,null,"Single Strength (2.5 mm)","Double Strength (3 mm)","Triple Strength (5 mm)",null,null,"Laminated",null,null,"",null,null,null,null,0,"6404",{"$f":"$D$984","v":-4.6875},{"$f":"$D$985","v":-8.625},0.28076171875]
[{"$f":"IF(OR(ModelNo=\"0151\",ModelNo=\"0951\"),1,\"\")","v":""},"0151","Sash Width",{"$f":"Frame_Width-1.625","v":-1.625},null,70,"09L4","09L1 Picture Window",0,0,null,null,14.5,13,96,84,154,"Standard",null,null,null,null,null,null,null,null,null,null,null,null,null,null,null,"Double Strength (3 mm)","Triple Strength (5 mm)",null,null,"Laminated",null,null,"",null,null,null,null,0,"6405",{"$f":"$D$958","v":-5.125},{"$f":"$D$959","v":-8.625},0.30696614583333331]
[{"$f":"IF(OR(ModelNo=\"0151\",ModelNo=\"0951\"),2,\"\")","v":""},"0151","Sash Height",{"$f":"Frame_Height-1.625","v":-1.625},null,71,"09L9","09L1 Series Three Lite Slider Equal Lite",0,0,null,null,30.25,15.5,108,56,164,"Standard (1/3-1/3-1/3)",null,null,null,"Half","Full",null,null,null,null,null,null,null,null,null,"Single Strength (2.5 mm)","Double Strength (3 mm)","Triple Strength (5 mm)",null,null,"Laminated",null,null,"",null,null,null,null,0,"6406",{"$f":"$D$958","v":-5.125},{"$f":"$D$959","v":-8.625},0.30696614583333331]
[{"$f":"IF(OR(ModelNo=\"0151\",ModelNo=\"0951\"),3,\"\")","v":""},"0151","Sash Glass Width",{"$f":"Frame_Width-4.625","v":-4.625},null,72,"0951","Single Vent Awning",0,0,null,null,19,16,48,48,96,"Standard",null,null,null,null,"Full",null,null,null,null,null,null,null,null,null,null,"Double Strength (3 mm)","Triple Strength (5 mm)","Triple IG Single Strength","Triple IG Double Strength","Laminated",null,null,"",null,null,null,null,0,"6408",{"$f":"$D$958","v":-5.125},{"$f":"$D$959","v":-8.625},0.30696614583333331]
[{"$f":"IF(OR(ModelNo=\"0151\",ModelNo=\"0951\"),4,\"\")","v":""},"0151","Sash Glass Height",{"$f":"Frame_Height-4.625","v":-4.625},null,73,"0952","Awning W/ Transom Equal Lite",0,0,null,null,19,32,48,96,144,"Standard",null,null,null,"Half",null,null,null,null,null,null,null,null,null,null,null,"Double Strength (3 mm)","Triple Strength (5 mm)","Triple IG Single Strength","Triple IG Double Strength","Laminated",null,null,"",null,null,null,null,0,"6409",{"$f":"$D$971","v":-5},{"$f":"$D$972","v":-8.625},0.29947916666666669]
[{"$f":"IF(OR(ModelNo=\"0151\",ModelNo=\"0951\"),5,\"\")","v":""},"0151","Glass Area (sq.ft.)",{"$f":"(D74*D75)/144","v":0.14854600694444445},null,74,"0953","Awning W/ Transom (1/3-2/3)",0,0,null,null,19,48,48,96,144,"Standard",null,null,null,"Half",null,null,null,null,null,null,null,null,null,null,null,"Double Strength (3 mm)","Triple Strength (5 mm)","Triple IG Single Strength","Triple IG Double Strength","Laminated",null,null,"",null,null,null,null,0,"6412",{"$f":"$D$984","v":-4.6875},{"$f":"$D$985","v":-8.625},0.28076171875]
[{"$f":"IF(OR(ModelNo=\"0151\",ModelNo=\"0951\"),6,\"\")","v":""},"0151","Screen Width",{"$f":"Frame_Width-4","v":-4},null,75,"0954","Single Vent Awning W/ Bottom Transom",0,0,null,null,19,32,48,96,144,"Standard",null,null,null,"Half",null,null,null,null,null,null,null,null,null,null,null,"Double Strength (3 mm)","Triple Strength (5 mm)","Triple IG Single Strength","Triple IG Double Strength","Laminated",null,null,"",null,null,null,null,0,"6422",{"$f":"$D$971","v":-5},{"$f":"$D$972","v":-8.625},0.29947916666666669]
[{"$f":"IF(OR(ModelNo=\"0151\",ModelNo=\"0951\"),7,\"\")","v":""},"0151","Screen Height",{"$f":"Frame_Height-4","v":-4},null,76,"0955","Dual Vent Awning Equal Lite",0,0,null,null,19,32,48,96,144,"Standard",null,null,null,"Half",null,null,null,null,null,null,null,null,null,null,null,"Double Strength (3 mm)","Triple Strength (5 mm)","Triple IG Single Strength","Triple IG Double Strength","Laminated",null,null,"",null,null,null,null,0,"6475",{"$f":"$D$958","v":-5.125},{"$f":"$D$959","v":-8.625},0.30696614583333331]
[{"$f":"IF(OR(ModelNo=\"0151\",ModelNo=\"0951\"),8,\"\")","v":""},"0151","Awning Does not Meet Egress",null,null,77,"0970","Casement Picture Window",0,0,null,null,13,13,96,96,154,"Standard",null,null,null,null,null,null,null,null,null,null,null,null,null,null,null,"Double Strength (3 mm)","Triple Strength (5 mm)","Triple IG Single Strength","Triple IG Double Strength","Laminated",null,null,"",null,null,null,null,null,{"$f":"IF(ISERROR(VLOOKUP(ModelNo,AT24:AU78,2,FALSE)),\"\",ModelNo)","v":""},{"$f":"IF(ISERROR(VLOOKUP(ModelNo,$AU$24:$AY$78,2,FALSE)),0,VLOOKUP(ModelNo,$AU$24:$AY$78,2,FALSE))","v":0},{"$f":"IF(ISERROR(VLOOKUP(ModelNo,$AU$24:$AY$78,3,FALSE)),0,VLOOKUP(ModelNo,$AU$24:$AY$78,3,FALSE))","v":0},{"$f":"IF(ISERROR(VLOOKUP(ModelNo,$AU$24:$AY$78,4,FALSE)),0,VLOOKUP(ModelNo,$AU$24:$AY$78,4,FALSE))","v":0},{"$f":"IF(ISERROR(VLOOKUP(ModelNo,$AU$24:$AY$78,5,FALSE)),0,VLOOKUP(ModelNo,$AU$24:$AY$78,5,FALSE))","v":0}]
[{"$f":"IF(OR(ModelNo=\"0152\",ModelNo=\"0952\"),1,\"\")","v":""},"0152","Operating Sash Width",{"$f":"Frame_Width-1.625","v":-1.625},null,78,"B970","Casement Bay-Bow Picture Window",0,0,null,null,13,13,96,96,154,"Standard",null,null,null,null,null,null,null,null,null,null,null,null,null,null,{"$f":"IF(OR(Glass=1,Glass=7,Glass=8),\"<< Not Available\",\"\")","v":"<< Not Available"},null,null,null,null,null,null,null,{"$f":"IF(RO=2,\"<< Exact Size Only\",\"\")","v":""}]
[{"$f":"IF(OR(ModelNo=\"0152\",ModelNo=\"0952\"),2,\"\")","v":""},"0152","Operating Sash Height",{"$f":"(Frame_Height/2)-1.375","v":-1.375},null,79,"0971","Single Vent Casement",0,0,null,null,16,19,36,78,114,"Standard",null,null,null,null,"Full",null,null,null,null,null,null,null,null,null,null,"Double Strength (3 mm)","Triple Strength (5 mm)","Triple IG Single Strength","Triple IG Double Strength","Laminated",null,null,""]
[{"$f":"IF(OR(ModelNo=\"0152\",ModelNo=\"0952\"),3,\"\")","v":""},"0152","Fixed Sash Width",{"$f":"Frame_Width-1.625","v":-1.625},null,80,"B971","Casement Bay-Bow Single Vent",0,0,null,null,16,19,36,78,114,"Standard",null,null,null,null,"Full",null,null,null,null,null,null,null,null,null,null,"Double Strength (3 mm)","Triple Strength (5 mm)","Triple IG Single Strength","Triple IG Double Strength","Laminated",null,null,""]
[{"$f":"IF(OR(ModelNo=\"0152\",ModelNo=\"0952\"),4,\"\")","v":""},"0152","Fixed Sash Height",{"$f":"(Frame_Height/2)-1.375","v":-1.375},null,81,"0972","Dual Vent Casement",0,0,null,null,32,19,72,78,150,"Standard",null,null,null,"Half",null,null,null,null,null,null,null,null,null,null,null,"Double Strength (3 mm)","Triple Strength (5 mm)","Triple IG Single Strength","Triple IG Double Strength","Laminated",null,null,""]
[{"$f":"IF(OR(ModelNo=\"0152\",ModelNo=\"0952\"),5,\"\")","v":""},"0152","Operating Sash Glass Width",{"$f":"Frame_Width-4.625","v":-4.625},null,82,"0973","Dual Vent Three Lite Casement (1/4-1/2-1/4)",0,0,null,null,64,19,120,78,198,"Standard (1/4-1/2-1/4)",null,null,null,"Half",null,null,null,null,null,null,null,null,null,null,null,"Double Strength (3 mm)","Triple Strength (5 mm)","Triple IG Single Strength","Triple IG Double Strength","Laminated",null,null,""]
[{"$f":"IF(OR(ModelNo=\"0152\",ModelNo=\"0952\"),6,\"\")","v":""},"0152","Operating Sash Glass Height",{"$f":"Frame_Height/2-4.375","v":-4.375},null,83,"0974","Four Lite Casement",0,0,null,null,64,19,120,78,198,"Standard",null,null,null,"Half",null,null,null,null,null,null,null,null,null,null,null,"Double Strength (3 mm)","Triple Strength (5 mm)","Triple IG Single Strength","Triple IG Double Strength","Laminated",null,null,""]
[{"$f":"IF(OR(ModelNo=\"0152\",ModelNo=\"0952\"),7,\"\")","v":""},"0152","Fixed Sash Glass Width",{"$f":"Frame_Width-4.625","v":-4.625},null,84,"0975","Five Lite Casement",0,0,null,null,80,19,120,78,198,"Standard",null,null,null,"Half",null,null,null,null,null,null,null,null,null,null,null,"Double Strength (3 mm)","Triple Strength (5 mm)","Triple IG Single Strength","Triple IG Double Strength","Laminated",null,null,""]
[{"$f":"IF(OR(ModelNo=\"0152\",ModelNo=\"0952\"),8,\"\")","v":""},"0152","Fixed Sash Glass Height",{"$f":"Frame_Height/2-4.375","v":-4.375},null,85,"0979","Dual Vent Three Lite Casement (Equal Lite)",0,0,null,null,48,19,108,78,186,"Standard (1/3-1/3-1/3)",null,null,null,"Half",null,null,null,null,null,null,null,null,null,null,null,"Double Strength (3 mm)","Triple Strength (5 mm)","Triple IG Single Strength","Triple IG Double Strength","Laminated",null,null,""]
[{"$f":"IF(OR(ModelNo=\"0152\",ModelNo=\"0952\"),9,\"\")","v":""},"0152","Screen Width",{"$f":"Frame_Width-4","v":-4},null,86,"1105","New Const. Five Foot Patio Door",0.625,0.5,60,80,59.375,79.5,59.375,79.5,140,"Standard",null,null,null,"Half",null,null,null,null,null,null,null,null,null,null,null,"Double Strength (3 mm)","Triple Strength (5 mm)","Triple IG Single Strength","Triple IG Double Strength","Laminated",null,null,{"$f":"IF(RO=1,\"<< Rough Opening Only\",\"\")","v":"<< Rough Opening Only"}]
[{"$f":"IF(OR(ModelNo=\"0152\",ModelNo=\"0952\"),10,\"\")","v":""},"0152","Screen Height",{"$f":"(Frame_Height/2)-3.6875","v":-3.6875},null,87,"1106","New Const. Six Foot Patio Door",0.625,0.5,72,96,71.375,79.5,71.375,95.5,168,"Standard",null,null,null,"Half",null,null,null,null,null,null,null,null,null,null,null,"Double Strength (3 mm)","Triple Strength (5 mm)","Triple IG Single Strength","Triple IG Double Strength","Laminated",null,null,"<< Rough Opening Only"]
[{"$f":"IF(OR(ModelNo=\"0152\",ModelNo=\"0952\"),11,\"\")","v":""},"0152","Awning Does not Meet Egress",null,null,88,"1108","New Const. Eight Foot Patio Door",0.625,0.5,96,80,95.375,79.5,95.375,79.5,176,"Standard",null,null,null,"Half",null,null,null,null,null,null,null,null,null,null,null,"Double Strength (3 mm)","Triple Strength (5 mm)","Triple IG Single Strength","Triple IG Double Strength","Laminated",null,null,"<< Rough Opening Only"]
[{"$f":"IF(OR(ModelNo=\"0153\",ModelNo=\"0953\"),1,\"\")","v":""},"0153","Operating Sash Width",{"$f":"Frame_Width-1.625","v":-1.625},null,89,"1109","New Const. Nine Foot Patio Door",0.625,0.5,108,96,107.375,79.5,107.375,95.5,204,"Standard",null,null,null,"Half",null,null,null,null,null,null,null,null,null,null,null,"Double Strength (3 mm)","Triple Strength (5 mm)","Triple IG Single Strength","Triple IG Double Strength","Laminated",null,null,"<< Rough Opening Only"]
[{"$f":"IF(OR(ModelNo=\"0153\",ModelNo=\"0953\"),2,\"\")","v":""},"0153","Operating Sash Height",{"$f":"(Frame_Height/3)-1.375","v":-1.375},null,90,"1176","New Const. 6.5 Foot Patio Door",0.625,0.5,76,80,75.375,79.5,75.375,79.5,156,"Standard",null,null,null,"Half",null,null,null,null,null,null,null,null,null,null,null,"Double Strength (3 mm)","Triple Strength (5 mm)","Triple IG Single Strength","Triple IG Double Strength","Laminated",null,null,"<< Rough Opening Only"]
[{"$f":"IF(OR(ModelNo=\"0153\",ModelNo=\"0953\"),3,\"\")","v":""},"0153","Fixed Sash Width",{"$f":"Frame_Width-1.625","v":-1.625},null,91,"11C5","New Const. C. Class Five Foot Patio Door",0.5,0.5,60,80,59.5,79.5,59.5,80,140,"Standard",null,null,null,"Half",null,null,null,null,null,null,null,null,null,null,null,"Double Strength (3 mm)","Triple Strength (5 mm)","Triple IG Single Strength","Triple IG Double Strength","Laminated",null,null,"<< Rough Opening Only"]
[{"$f":"IF(OR(ModelNo=\"0153\",ModelNo=\"0953\"),4,\"\")","v":""},"0153","Fixed Sash Height",{"$f":"(2*(Frame_Height/3)-1.375)","v":-1.375},null,92,"11C6","New Const. C. Class Six Foot Patio Door",0.5,0.5,72,80,71.5,79.5,72,80,152,"Standard",null,null,null,"Half",null,null,null,null,null,null,null,null,null,null,null,"Double Strength (3 mm)","Triple Strength (5 mm)","Triple IG Single Strength","Triple IG Double Strength","Laminated",null,null,"<< Rough Opening Only"]
[{"$f":"IF(OR(ModelNo=\"0153\",ModelNo=\"0953\"),5,\"\")","v":""},"0153","Operating Sash Glass Width",{"$f":"Frame_Width-4.625","v":-4.625},null,93,"11C8","New Const. C. Class Eight Foot Patio Door",0.5,0.5,96,80,95.5,79.5,96,80,176,"Standard",null,null,null,"Half",null,null,null,null,null,null,null,null,null,null,null,"Double Strength (3 mm)","Triple Strength (5 mm)","Triple IG Single Strength","Triple IG Double Strength","Laminated",null,null,"<< Rough Opening Only"]
[{"$f":"IF(OR(ModelNo=\"0153\",ModelNo=\"0953\"),6,\"\")","v":""},"0153","Operating Sash Glass Height",{"$f":"Frame_Height/3-4.375","v":-4.375},null,94,"11C9","New Const. C. Class Nine Foot Patio Door",0.5,0.5,108,80,107.5,79.5,108,80,188,"Standard",null,null,null,"Half",null,null,null,null,null,null,null,null,null,null,null,"Double Strength (3 mm)","Triple Strength (5 mm)","Triple IG Single Strength","Triple IG Double Strength","Laminated",null,null,"<< Rough Opening Only"]
[{"$f":"IF(OR(ModelNo=\"0153\",ModelNo=\"0953\"),7,\"\")","v":""},"0153","Fixed Sash Glass Width",{"$f":"Frame_Width-4.625","v":-4.625},null,95,"11i5","Coastal Impact Five Foot New Const. Patio Door",0.5,0.5,60,80,59.5,79.5,60,80,140,"Standard",null,null,null,"Half",null,null,null,null,null,null,null,null,null,null,null,"Double Strength (3 mm)","Triple Strength (5 mm)","Triple IG Single Strength","Triple IG Double Strength","Laminated",null,null,"<< Rough Opening Only"]
[{"$f":"IF(OR(ModelNo=\"0153\",ModelNo=\"0953\"),8,\"\")","v":""},"0153","Fixed Sash Glass Height",{"$f":"2*(Frame_Height/3)-4.375","v":-4.375},null,96,"11i6","Coastal Impact Six Foot New Const. Patio Door",0.5,0.5,72,80,71.5,79.5,72,80,152,"Standard",null,null,null,"Half",null,null,null,null,null,null,null,null,null,null,null,"Double Strength (3 mm)","Triple Strength (5 mm)","Triple IG Single Strength","Triple IG Double Strength","Laminated",null,null,"<< Rough Opening Only"]
[{"$f":"IF(OR(ModelNo=\"0153\",ModelNo=\"0953\"),9,\"\")","v":""},"0153","Screen Width",{"$f":"Frame_Width-4","v":-4},null,97,"11i8","Coastal Impact Eight Foot New Const. Patio Door",0.5,0.5,96,80,95.5,79.5,96,80,176,"Standard",null,null,null,"Half",null,null,null,null,null,null,null,null,null,null,null,"Double Strength (3 mm)","Triple Strength (5 mm)","Triple IG Single Strength","Triple IG Double Strength","Laminated",null,null,"<< Rough Opening Only"]
[{"$f":"IF(OR(ModelNo=\"0153\",ModelNo=\"0953\"),10,\"\")","v":""},"0153","Screen Height",{"$f":"(Frame_Height/3)-3.6875","v":-3.6875},null,98,"5102","5100 Series Custom Two Lite Patio Door",0,0,null,null,48,72,96,96,192,null,null,null,null,"Half",null,null,null,null,null,null,null,null,null,null,null,"Double Strength (3 mm)","Triple Strength (5 mm)","Triple IG Single Strength","Triple IG Double Strength","Laminated",null,null,{"$f":"IF(RO=2,\"<< Exact Size Only\",\"\")","v":""}]
[{"$f":"IF(OR(ModelNo=\"0153\",ModelNo=\"0953\"),11,\"\")","v":""},"0153","Awning Does not Meet Egress",null,null,99,"5103","5100 Series Custom Three Lite Patio Door",0,0,null,null,84,72,108,96,204,null,null,null,null,"Half",null,null,null,null,null,null,null,null,null,null,null,"Double Strength (3 mm)","Triple Strength (5 mm)","Triple IG Single Strength","Triple IG Double Strength","Laminated",null,null,{"$f":"IF(RO=2,\"<< Exact Size Only\",\"\")","v":""}]
[{"$f":"IF(OR(ModelNo=\"0154\",ModelNo=\"0954\"),1,\"\")","v":""},"0154","Operating Sash Width",{"$f":"Frame_Width-1.625","v":-1.625},null,100,"5105","5100 Series Five Foot Two Lite Patio Door",1.375,0.5,60,80,60,80,60,80,140,"Standard",null,null,null,"Half",null,null,null,null,null,null,null,null,null,null,null,"Double Strength (3 mm)","Triple Strength (5 mm)","Triple IG Single Strength","Triple IG Double Strength","Laminated",null,null,{"$f":"IF(RO=1,\"<< Rough Opening Only\",\"\")","v":"<< Rough Opening Only"}]
[{"$f":"IF(OR(ModelNo=\"0154\",ModelNo=\"0954\"),2,\"\")","v":""},"0154","Operating Sash Height",{"$f":"(Frame_Height/2)-1.375","v":-1.375},null,101,"5106","5100 Series Six Foot Two Lite Patio Door",1.375,0.5,72,80,72,80,72,80,152,"Standard",null,null,null,"Half",null,null,null,null,null,null,null,null,null,null,null,"Double Strength (3 mm)","Triple Strength (5 mm)","Triple IG Single Strength","Triple IG Double Strength","Laminated",null,null,"<< Rough Opening Only"]
[{"$f":"IF(OR(ModelNo=\"0154\",ModelNo=\"0954\"),3,\"\")","v":""},"0154","Fixed Sash Width",{"$f":"Frame_Width-1.625","v":-1.625},null,102,"5108","5100 Series Eight Foot Two Lite Patio Door",1.75,0.5,96,80,96,80,96,80,176,"Standard",null,null,null,"Half",null,null,null,null,null,null,null,null,null,null,null,"Double Strength (3 mm)","Triple Strength (5 mm)","Triple IG Single Strength","Triple IG Double Strength","Laminated",null,null,"<< Rough Opening Only"]
[{"$f":"IF(OR(ModelNo=\"0154\",ModelNo=\"0954\"),4,\"\")","v":""},"0154","Fixed Sash Height",{"$f":"(Frame_Height/2)-1.375","v":-1.375},null,103,"5109","5100 Series Nine Foot Three Lite Patio Door",2.5,0.5,108,80,108,80,108,80,188,"Standard",null,null,null,"Half",null,null,null,null,null,null,null,null,null,null,null,"Double Strength (3 mm)","Triple Strength (5 mm)","Triple IG Single Strength","Triple IG Double Strength","Laminated",null,null,"<< Rough Opening Only"]
[{"$f":"IF(OR(ModelNo=\"0154\",ModelNo=\"0954\"),5,\"\")","v":""},"0154","Operating Sash Glass Width",{"$f":"Frame_Width-4.625","v":-4.625},null,104,"5175","5100 Series Wisconsin Two Lite Patio Door",0.5,0.5,75,80,75,80,75,80,155,"Standard",null,null,null,"Half",null,null,null,null,null,null,null,null,null,null,null,"Double Strength (3 mm)","Triple Strength (5 mm)","Triple IG Single Strength","Triple IG Double Strength","Laminated",null,null,"<< Rough Opening Only"]
[{"$f":"IF(OR(ModelNo=\"0154\",ModelNo=\"0954\"),6,\"\")","v":""},"0154","Operating Sash Glass Height",{"$f":"(Frame_Height/2)-4.375","v":-4.375},null,105,"51i5","Coastal Impact Five Foot Replacenet Patio Door",1.375,0.5,60,80,60,80,60,80,140,"Standard",null,null,null,"Half",null,null,null,null,null,null,null,null,null,null,null,"Double Strength (3 mm)","Triple Strength (5 mm)","Triple IG Single Strength","Triple IG Double Strength","Laminated",null,null,"<< Rough Opening Only"]
[{"$f":"IF(OR(ModelNo=\"0154\",ModelNo=\"0954\"),7,\"\")","v":""},"0154","Fixed Sash Glass Width",{"$f":"Frame_Width-4.625","v":-4.625},null,106,"51i6","Coastal Impact Six Foot Replacement Patio Door",1.375,0.5,72,80,72,80,72,80,152,"Standard",null,null,null,"Half",null,null,null,null,null,null,null,null,null,null,null,"Double Strength (3 mm)","Triple Strength (5 mm)","Triple IG Single Strength","Triple IG Double Strength","Laminated",null,null,"<< Rough Opening Only"]
[{"$f":"IF(OR(ModelNo=\"0154\",ModelNo=\"0954\"),8,\"\")","v":""},"0154","Fixed Sash Glass Height",{"$f":"(Frame_Height/2)-4.375","v":-4.375},null,107,"51i8","Coastal Impact Eight Foot Replacement Patio Door",1.75,0.5,96,80,96,80,96,80,176,"Standard",null,null,null,"Half",null,null,null,null,null,null,null,null,null,null,null,"Double Strength (3 mm)","Triple Strength (5 mm)","Triple IG Single Strength","Triple IG Double Strength","Laminated",null,null,"<< Rough Opening Only"]
[{"$f":"IF(OR(ModelNo=\"0154\",ModelNo=\"0954\"),9,\"\")","v":""},"0154","Screen Width",{"$f":"Frame_Width-4","v":-4},null,108,"5202","5200 Series Custom 2 Lite Patio Door",0,0,null,null,48,72,94.5,94.5,189,null,null,null,null,"Half",null,null,null,null,null,null,null,null,null,null,null,"Double Strength (3 mm)","Triple Strength (5 mm)","Triple IG Single Strength","Triple IG Double Strength","Laminated",null,null,{"$f":"IF(RO=2,\"<< Exact Size Only\",\"\")","v":""}]
[{"$f":"IF(OR(ModelNo=\"0154\",ModelNo=\"0954\"),10,\"\")","v":""},"0154","Screen Height",{"$f":"(Frame_Height/2)-3.6875","v":-3.6875},null,109,"5203","5200 Series Custom 3 Lite Patio Door",0,0,null,null,84,72,139,95,234,null,null,null,null,"Half",null,null,null,null,null,null,null,null,null,null,null,"Double Strength (3 mm)","Triple Strength (5 mm)","Triple IG Single Strength","Triple IG Double Strength","Laminated",null,null,{"$f":"IF(RO=2,\"<< Exact Size Only\",\"\")","v":""}]
[{"$f":"IF(OR(ModelNo=\"0154\",ModelNo=\"0954\"),11,\"\")","v":""},"0154","Awning Does not Meet Egress",null,null,110,"5205","5200 Series Five Foot 2 Lite Patio Door",0.9375,0.5,60,80,60,80,60,80,156,"Standard",null,null,null,"Half",null,null,null,null,null,null,null,null,null,null,null,"Double Strength (3 mm)","Triple Strength (5 mm)","Triple IG Single Strength","Triple IG Double Strength","Laminated",null,null,{"$f":"IF(RO=1,\"<< Rough Opening Only\",\"\")","v":"<< Rough Opening Only"},null,null,null,null,null,"8405",{"$f":"$D$1161","v":-3.0625},{"$f":"$D$1162","v":-3.5625},{"$f":"(AV112*AW112)/144","v":7.5764973958333329E-2}]
[{"$f":"IF(OR(ModelNo=\"0155\",ModelNo=\"0955\"),1,\"\")","v":""},"0155","Sash Width",{"$f":"Frame_Width-1.625","v":-1.625},null,111,"5206","5200 Series Six Foot 2 Lite Patio Door",1.125,0.5,72,80,72,80,72,80,168,"Standard",null,null,null,"Half",null,null,null,null,null,null,null,null,null,null,null,"Double Strength (3 mm)","Triple Strength (5 mm)","Triple IG Single Strength","Triple IG Double Strength","Laminated",null,null,"<< Rough Opening Only",null,null,null,null,null,"8406",{"$f":"$D$1161","v":-3.0625},{"$f":"$D$1162","v":-3.5625},7.5764973958333329E-2]
[{"$f":"IF(OR(ModelNo=\"0155\",ModelNo=\"0955\"),2,\"\")","v":""},"0155","Sash Height",{"$f":"(Frame_Height/2)-1.375","v":-1.375},null,112,"5208","5200 Series Eight Foot 2 Lite Patio Door",1.5,0.5,96,80,96,80,96,80,192,"Standard",null,null,null,"Half",null,null,null,null,null,null,null,null,null,null,null,"Double Strength (3 mm)","Triple Strength (5 mm)","Triple IG Single Strength","Triple IG Double Strength","Laminated",null,null,"<< Rough Opening Only",null,null,null,null,null,"8408",{"$f":"$D$1161","v":-3.0625},{"$f":"$D$1162","v":-3.5625},7.5764973958333329E-2]
[{"$f":"IF(OR(ModelNo=\"0155\",ModelNo=\"0955\"),3,\"\")","v":""},"0155","Sash Glass Width",{"$f":"(Frame_Width)-4.625","v":-4.625},null,113,"5209","5200 Series Nine Foot 3 Lite Patio Door",4.5,0.5,108,80,108,80,108,80,204,"Standard",null,null,null,"Half",null,null,null,null,null,null,null,null,null,null,null,"Double Strength (3 mm)","Triple Strength (5 mm)","Triple IG Single Strength","Triple IG Double Strength","Laminated",null,null,"<< Rough Opening Only",null,null,null,null,null,"8409",{"$f":"$D$1174","v":-2.125},{"$f":"$D$1175","v":-3.1875},4.7037760416666664E-2]
[{"$f":"IF(OR(ModelNo=\"0155\",ModelNo=\"0955\"),4,\"\")","v":""},"0155","Sash Glass Height",{"$f":"(Frame_Height/2)-4.375","v":-4.375},null,114,"5210","5200 Series Ten Foot 3 Lite Patio Door",1.875,0.5,120,80,120,80,120,96,216,"Standard",null,null,null,"Half",null,null,null,null,null,null,null,null,null,null,null,"Double Strength (3 mm)","Triple Strength (5 mm)","Triple IG Single Strength","Triple IG Double Strength","Laminated",null,null,"<< Rough Opening Only",null,null,null,null,null,"8412",{"$f":"$D$1187","v":-3.46875},{"$f":"$D$1188","v":-2.125},5.1188151041666664E-2]
[{"$f":"IF(OR(ModelNo=\"0155\",ModelNo=\"0955\"),5,\"\")","v":""},"0155","Screen Width",{"$f":"Frame_Width-4","v":-4},null,115,"5212","5200 Series Twelve Foot 3 Lite Patio Door",5.0625,0.5,144,80,144,80,144,96,240,"Standard",null,null,null,"Half",null,null,null,null,null,null,null,null,null,null,null,"Double Strength (3 mm)","Triple Strength (5 mm)","Triple IG Single Strength","Triple IG Double Strength","Laminated",null,null,"<< Rough Opening Only",null,null,null,null,null,"8422",{"$f":"$D$1174","v":-2.125},{"$f":"$D$1175","v":-3.1875},4.7037760416666664E-2]
[{"$f":"IF(OR(ModelNo=\"0155\",ModelNo=\"0955\"),6,\"\")","v":""},"0155","Screen Height",{"$f":"(Frame_Height/2)-3.6875","v":-3.6875},null,116,"6102","6100 Series Custom Two Lite Patio Door",0,0,null,null,48,72,96,96,180,null,null,null,null,"Half",null,null,null,null,null,null,null,null,null,null,null,"Double Strength (3 mm)","Triple Strength (5 mm)","Triple IG Single Strength","Triple IG Double Strength","Laminated",null,null,{"$f":"IF(RO=2,\"<< Exact Size Only\",\"\")","v":""},null,null,null,null,null,"8475",{"$f":"$D$1161","v":-3.0625},{"$f":"$D$1162","v":-3.5625},7.5764973958333329E-2]
[{"$f":"IF(OR(ModelNo=\"0155\",ModelNo=\"0955\"),7,\"\")","v":""},"0155","Awning Does not Meet Egress",null,null,117,"6103","6100 Series Custom Three Lite Patio Door",0,0,null,null,84,72,144,96,228,null,null,null,null,"Half",null,null,null,null,null,null,null,null,null,null,null,"Double Strength (3 mm)","Triple Strength (5 mm)","Triple IG Single Strength","Triple IG Double Strength","Laminated",null,null,{"$f":"IF(RO=2,\"<< Exact Size Only\",\"\")","v":""},null,null,null,null,null,"R601",{"$f":"MAX($D$812,$D$814)","v":-2.125},{"$f":"MAX($D$813,$D$815)","v":0},0,{"$f":"IF(AND(OR(Glass=4,Glass=5),OR($D$819=\"N/A\",$D$821=\"N/A\")),1,IF(AND(Glass=3,Single_ST=0),1,0))","v":0}]
[{"$f":"IF(OR(ModelNo=\"0170\",ModelNo=\"0970\",ModelNo=\"0504\",ModelNo=\"B970\",ModelNo=\"i970\"),1,\"\")","v":""},"0170","Glass Width",{"$f":"Frame_Width-4.625","v":-4.625},null,118,"6104","6100 Series Custom Four Lite Patio Door",0,0,null,null,96,72,144,96,240,null,null,null,null,"Half",null,null,null,null,null,null,null,null,null,null,null,"Double Strength (3 mm)","Triple Strength (5 mm)","Triple IG Single Strength","Triple IG Double Strength","Laminated",null,null,{"$f":"IF(RO=2,\"<< Exact Size Only\",\"\")","v":""},null,null,null,null,null,"R970",{"$f":"$D$122","v":0.14854600694444445},{"$f":"$D$123","v":-1.625},-1.6763004255883488E-3]
[{"$f":"IF(OR(ModelNo=\"0170\",ModelNo=\"0970\",ModelNo=\"0504\",ModelNo=\"B970\",ModelNo=\"i970\"),2,\"\")","v":""},"0170","Glass Height",{"$f":"Frame_Height-4.625","v":-4.625},null,119,"6105","6100 Series Five Foot Two Lite Patio Door",1.375,0.5,60,80,60,80,60,80,140,"Standard",null,null,null,"Half",null,null,null,null,null,null,null,null,null,null,null,"Double Strength (3 mm)","Triple Strength (5 mm)","Triple IG Single Strength","Triple IG Double Strength","Laminated",null,null,{"$f":"IF(RO=1,\"<< Rough Opening Only\",\"\")","v":"<< Rough Opening Only"},null,null,null,null,null,"R971",{"$f":"$D$127","v":-4.0625},{"$f":"$D$128","v":-4},0.11284722222222222]
[{"$f":"IF(OR(ModelNo=\"0170\",ModelNo=\"0970\",ModelNo=\"0504\",ModelNo=\"B970\",ModelNo=\"i970\"),3,\"\")","v":""},"0170","Glass Area (sq.ft.)",{"$f":"(D120*D121)/144","v":0.14854600694444445},null,120,"6106","6100 Series Six Foot Two Lite Patio Door",1.375,0.5,72,80,72,80,72,80,152,"Standard",null,null,null,"Half",null,null,null,null,null,null,null,null,null,null,null,"Double Strength (3 mm)","Triple Strength (5 mm)","Triple IG Single Strength","Triple IG Double Strength","Laminated",null,null,"<< Rough Opening Only"]
[{"$f":"IF(OR(ModelNo=\"0171\",ModelNo=\"0971\",ModelNo=\"B971\",ModelNo=\"i971\"),1,\"\")","v":""},"0171","Sash Width",{"$f":"Frame_Width-1.625","v":-1.625},null,121,"6108","6100 Series Eight Foot Two Lite Patio Door",1.75,0.5,96,80,96,80,96,80,176,"Standard",null,null,null,"Half",null,null,null,null,null,null,null,null,null,null,null,"Double Strength (3 mm)","Triple Strength (5 mm)","Triple IG Single Strength","Triple IG Double Strength","Laminated",null,null,"<< Rough Opening Only"]
[{"$f":"IF(OR(ModelNo=\"0171\",ModelNo=\"0971\",ModelNo=\"B971\",ModelNo=\"i971\"),2,\"\")","v":""},"0171","Sash Height",{"$f":"Frame_Height-1.625","v":-1.625},null,122,"6109","6100 Series Nine Foot Three Lite Patio Door",2.5,0.5,108,80,108,80,108,80,188,"Standard",null,null,null,"Half",null,null,null,null,null,null,null,null,null,null,null,"Double Strength (3 mm)","Triple Strength (5 mm)","Triple IG Single Strength","Triple IG Double Strength","Laminated",null,null,"<< Rough Opening Only"]
[{"$f":"IF(OR(ModelNo=\"0171\",ModelNo=\"0971\",ModelNo=\"B971\",ModelNo=\"i971\"),3,\"\")","v":""},"0171","Glass Width",{"$f":"Frame_Width-4.625","v":-4.625},null,123,"6112","6100 Series Twelve Foot Four Lite Patio Door",4.5,0.5,144,80,144,80,144,80,224,"Standard",null,null,null,"Half",null,null,null,null,null,null,null,null,null,null,null,"Double Strength (3 mm)","Triple Strength (5 mm)","Triple IG Single Strength","Triple IG Double Strength","Laminated",null,null,"<< Rough Opening Only"]
[{"$f":"IF(OR(ModelNo=\"0171\",ModelNo=\"0971\",ModelNo=\"B971\",ModelNo=\"i971\"),4,\"\")","v":""},"0171","Glass Height",{"$f":"Frame_Height-4.625","v":-4.625},null,124,"6122","6100 Series Twelve Foot Three Lite Patio Door",3.125,0.5,144,80,144,80,144,80,224,"Standard",null,null,null,"Half",null,null,null,null,null,null,null,null,null,null,null,"Double Strength (3 mm)","Triple Strength (5 mm)","Triple IG Single Strength","Triple IG Double Strength","Laminated",null,null,"<< Rough Opening Only"]
[{"$f":"IF(OR(ModelNo=\"0171\",ModelNo=\"0971\",ModelNo=\"B971\",ModelNo=\"i971\"),5,\"\")","v":""},"0171","Screen Width",{"$f":"Frame_Width-4.0625","v":-4.0625},null,125,"6175","6100 Series Wisconsin Two Lite Patio Door",0.5,0.5,75,80,75,80,75,80,155,"Standard",null,null,null,"Half",null,null,null,null,null,null,null,null,null,null,null,"Double Strength (3 mm)","Triple Strength (5 mm)","Triple IG Single Strength","Triple IG Double Strength","Laminated",null,null,"<< Rough Opening Only"]
[{"$f":"IF(OR(ModelNo=\"0171\",ModelNo=\"0971\",ModelNo=\"B971\",ModelNo=\"i971\"),6,\"\")","v":""},"0171","Screen Height",{"$f":"Frame_Height-4","v":-4},null,126,"6202","6200 Series Custom 2 Lite Patio Door",0,0,null,null,48,72,96,96,192,null,null,null,null,"Half",null,null,null,null,null,null,null,null,null,null,null,"Double Strength (3 mm)","Triple Strength (5 mm)","Triple IG Single Strength","Triple IG Double Strength","Laminated",null,null,{"$f":"IF(RO=2,\"<< Exact Size Only\",\"\")","v":""},null,null,null,null,{"$f":"IF(ModelNo=AU114,ModelNo,0)","v":0}]
[{"$f":"IF(OR(ModelNo=\"0171\",ModelNo=\"0971\",ModelNo=\"B971\",ModelNo=\"i971\"),7,\"\")","v":""},"0171","Egress Opening Width (Standard Hinge)",{"$f":"Frame_Width-11.25","v":-11.25},null,127,"6203","6200 Series Custom 3 Lite Patio Door",0,0,null,null,84,72,144,96,240,null,null,null,null,"Half",null,null,null,null,null,null,null,null,null,null,null,"Double Strength (3 mm)","Triple Strength (5 mm)","Triple IG Single Strength","Triple IG Double Strength","Laminated",null,null,{"$f":"IF(RO=2,\"<< Exact Size Only\",\"\")","v":""},null,null,null,null,0]
[{"$f":"IF(OR(ModelNo=\"0171\",ModelNo=\"0971\",ModelNo=\"B971\",ModelNo=\"i971\"),8,\"\")","v":""},"0171","Egress Opening Height (Standard Hinge)",{"$f":"Frame_Height-4.375","v":-4.375},null,128,"6204","6200 Series Custom 4 Lite Patio Door",0,0,null,null,96,72,144,96,240,null,null,null,null,"Half",null,null,null,null,null,null,null,null,null,null,null,"Double Strength (3 mm)","Triple Strength (5 mm)","Triple IG Single Strength","Triple IG Double Strength","Laminated",null,null,{"$f":"IF(RO=2,\"<< Exact Size Only\",\"\")","v":""},null,null,null,null,0]
[{"$f":"IF(OR(ModelNo=\"0171\",ModelNo=\"0971\",ModelNo=\"B971\",ModelNo=\"i971\"),9,\"\")","v":""},"0171","Egress Opening Area w/Standard Hinge (sq.ft.)",{"$f":"(D129*D130)/144","v":0.341796875},null,129,"6205","6200 Series Five Foot 2 Lite Patio Door",1.375,0.5,60,80,58.625,79.5,58.625,79.5,139,"Standard",null,null,null,"Half",null,null,null,null,null,null,null,null,null,null,null,"Double Strength (3 mm)","Triple Strength (5 mm)","Triple IG Single Strength","Triple IG Double Strength","Laminated",null,null,{"$f":"IF(RO=1,\"<< Rough Opening Only\",\"\")","v":"<< Rough Opening Only"},null,null,null,null,0]
[{"$f":"IF(OR(ModelNo=\"0171\",ModelNo=\"0971\",ModelNo=\"B971\",ModelNo=\"i971\"),10,\"\")","v":""},"0171","Egress Opening Width (Egress Hinge)",{"$f":"IF(D123<22.375,\"N/A\",Frame_Width-6.8125)","v":"N/A"},null,130,"6206","6200 Series Six Foot 2 Lite Patio Door",1.375,0.5,72,80,70.625,79.5,70.625,79.5,151,"Standard",null,null,null,"Half",null,null,null,null,null,null,null,null,null,null,null,"Double Strength (3 mm)","Triple Strength (5 mm)","Triple IG Single Strength","Triple IG Double Strength","Laminated",null,null,"<< Rough Opening Only",null,null,null,null,0]
[{"$f":"IF(OR(ModelNo=\"0171\",ModelNo=\"0971\",ModelNo=\"B971\",ModelNo=\"i971\"),11,\"\")","v":""},"0171","Egress Opening Height (Egress Hinge)",{"$f":"IF(D123<22.375,\"N/A\",Frame_Height-4.375)","v":"N/A"},null,131,"6208","6200 Series Eight Foot 2 Lite Patio Door",1.75,0.5,96,80,94.25,79.5,94.25,79.5,175,"Standard",null,null,null,"Half",null,null,null,null,null,null,null,null,null,null,null,"Double Strength (3 mm)","Triple Strength (5 mm)","Triple IG Single Strength","Triple IG Double Strength","Laminated",null,null,"<< Rough Opening Only",null,null,null,null,0]
[{"$f":"IF(OR(ModelNo=\"0171\",ModelNo=\"0971\",ModelNo=\"B971\",ModelNo=\"i971\"),12,\"\")","v":""},"0171","Egress Opening Area w/Egress Hinge (sq.ft.)",{"$f":"IF(D123<22.375,\"N/A\",(D132*D133)/144)","v":"N/A"},null,132,"6209","6200 Series Nine Foot 3 Lite Patio Door",2.625,0.5,108,80,105.5,79.5,105.5,79.5,186,"Standard",null,null,null,"Half",null,null,null,null,null,null,null,null,null,null,null,"Double Strength (3 mm)","Triple Strength (5 mm)","Triple IG Single Strength","Triple IG Double Strength","Laminated",null,null,"<< Rough Opening Only",null,null,null,null,0]
[{"$f":"IF(OR(ModelNo=\"0172\",ModelNo=\"0972\"),1,\"\")","v":""},"0172","Sash Width",{"$f":"(Frame_Width/2)-1.375","v":-1.375},null,133,"6212","6200 Series Twelve Foot 4 Lite Patio Door",4.375,0.5,144,80,139.5,79.5,139.5,79.5,220,"Standard",null,null,null,"Half",null,null,null,null,null,null,null,null,null,null,null,"Double Strength (3 mm)","Triple Strength (5 mm)","Triple IG Single Strength","Triple IG Double Strength","Laminated",null,null,"<< Rough Opening Only",null,null,null,null,0]
[{"$f":"IF(OR(ModelNo=\"0172\",ModelNo=\"0972\"),2,\"\")","v":""},"0172","Sash Height",{"$f":"Frame_Height-1.625","v":-1.625},null,134,"6222","6200 Series Twelve Foot 3 Lite Patio Door",3.1875,0.5,144,80,140.875,79.5,140.875,79.5,221,"Standard",null,null,null,"Half",null,null,null,null,null,null,null,null,null,null,null,"Double Strength (3 mm)","Triple Strength (5 mm)","Triple IG Single Strength","Triple IG Double Strength","Laminated",null,null,"<< Rough Opening Only"]
[{"$f":"IF(OR(ModelNo=\"0172\",ModelNo=\"0972\"),3,\"\")","v":""},"0172","Glass Width",{"$f":"(Frame_Width/2)-4.375","v":-4.375},null,135,"6275","6200 Series Wisconsin 2 Lite Patio Door",0.5,0.5,75,80,74.5,79.5,74.5,79.5,154,"Standard",null,null,null,"Half",null,null,null,null,null,null,null,null,null,null,null,"Double Strength (3 mm)","Triple Strength (5 mm)","Triple IG Single Strength","Triple IG Double Strength","Laminated",null,null,"<< Rough Opening Only",null,null,null,null,null,null,null,null,null,null,null,null,null,null,null,52,96,134]
[{"$f":"IF(OR(ModelNo=\"0172\",ModelNo=\"0972\"),4,\"\")","v":""},"0172","Glass Height",{"$f":"Frame_Height-4.625","v":-4.625},null,136,"6402","6400 Series Custom 2 Lite Patio Door",null,null,null,null,48,72,96,96,192,"3\" Sash","5\" Sash","French",null,"Half",null,null,null,null,null,null,null,null,null,null,null,"Double Strength (3 mm)","Triple Strength (5 mm)","Triple IG Single Strength","Triple IG Double Strength","Laminated",null,null,{"$f":"IF(RO=2,\"<< Exact Size Only\",\"\")","v":""},null,null,null,null,null,null,null,null,null,null,null,null,null,null,null,52,96,134]
[{"$f":"IF(OR(ModelNo=\"0172\",ModelNo=\"0972\"),5,\"\")","v":""},"0172","Screen Width",{"$f":"(Frame_Width/2)-3.8125","v":-3.8125},null,137,"6403","6400 Series Custom 3 Lite Patio Door",null,null,null,null,84,72,144,96,240,"3\" Sash","5\" Sash","French",null,"Half",null,null,null,null,null,null,null,null,null,null,null,"Double Strength (3 mm)","Triple Strength (5 mm)","Triple IG Single Strength","Triple IG Double Strength","Laminated",null,null,{"$f":"IF(RO=2,\"<< Exact Size Only\",\"\")","v":""},null,null,null,null,null,null,null,null,null,null,null,null,null,null,null,52,96,134]
[{"$f":"IF(OR(ModelNo=\"0172\",ModelNo=\"0972\"),6,\"\")","v":""},"0172","Screen Height",{"$f":"Frame_Height-4","v":-4},null,138,"6404","6400 Series Custom 4 Lite Patio Door",null,null,null,null,96,72,144,96,240,"3\" Sash","5\" Sash","French",null,"Half",null,null,null,null,null,null,null,null,null,null,null,"Double Strength (3 mm)","Triple Strength (5 mm)","Triple IG Single Strength","Triple IG Double Strength","Laminated",null,null,{"$f":"IF(RO=2,\"<< Exact Size Only\",\"\")","v":""},null,null,null,null,null,null,null,null,null,null,null,null,null,null,null,52,96,134]
[{"$f":"IF(OR(ModelNo=\"0172\",ModelNo=\"0972\"),7,\"\")","v":""},"0172","Egress Opening Width (Standard Hinge)",{"$f":"(Frame_Width/2)-11","v":-11},null,139,"6405","6400 Series Five Foot 2 Lite Patio Door",1.375,0.5,60,80,60,80,60,96,156,"3\" Sash","5\" Sash","French",null,"Half",null,null,null,null,null,null,null,null,null,null,null,"Double Strength (3 mm)","Triple Strength (5 mm)","Triple IG Single Strength","Triple IG Double Strength","Laminated",null,null,"<< Rough Opening Only",null,null,null,null,null,null,null,null,null,null,null,null,null,null,null,52,96,134]
[{"$f":"IF(OR(ModelNo=\"0172\",ModelNo=\"0972\"),8,\"\")","v":""},"0172","Egress Opening Height (Standard Hinge)",{"$f":"Frame_Height-4.375","v":-4.375},null,140,"6406","6400 Series Six Foot 2 Lite Patio Door",1.375,0.5,72,80,72,80,72,96,168,"3\" Sash","5\" Sash","French",null,"Half",null,null,null,null,null,null,null,null,null,null,null,"Double Strength (3 mm)","Triple Strength (5 mm)","Triple IG Single Strength","Triple IG Double Strength","Laminated",null,null,"<< Rough Opening Only",null,null,null,null,null,null,null,null,null,null,null,null,null,null,null,52,84,132]
[{"$f":"IF(OR(ModelNo=\"0172\",ModelNo=\"0972\"),9,\"\")","v":""},"0172","Egress Opening Area w/Standard Hinge (sq.ft.)",{"$f":"(D141*D142)/144","v":0.3342013888888889},null,141,"6408","6400 Series Eight Foot 2 Lite Patio Door",1.5,0.5,96,80,96,80,96,96,190,"3\" Sash","5\" Sash","French",null,"Half",null,null,null,null,null,null,null,null,null,null,null,"Double Strength (3 mm)","Triple Strength (5 mm)","Triple IG Single Strength","Triple IG Double Strength","Laminated",null,null,"<< Rough Opening Only",null,null,null,null,null,null,null,null,null,null,null,null,null,null,null,72,84,137]
[{"$f":"IF(OR(ModelNo=\"0172\",ModelNo=\"0972\"),10,\"\")","v":""},"0172","Egress Opening Width (Egress Hinge)",{"$f":"IF(D135<22.375,\"N/A\",(Frame_Width/2)-6.5625)","v":"N/A"},null,142,"6409","6400 Series Nine Foot 3 Lite Patio Door",2.5,0.5,108,80,108,80,108,96,204,"3\" Sash","5\" Sash","French",null,"Half",null,null,null,null,null,null,null,null,null,null,null,"Double Strength (3 mm)","Triple Strength (5 mm)","Triple IG Single Strength","Triple IG Double Strength","Laminated",null,null,"<< Rough Opening Only",null,null,null,null,null,null,null,null,null,null,null,null,null,null,null,54,76,126]
[{"$f":"IF(OR(ModelNo=\"0172\",ModelNo=\"0972\"),11,\"\")","v":""},"0172","Egress Opening Height (Egress Hinge)",{"$f":"IF(D135<22.375,\"N/A\",Frame_Height-4.375)","v":"N/A"},null,143,"6412","6400 Series Twelve Foot 4 Lite Patio Door",4.5,0.5,144,80,144,80,144,96,240,"3\" Sash","5\" Sash","French",null,"Half",null,null,null,null,null,null,null,null,null,null,null,"Double Strength (3 mm)","Triple Strength (5 mm)","Triple IG Single Strength","Triple IG Double Strength","Laminated",null,null,"<< Rough Opening Only",null,null,null,null,null,null,null,null,null,null,null,null,null,null,null,73,63,136]
[{"$f":"IF(OR(ModelNo=\"0172\",ModelNo=\"0972\"),12,\"\")","v":""},"0172","Egress Opening Area w/Egress Hinge (sq.ft.)",{"$f":"IF(D135<22.375,\"N/A\",(D144*D145)/144)","v":"N/A"},null,144,"6422","6400 Series Twelve Foot 3 Lite Patio Door",3.125,0.5,144,80,144,80,144,96,240,"3\" Sash","5\" Sash","French",null,"Half",null,null,null,null,null,null,null,null,null,null,null,"Double Strength (3 mm)","Triple Strength (5 mm)","Triple IG Single Strength","Triple IG Double Strength","Laminated",null,null,"<< Rough Opening Only",null,null,null,null,null,null,null,null,null,null,null,null,null,null,null,52.5,76,128]
[{"$f":"IF(OR(ModelNo=\"0173\",ModelNo=\"0973\"),1,\"\")","v":""},"0173","Operating Sash Width",{"$f":"(Frame_Width/4)-1.375","v":-1.375},null,145,"6475","6400 Series Wisconsin 2 Lite Patio Door",0.5,0.5,75,80,75,80,75,80,155,"3\" Sash","5\" Sash","French",null,"Half",null,null,null,null,null,null,null,null,null,null,null,"Double Strength (3 mm)","Triple Strength (5 mm)","Triple IG Single Strength","Triple IG Double Strength","Laminated",null,null,"<< Rough Opening Only",null,null,null,null,null,null,null,null,null,null,null,null,null,null,null,110,63,173]
[{"$f":"IF(OR(ModelNo=\"0173\",ModelNo=\"0973\"),2,\"\")","v":""},"0173","Operating Sash Height",{"$f":"Frame_Height-1.625","v":-1.625},null,146,"E301(3250)","New Const. Double Hung Egress",0.5,0.5,38,60,37.5,59.5,37.5,59.5,97,"Standard",null,null,null,"Half","Full",null,null,null,null,null,null,null,null,null,"Single Strength (2.5 mm)","Double Strength (3 mm)","Triple Strength (5 mm)","Triple IG Single Strength","Triple IG Double Strength","Laminated",null,null,"<< Rough Opening Only",null,null,null,null,null,null,null,null,null,null,null,null,null,null,null,52,78,130]
[{"$f":"IF(OR(ModelNo=\"0173\",ModelNo=\"0973\"),3,\"\")","v":""},"0173","Fixed Sash Width",{"$f":"(Frame_Width/2)-1.125","v":-1.125},null,147,"E301(3052)","New Const. Double Hung Egress",0.5,0.5,36,62,35.5,61.5,35.5,61.5,97,"Standard",null,null,null,"Half","Full",null,null,null,null,null,null,null,null,null,"Single Strength (2.5 mm)","Double Strength (3 mm)","Triple Strength (5 mm)","Triple IG Single Strength","Triple IG Double Strength","Laminated",null,null,"<< Rough Opening Only",null,null,null,null,null,null,null,null,null,null,null,null,null,null,null,36,78,114]
[{"$f":"IF(OR(ModelNo=\"0173\",ModelNo=\"0973\"),4,\"\")","v":""},"0173","Fixed Sash Height",{"$f":"Frame_Height-1.625","v":-1.625},null,148,"E301(2862)","New Const. Double Hung Egress",0.5,0.5,32,74,31.5,73.5,31.5,73.5,105,"Standard",null,null,null,"Half","Full",null,null,null,null,null,null,null,null,null,"Single Strength (2.5 mm)","Double Strength (3 mm)","Triple Strength (5 mm)","Triple IG Single Strength","Triple IG Double Strength","Laminated",null,null,"<< Rough Opening Only",null,null,null,null,null,null,null,null,null,null,null,null,null,null,null,48,84,122]
[{"$f":"IF(OR(ModelNo=\"0173\",ModelNo=\"0973\"),5,\"\")","v":""},"0173","Operating Sash Glass Width",{"$f":"(Frame_Width/4)-4.375","v":-4.375},null,149,"S140","Arched Top Single Hung (Round-Top)",0,0,null,null,{"$f":"MINR*2","v":{"$error":"#N/A"}},43,52,96,148,"Standard","Oriel (2/3 - 1/3)","Cottage (1/3 - 2/3)","Custom","Half",null,null,"Select Extrusion","Mezzo","Mezzo/N.F","New Construction","0700 Series","Fusion",1700,1900,null,"Double Strength (3 mm)","Triple Strength (5 mm)","Triple IG Single Strength","Triple IG Double Strength","Laminated",null,null,{"$f":"IF(RO=2,\"<< Exact Size Only\",\"\")","v":""},null,null,null,null,null,null,null,null,null,null,null,null,null,null,null,48,84,122]
[{"$f":"IF(OR(ModelNo=\"0173\",ModelNo=\"0973\"),6,\"\")","v":""},"0173","Operating Sash Glass Height",{"$f":"Frame_Height-4.625","v":-4.625},null,150,"S144","Arched Top Single Hung (Eyebrow)",0,0,null,null,16,43,52,96,148,"Standard","Oriel (2/3 - 1/3)","Cottage (1/3 - 2/3)","Custom","Half",null,null,"Select Extrusion","Mezzo","Mezzo/N.F","New Construction","0700 Series","Fusion",1700,1900,null,"Double Strength (3 mm)","Triple Strength (5 mm)","Triple IG Single Strength","Triple IG Double Strength","Laminated",null,null,"",null,null,null,null,null,null,null,null,null,null,null,null,null,null,null,73,60,123]
[{"$f":"IF(OR(ModelNo=\"0173\",ModelNo=\"0973\"),7,\"\")","v":""},"0173","Fixed Sash Glass Width",{"$f":"(Frame_Width/2)-4.125","v":-4.125},null,151,"S146","Arched Top Single Hung (1/2 Eyebrow)",0,0,null,null,16,43,52,96,148,"Standard","Oriel (2/3 - 1/3)","Cottage (1/3 - 2/3)","Custom","Half",null,null,"Select Extrusion","Mezzo","Mezzo/N.F","New Construction","0700 Series","Fusion",1700,1900,null,"Double Strength (3 mm)","Triple Strength (5 mm)","Triple IG Single Strength","Triple IG Double Strength","Laminated",null,null,"",null,null,null,null,null,null,null,null,null,null,null,null,null,null,null,108,60,168]
[{"$f":"IF(OR(ModelNo=\"0173\",ModelNo=\"0973\"),8,\"\")","v":""},"0173","Fixed Sash Glass Height",{"$f":"Frame_Height-4.625","v":-4.625},null,152,"i201","Coastal Impact Double Hung",0,0,null,null,18,26,52,84,132,"Standard","Oriel (2/3 - 1/3)","Cottage (1/3 - 2/3)","Custom","Half","Full","Locking",null,null,null,null,null,null,null,null,null,null,null,null,null,null,"HP Package","Impact Laminated","",null,null,null,null,null,null,null,null,null,null,null,null,null,null,null,84,84,158]
[{"$f":"IF(OR(ModelNo=\"0173\",ModelNo=\"0973\"),9,\"\")","v":""},"0173","Screen Width",{"$f":"(Frame_Width/4)-3.8125","v":-3.8125},null,153,"i204","Coastal Impact Picture Window",0,0,null,null,12,12,52,84,136,"Standard",null,null,null,null,null,null,null,null,null,null,null,null,null,null,null,null,null,null,null,null,"HP Package","Impact Laminated","",null,null,null,null,null,null,null,null,null,null,null,null,null,null,null,108,60,168]
[{"$f":"IF(OR(ModelNo=\"0173\",ModelNo=\"0973\"),10,\"\")","v":""},"0173","Screen Height",{"$f":"Frame_Height-4","v":-4},null,154,"3100","Coastal Impact Single Hung",0,0,null,null,22.5,25.75,54,76,126,"Standard","Oriel (2/3 - 1/3)","Cottage (1/3 - 2/3)","Custom","Half",null,null,null,null,null,null,null,null,null,null,null,null,null,null,null,null,"HP Package","Impact Laminated","",null,null,null,null,null,null,null,null,null,null,null,null,null,null,null,84,84,158]
[{"$f":"IF(OR(ModelNo=\"0173\",ModelNo=\"0973\"),11,\"\")","v":""},"0173","Egress Opening Width (Standard Hinge)",{"$f":"(Frame_Width/4)-11","v":-11},null,155,"3102","Coastal Impact Two Lite Single Slider",0,0,null,null,26.5,22,73,63,136,"Standard",null,null,null,"Half",null,null,null,null,null,null,null,null,null,null,null,null,null,null,null,null,"HP Package","Impact Laminated","",null,null,null,null,null,null,null,null,null,null,null,null,null,null,null,48,84,122]
[{"$f":"IF(OR(ModelNo=\"0173\",ModelNo=\"0973\"),12,\"\")","v":""},"0173","Egress Opening Height (Standard Hinge)",{"$f":"Frame_Height-4.375","v":-4.375},null,156,"3104","Coatal Impact Picture Window",0,0,null,null,12,12,52.5,76,128,"Standard",null,null,null,null,null,null,null,null,null,null,null,null,null,null,null,null,null,null,null,null,"HP Package","Impact Laminated","",null,null,null,null,null,null,null,null,null,null,null,null,null,null,null,73,60,132]
[{"$f":"IF(OR(ModelNo=\"0173\",ModelNo=\"0973\"),13,\"\")","v":""},"0173","Egress Opening Area w/Standard Hinge (sq.ft.)",{"$f":"(D157*D158)/144","v":0.3342013888888889},null,157,"3109","Coastal Impact Three Lite Slider",0,0,null,null,44.5,22,110,63,173,"Standard (1/3-1/3-1/3)",null,null,null,"Half",null,null,null,null,null,null,null,null,null,null,null,null,null,null,null,null,"HP Package","Impact Laminated","",null,null,null,null,null,null,null,null,null,null,null,null,null,null,null,108,60,168]
[{"$f":"IF(OR(ModelNo=\"0173\",ModelNo=\"0973\"),14,\"\")","v":""},"0173","Egress Opening Width (Egress Hinge)",{"$f":"IF(D147<22.375,\"N/A\",(Frame_Width/4)-6.5625)","v":"N/A"},null,158,"i970","Preservation Bay-Bow Picture Window",0,0,null,null,13,13,52,78,130,"Standard",null,null,null,null,null,null,null,null,null,null,null,null,null,null,null,null,null,null,null,null,"HP Package","Impact Laminated","",null,null,null,null,null,null,null,null,null,null,null,null,null,null,null,84,84,158]
[{"$f":"IF(OR(ModelNo=\"0173\",ModelNo=\"0973\"),15,\"\")","v":""},"0173","Egress Opening Height (Egress Hinge)",{"$f":"IF(D147<22.375,\"N/A\",Frame_Height-4.375)","v":"N/A"},null,159,"i971","Preservation Bay-Bow Single Vent Casement",0,0,null,null,16,19,36,78,114,"Standard",null,null,null,null,"Full",null,null,null,null,null,null,null,null,null,null,null,null,null,null,null,"HP Package","Impact Laminated","",null,null,null,null,null,null,null,null,null,null,null,null,"V209",39,15,108,60,168]
[{"$f":"IF(OR(ModelNo=\"0173\",ModelNo=\"0973\"),16,\"\")","v":""},"0173","Egress Opening Area w/Egress Hinge (sq.ft.)",{"$f":"IF(D147<22.375,\"N/A\",(D160*D161)/144)","v":"N/A"},null,160,"V100","New Const. Gold Series Single Hung",0.5,0.5,null,null,14,25,48,84,122,"Standard","Custom",null,null,"Half",null,null,null,null,null,null,null,null,null,null,"Single Strength (2.5 mm)","Double Strength (3 mm)","Triple Strength (5 mm)",null,null,"Laminated",null,null,"<< Select Opening"]
[{"$f":"IF(OR(ModelNo=\"0179\",ModelNo=\"0979\"),1,\"\")","v":""},"0179","Operating Sash Width",{"$f":"TRUNC(((Frame_Width/3)-1.291)*16+0.5)/16","v":-1.25},null,161,"V101","New Const. Gold Series Double Hung",0.5,0.5,null,null,19,28,48,84,122,"Standard","Custom",null,null,"Half","Full",null,null,null,null,null,null,null,null,null,"Single Strength (2.5 mm)","Double Strength (3 mm)","Triple Strength (5 mm)",null,null,"Laminated",null,null,"<< Select Opening"]
[{"$f":"IF(OR(ModelNo=\"0179\",ModelNo=\"0979\"),2,\"\")","v":""},"0179","Operating Sash Height",{"$f":"Frame_Height-1.625","v":-1.625},null,162,"V102","New Const. Gold Series Single Slider",0.5,0.5,null,null,26,16,73,60,123,"Standard",null,null,null,"Half",null,null,null,null,null,null,null,null,null,null,"Single Strength (2.5 mm)","Double Strength (3 mm)","Triple Strength (5 mm)",null,null,"Laminated",null,null,"<< Select Opening"]
[{"$f":"IF(OR(ModelNo=\"0179\",ModelNo=\"0979\"),3,\"\")","v":""},"0179","Fixed Sash Width",{"$f":"TRUNC(((Frame_Width/3)-1.291)*16+0.5)/16","v":-1.25},null,163,"V103","N.C Gold Series 3 Lite Slider (1/4-1/2-1/4)",0.5,0.5,null,null,48.5,14,108,60,168,"Standard",null,null,null,"Half",null,null,null,null,null,null,null,null,null,null,"Single Strength (2.5 mm)","Double Strength (3 mm)","Triple Strength (5 mm)",null,null,"Laminated",null,null,"<< Select Opening"]
[{"$f":"IF(OR(ModelNo=\"0179\",ModelNo=\"0979\"),4,\"\")","v":""},"0179","Fixed Sash Height",{"$f":"Frame_Height-1.625","v":-1.625},null,164,"V104","New Const. Gold Series Picture Window",0.5,0.5,null,null,11.5,11.5,84,84,158,"Standard",null,null,null,null,null,null,null,null,null,null,null,null,null,null,null,"Double Strength (3 mm)","Triple Strength (5 mm)",null,null,"Laminated",null,null,"<< Select Opening"]
[{"$f":"IF(OR(ModelNo=\"0179\",ModelNo=\"0979\"),5,\"\")","v":""},"0179","Operating Sash Glass Width",{"$f":"TRUNC(((Frame_Width/3)-4.291)*16+0.5)/16","v":-4.25},null,165,"V109","N.C Gold Series 3 Lite Slider (1/3-1/3-1/3)",0.5,0.5,null,null,34,14,108,60,168,"Standard",null,null,null,"Half",null,null,null,null,null,null,null,null,null,null,"Single Strength (2.5 mm)","Double Strength (3 mm)","Triple Strength (5 mm)",null,null,"Laminated",null,null,"<< Select Opening"]
[{"$f":"IF(OR(ModelNo=\"0179\",ModelNo=\"0979\"),6,\"\")","v":""},"0179","Operating Sash Glass Height",{"$f":"Frame_Height-4.625","v":-4.625},null,166,"V114","New Const. Gold Series Picture Window",0.5,0.5,null,null,11.5,11.5,84,84,158,"Standard",null,null,null,null,null,null,null,null,null,null,null,null,null,null,null,"Double Strength (3 mm)","Triple Strength (5 mm)",null,null,"Laminated",null,null,"<< Select Opening"]
[{"$f":"IF(OR(ModelNo=\"0179\",ModelNo=\"0979\"),7,\"\")","v":""},"0179","Fixed Sash Glass Width",{"$f":"TRUNC(((Frame_Width/3)-4.291)*16+0.5)/16","v":-4.25},null,167,"V200","New Const. Silver Series Single Hung",0.5,0.5,null,null,14,25.5,48,84,122,"Standard","Custom",null,null,"Half",null,null,null,null,null,null,null,null,null,null,"Single Strength (2.5 mm)","Double Strength (3 mm)","Triple Strength (5 mm)",null,null,"Laminated",null,null,"<< Select Opening"]
[{"$f":"IF(OR(ModelNo=\"0179\",ModelNo=\"0979\"),8,\"\")","v":""},"0179","Fixed Sash Glass Height",{"$f":"Frame_Height-4.625","v":-4.625},null,168,"V202","New Const. Silver Series Single Slider",0.5,0.5,null,null,23.5,15,73,60,132,"Standard",null,null,null,"Half",null,null,null,null,null,null,null,null,null,null,"Single Strength (2.5 mm)","Double Strength (3 mm)","Triple Strength (5 mm)",null,null,"Laminated",null,null,"<< Select Opening"]
[{"$f":"IF(OR(ModelNo=\"0179\",ModelNo=\"0979\"),9,\"\")","v":""},"0179","Screen Width",{"$f":"TRUNC(((Frame_Width/3)-3.666)*32+0.5)/32","v":-3.625},null,169,"V203","N.C Silver Series 3 Lite Slider (1/4-1/2-1/4)",0.5,0.5,null,null,48,15,108,60,168,"Standard",null,null,null,"Half",null,null,null,null,null,null,null,null,null,null,"Single Strength (2.5 mm)","Double Strength (3 mm)","Triple Strength (5 mm)",null,null,"Laminated",null,null,"<< Select Opening"]
[{"$f":"IF(OR(ModelNo=\"0179\",ModelNo=\"0979\"),10,\"\")","v":""},"0179","Screen Height",{"$f":"Frame_Height-4","v":-4},null,170,"V204","New Const. Silver Series Picture Window",0.5,0.5,null,null,11.5,11.5,84,84,158,"Standard",null,null,null,null,null,null,null,null,null,null,null,null,null,null,null,"Double Strength (3 mm)","Triple Strength (5 mm)",null,null,"Laminated",null,null,"<< Select Opening"]
[{"$f":"IF(OR(ModelNo=\"0179\",ModelNo=\"0979\"),11,\"\")","v":""},"0179","Egress Opening Width (Standard Hinge)",{"$f":"TRUNC(((Frame_Width/3)-10.916)*16+0.5)/16","v":-10.875},null,171,"V209","N.C Silver Series 3 Lite Slider (1/3-1/3-1/3)",0.5,0.5,null,null,39,15,108,60,168,"Standard",null,null,null,"Half",null,null,null,null,null,null,null,null,null,null,"Single Strength (2.5 mm)","Double Strength (3 mm)","Triple Strength (5 mm)",null,null,"Laminated",null,null,"<< Select Opening"]
[{"$f":"IF(OR(ModelNo=\"0179\",ModelNo=\"0979\"),12,\"\")","v":""},"0179","Egress Opening Height (Standard Hinge)",{"$f":"Frame_Height-4.375","v":-4.375},null,172,"1700","New Const. Single Hung",0.5,0.5,null,null,14.25,25,52,{"$f":"IF(Frame_Width>48,84,96)","v":96},136,"Standard","Custom",null,null,"Half",null,null,"Standard","HP Package",null,null,null,null,null,null,"Single Strength (2.5 mm)","Double Strength (3 mm)","Triple Strength (5 mm)",null,null,"Laminated",null,null,"<< Select Opening"]
[{"$f":"IF(OR(ModelNo=\"0179\",ModelNo=\"0979\"),13,\"\")","v":""},"0179","Egress Opening Area w/Standard Hinge (sq.ft.)",{"$f":"(D173*D174)/144","v":0.33040364583333331},null,173,"1702","New Const. Single Slider",0.5,0.5,null,null,23.5,14,72,72,144,"Standard","Custom",null,null,"Half",null,null,"Standard","HP Package",null,null,null,null,null,null,"Single Strength (2.5 mm)","Double Strength (3 mm)","Triple Strength (5 mm)",null,null,"Laminated",null,null,"<< Select Opening"]
[{"$f":"IF(OR(ModelNo=\"0179\",ModelNo=\"0979\"),14,\"\")","v":""},"0179","Egress Opening Width (Egress Hinge)",{"$f":"IF(D163<22.375,\"N/A\",TRUNC(((Frame_Width/3)-6.4785)*16+0.5)/16)","v":"N/A"},null,174,"1703","New Const. 3 Lite Slider (1/4-1/2-1/4)",0.5,0.5,null,null,48.5,14,108,{"$f":"IF(Frame_Width>96,60,72)","v":72},168,"Standard",null,null,null,"Half",null,null,"Standard","HP Package",null,null,null,null,null,null,"Single Strength (2.5 mm)","Double Strength (3 mm)","Triple Strength (5 mm)",null,null,"Laminated",null,null,"<< Select Opening"]
[{"$f":"IF(OR(ModelNo=\"0179\",ModelNo=\"0979\"),15,\"\")","v":""},"0179","Egress Opening Height (Egress Hinge)",{"$f":"IF(D163<22.375,\"N/A\",Frame_Height-4.375)","v":"N/A"},null,175,"1704","New Const. Picture Window",0.5,0.5,null,null,11.5,11.5,{"$f":"IF(Frame_Height>54,84,96)","v":96},{"$f":"IF(Frame_Width>54,84,96)","v":96},156,"Standard",null,null,null,null,null,null,null,null,null,null,null,null,null,null,null,"Double Strength (3 mm)","Triple Strength (5 mm)",null,null,"Laminated",null,null,"<< Select Opening"]
[{"$f":"IF(OR(ModelNo=\"0179\",ModelNo=\"0979\"),16,\"\")","v":""},"0179","Egress Opening Area w/Egress Hinge (sq.ft.)",{"$f":"IF(D163<22.375,\"N/A\",(D176*D177)/144)","v":"N/A"},null,176,"1709","New Const. 3 Lite Slider (1/3-1/3-1/3)",0.5,0.5,null,null,37,14,108,{"$f":"IF(Frame_Width>96,60,72)","v":72},168,"Standard",null,null,null,"Half",null,null,"Standard","HP Package",null,null,null,null,null,null,"Single Strength (2.5 mm)","Double Strength (3 mm)","Triple Strength (5 mm)",null,null,"Laminated",null,null,"<< Select Opening"]
[{"$f":"IF(OR(ModelNo=\"S174\",ModelNo=\"0974\"),1,\"\")","v":""},"S174","Operating Sash Width",{"$f":"(Frame_Width/4)-1.25","v":-1.25},null,177,"1720","New Const. Twin Single Hung",0.5,0.5,null,null,29,25,96,84,170,"Standard","Custom",null,null,"Half",null,null,"Standard","HP Package",null,null,null,null,null,null,"Single Strength (2.5 mm)","Double Strength (3 mm)","Triple Strength (5 mm)",null,null,"Laminated",null,null,"<< Select Opening"]
[{"$f":"IF(OR(ModelNo=\"S174\",ModelNo=\"0974\"),2,\"\")","v":""},"S174","Operating Sash Height",{"$f":"Frame_Height-1.625","v":-1.625},null,178,"1730","New Const. Triple Single Hung",0.5,0.5,null,null,44,25,108,84,192,"Standard","Custom",null,null,"Half",null,null,"Standard","HP Package",null,null,null,null,null,null,"Single Strength (2.5 mm)","Double Strength (3 mm)","Triple Strength (5 mm)",null,null,"Laminated",null,null,"<< Select Opening"]
[{"$f":"IF(OR(ModelNo=\"S174\",ModelNo=\"0974\"),3,\"\")","v":""},"S174","Fixed Sash Width",{"$f":"(Frame_Width/4)-1.25","v":-1.25},null,179,"1900","New Const. Single Hung",0.5,0.5,null,null,14.25,25,52,{"$f":"IF(Frame_Width>48,84,96)","v":96},136,"Standard","Custom",null,null,"Half",null,null,"Standard","HP Package",null,null,null,null,null,null,"Single Strength (2.5 mm)","Double Strength (3 mm)","Triple Strength (5 mm)",null,null,"Laminated",null,null,"<< Select Opening"]
[{"$f":"IF(OR(ModelNo=\"S174\",ModelNo=\"0974\"),4,\"\")","v":""},"S174","Fixed Sash Height",{"$f":"Frame_Height-1.625","v":-1.625},null,180,"1901","New Const. Double Hung",0.5,0.5,null,null,16,25,52,{"$f":"IF(Frame_Width>48,76,84)","v":84},136,"Standard","Oriel (2/3 - 1/3)","Cottage (1/3 - 2/3)","Custom","Half","Full",null,"Standard","HP Package",null,null,null,null,null,null,"Single Strength (2.5 mm)","Double Strength (3 mm)","Triple Strength (5 mm)",null,null,"Laminated",null,null,"<< Select Opening"]
[{"$f":"IF(OR(ModelNo=\"S174\",ModelNo=\"0974\"),5,\"\")","v":""},"S174","Operating Sash Glass Width",{"$f":"(Frame_Width/4)-4.25","v":-4.25},null,181,"1902","New Const. Single Slider",0.5,0.5,null,null,23.5,14,84,{"$f":"IF(Frame_Width>72,60,72)","v":72},132,"Standard",null,null,null,"Half",null,null,"Standard","HP Package",null,null,null,null,null,null,"Single Strength (2.5 mm)","Double Strength (3 mm)","Triple Strength (5 mm)",null,null,"Laminated",null,null,"<< Select Opening"]
[{"$f":"IF(OR(ModelNo=\"S174\",ModelNo=\"0974\"),6,\"\")","v":""},"S174","Operating Sash Glass Height",{"$f":"Frame_Height-4.625","v":-4.625},null,182,"1903","New Const. 3 Lite Slider (1/4-1/2-1/4)",0.5,0.5,null,null,48.5,14,108,{"$f":"IF(Frame_Width>96,60,72)","v":72},168,"Standard",null,null,null,"Half",null,null,"Standard","HP Package",null,null,null,null,null,null,"Single Strength (2.5 mm)","Double Strength (3 mm)","Triple Strength (5 mm)",null,null,"Laminated",null,null,"<< Select Opening"]
[{"$f":"IF(OR(ModelNo=\"S174\",ModelNo=\"0974\"),7,\"\")","v":""},"S174","Fixed Sash Glass Width",{"$f":"(Frame_Width/4)-4.25","v":-4.25},null,183,"1904","New Const. Picture Window",0.5,0.5,null,null,11.5,11.5,{"$f":"IF(Frame_Height>54,84,96)","v":96},{"$f":"IF(Frame_Width>54,84,96)","v":96},156,"Standard",null,null,null,null,null,null,null,null,null,null,null,null,null,null,null,"Double Strength (3 mm)","Triple Strength (5 mm)",null,null,"Laminated",null,null,"<< Select Opening"]
[{"$f":"IF(OR(ModelNo=\"S174\",ModelNo=\"0974\"),8,\"\")","v":""},"S174","Fixed Sash Glass Height",{"$f":"Frame_Height-4.625","v":-4.625},null,184,"1909","New Const. 3 Lite Slider (1/3-1/3-1/3)",0.5,0.5,null,null,37,14,108,{"$f":"IF(Frame_Width>96,60,72)","v":72},168,"Standard",null,null,null,"Half",null,null,"Standard","HP Package",null,null,null,null,null,null,"Single Strength (2.5 mm)","Double Strength (3 mm)","Triple Strength (5 mm)",null,null,"Laminated",null,null,"<< Select Opening"]
[{"$f":"IF(OR(ModelNo=\"S174\",ModelNo=\"0974\"),9,\"\")","v":""},"S174","Screen Width",{"$f":"(Frame_Width/4)-3.625","v":-3.625},null,185,"1914","New Const. Picture Window",0.5,0.5,null,null,11.5,11.5,{"$f":"IF(Frame_Height>54,84,96)","v":96},{"$f":"IF(Frame_Width>54,84,96)","v":96},156,"Standard",null,null,null,null,null,null,null,null,null,null,null,null,null,null,null,"Double Strength (3 mm)","Triple Strength (5 mm)",null,null,"Laminated",null,null,"<< Select Opening"]
[{"$f":"IF(OR(ModelNo=\"S174\",ModelNo=\"0974\"),10,\"\")","v":""},"S174","Screen Height",{"$f":"Frame_Height-4","v":-4},null,186,"1920","New Const. Twin Single Hung",0.5,0.5,null,null,29,25,96,84,170,"Standard","Custom",null,null,"Half",null,null,"Standard","HP Package",null,null,null,null,null,null,"Single Strength (2.5 mm)","Double Strength (3 mm)","Triple Strength (5 mm)",null,null,"Laminated",null,null,"<< Select Opening"]
[{"$f":"IF(OR(ModelNo=\"S174\",ModelNo=\"0974\"),11,\"\")","v":""},"S174","Egress Opening Width (Standard Hinge)",{"$f":"(Frame_Width/4)-10.875","v":-10.875},null,187,"1921","New Const. Twin Double Hung",0.5,0.5,null,null,36,25,96,84,170,"Standard","Oriel (2/3 - 1/3)","Cottage (1/3 - 2/3)","Custom","Half","Full",null,"Standard","HP Package",null,null,null,null,null,null,"Single Strength (2.5 mm)","Double Strength (3 mm)","Triple Strength (5 mm)",null,null,"Laminated",null,null,"<< Select Opening"]
[{"$f":"IF(OR(ModelNo=\"S174\",ModelNo=\"0974\"),12,\"\")","v":""},"S174","Egress Opening Height (Standard Hinge)",{"$f":"Frame_Height-4.375","v":-4.375},null,188,"1930","New Const. Triple Single Hung",0.5,0.5,null,null,44,25,108,84,192,"Standard","Custom",null,null,"Half",null,null,"Standard","HP Package",null,null,null,null,null,null,"Single Strength (2.5 mm)","Double Strength (3 mm)","Triple Strength (5 mm)",null,null,"Laminated",null,null,"<< Select Opening"]
[{"$f":"IF(OR(ModelNo=\"S174\",ModelNo=\"0974\"),13,\"\")","v":""},"S174","Egress Opening Area w/Standard Hinge (sq.ft.)",{"$f":"(D189*D190)/144","v":0.33040364583333331},null,189,"1931","New Const. Triple Double Hung",0.5,0.5,null,null,54,25,108,84,192,"Standard","Oriel (2/3 - 1/3)","Cottage (1/3 - 2/3)","Custom","Half","Full",null,"Standard","HP Package",null,null,null,null,null,null,"Single Strength (2.5 mm)","Double Strength (3 mm)","Triple Strength (5 mm)",null,null,"Laminated",null,null,"<< Select Opening"]
[{"$f":"IF(OR(ModelNo=\"S174\",ModelNo=\"0974\"),14,\"\")","v":""},"S174","Egress Opening Width (Egress Hinge)",{"$f":"IF(D179<22.375,\"N/A\",(Frame_Width/4)-6.4375)","v":"N/A"},null,1,{"$f":"Model_Select","v":"Select Model"},{"$f":"VLOOKUP(Model_Select,$G$3:$AO$191,2,FALSE)","v":0},{"$f":"VLOOKUP(Model_Select,$G$3:$AO$191,3,FALSE)","v":0},{"$f":"VLOOKUP(Model_Select,$G$3:$AO$191,4,FALSE)","v":0},{"$f":"VLOOKUP(Model_Select,$G$3:$AO$191,5,FALSE)","v":0},{"$f":"VLOOKUP(Model_Select,$G$3:$AO$191,6,FALSE)","v":0},{"$f":"VLOOKUP(Model_Select,$G$3:$AO$191,7,FALSE)","v":0},{"$f":"VLOOKUP(Model_Select,$G$3:$AO$191,8,FALSE)","v":0},{"$f":"VLOOKUP(Model_Select,$G$3:$AO$191,9,FALSE)","v":0},{"$f":"VLOOKUP(Model_Select,$G$3:$AO$191,10,FALSE)","v":0},{"$f":"VLOOKUP(Model_Select,$G$3:$AO$191,11,FALSE)","v":0},{"$f":"VLOOKUP(Model_Select,$G$3:$AO$191,12,FALSE)","v":0},{"$f":"VLOOKUP(Model_Select,$G$3:$AO$191,13,FALSE)","v":0},{"$f":"VLOOKUP(Model_Select,$G$3:$AO$191,14,FALSE)","v":0},{"$f":"VLOOKUP(Model_Select,$G$3:$AO$191,15,FALSE)","v":0},{"$f":"VLOOKUP(Model_Select,$G$3:$AO$191,16,FALSE)","v":0},{"$f":"VLOOKUP(Model_Select,$G$3:$AO$191,17,FALSE)","v":0},{"$f":"VLOOKUP(Model_Select,$G$3:$AO$191,18,FALSE)","v":0},{"$f":"VLOOKUP(Model_Select,$G$3:$AO$191,19,FALSE)","v":0},{"$f":"VLOOKUP(Model_Select,$G$3:$AO$191,20,FALSE)","v":0},{"$f":"VLOOKUP(Model_Select,$G$3:$AO$191,21,FALSE)","v":0},{"$f":"VLOOKUP(Model_Select,$G$3:$AO$191,22,FALSE)","v":0},{"$f":"VLOOKUP(Model_Select,$G$3:$AO$191,23,FALSE)","v":0},{"$f":"VLOOKUP(Model_Select,$G$3:$AO$191,24,FALSE)","v":0},{"$f":"VLOOKUP(Model_Select,$G$3:$AO$191,25,FALSE)","v":0},{"$f":"VLOOKUP(Model_Select,$G$3:$AO$191,26,FALSE)","v":0},{"$f":"VLOOKUP(Model_Select,$G$3:$AO$191,27,FALSE)","v":0},{"$f":"VLOOKUP(Model_Select,$G$3:$AO$191,28,FALSE)","v":0},{"$f":"VLOOKUP(Model_Select,$G$3:$AO$191,29,FALSE)","v":0},{"$f":"VLOOKUP(Model_Select,$G$3:$AO$191,30,FALSE)","v":0},{"$f":"VLOOKUP(Model_Select,$G$3:$AO$191,31,FALSE)","v":0},{"$f":"VLOOKUP(Model_Select,$G$3:$AO$191,32,FALSE)","v":0},{"$f":"VLOOKUP(Model_Select,$G$3:$AO$191,33,FALSE)","v":0},{"$f":"VLOOKUP(Model_Select,$G$3:$AO$191,34,FALSE)","v":0},{"$f":"VLOOKUP(Model_Select,$G$3:$AO$191,35,FALSE)","v":0}]
[{"$f":"IF(OR(ModelNo=\"S174\",ModelNo=\"0974\"),15,\"\")","v":""},"S174","Egress Opening Height (Egress Hinge)",{"$f":"IF(D179<22.375,\"N/A\",Frame_Height-4.375)","v":"N/A"},null,null,{"$f":"IF(OR(Model_Select=\"S140\",Model_Select=\"S144\",Model_Select=\"S146\"),1,0)","v":0},null,null,null,null,{"$f":"IF(OR(ModelNo=\"6405\",ModelNo=\"6406\",ModelNo=\"6408\",ModelNo=\"6409\",ModelNo=\"6412\",ModelNo=\"6422\",ModelNo=\"1106\",ModelNo=\"1109\"),1,0)","v":0},null,null,null,null,null,null,null,null,null,null,null,null,null,null,null,null,null,null,null,null,{"$f":"IF(AG192>0,1,0)","v":0},0,0,0,0,0,0,0]
[{"$f":"IF(OR(ModelNo=\"S174\",ModelNo=\"0974\"),16,\"\")","v":""},"S174","Egress Opening Area w/Egress Hinge (sq.ft.)",{"$f":"IF(D179<22.375,\"N/A\",(D192*D193)/144)","v":"N/A"},null,null,null,null,null,null,null,{"$f":"IF(HCONTROL=1,96,\"\")","v":""},null,null,null,null,null,null,null,null,null,null,null,null,null,null,null,null,null,null,null,null,{"$f":"AG193","v":0},{"$f":"SUM(AG193:AH193)","v":0},{"$f":"SUM(AG193:AI193)","v":0},{"$f":"SUM(AG193:AJ193)","v":0},{"$f":"SUM(AG193:AK193)","v":0},{"$f":"SUM(AG193:AL193)","v":0},{"$f":"SUM(AG193:AM193)","v":0},{"$f":"SUM(AG193:AN193)","v":0}]
[{"$f":"IF(OR(ModelNo=\"S175\",ModelNo=\"0975\"),1,\"\")","v":""},"S175","Operating Sash Width",{"$f":"TRUNC(((Frame_Width/5)-1.225)*16+0.5)/16","v":-1.1875},null,null,null,null,null,null,null,null,null,null,null,null,null,null,null,null,null,null,null,null,null,null,null,null,null,null,null,null,{"$f":"AG192","v":0},0,0,0,0,0,0,0]
[{"$f":"IF(OR(ModelNo=\"S175\",ModelNo=\"0975\"),2,\"\")","v":""},"S175","Operating Sash Height",{"$f":"Frame_Height-1.625","v":-1.625},null,null,null,null,null,null,null,null,null,null,null,null,null,null,null,null,null,null,null,null,null,null,null,null,null,null,null,null,{"$f":"IF(ISERROR(HLOOKUP(1,AG194:AN195,2,FALSE)),\"\",HLOOKUP(1,AG194:AN195,2,FALSE))","v":""},{"$f":"IF(ISERROR(HLOOKUP(2,AG194:AN195,2,FALSE)),\"\",HLOOKUP(2,AG194:AN195,2,FALSE))","v":""},{"$f":"IF(ISERROR(HLOOKUP(3,AG194:AN195,2,FALSE)),\"\",HLOOKUP(3,AG194:AN195,2,FALSE))","v":""},{"$f":"IF(ISERROR(HLOOKUP(4,AG194:AN195,2,FALSE)),\"\",HLOOKUP(4,AG194:AN195,2,FALSE))","v":""},{"$f":"IF(ISERROR(HLOOKUP(5,AG194:AN195,2,FALSE)),\"\",HLOOKUP(5,AG194:AN195,2,FALSE))","v":""},{"$f":"IF(ISERROR(HLOOKUP(6,AG194:AN195,2,FALSE)),\"\",HLOOKUP(6,AG194:AN195,2,FALSE))","v":""},{"$f":"IF(ISERROR(HLOOKUP(7,AG194:AN195,2,FALSE)),\"\",HLOOKUP(7,AG194:AN195,2,FALSE))","v":""},{"$f":"IF(ISERROR(HLOOKUP(8,AG194:AN195,2,FALSE)),\"\",HLOOKUP(8,AG194:AN195,2,FALSE))","v":""}]
[{"$f":"IF(OR(ModelNo=\"S175\",ModelNo=\"0975\"),3,\"\")","v":""},"S175","Fixed Sash Width",{"$f":"TRUNC(((Frame_Width/5)-1.225)*16+0.5)/16","v":-1.1875},null,null,null,null,null,null,null,null,null,null,null,null,null,null,null,null,null,null,null,null,null,null,null,null,null,null,null,null,"Single Strength (2.5 mm)","S",2.3140000000000001]
[{"$f":"IF(OR(ModelNo=\"S175\",ModelNo=\"0975\"),4,\"\")","v":""},"S175","Fixed Sash Height",{"$f":"Frame_Height-1.625","v":-1.625},null,null,null,null,null,null,null,null,null,null,null,null,null,null,null,null,null,null,null,null,null,null,null,null,null,null,null,null,"Double Strength (3 mm)","D",3.2]
[{"$f":"IF(OR(ModelNo=\"S175\",ModelNo=\"0975\"),5,\"\")","v":""},"S175","Operating Sash Glass Width",{"$f":"TRUNC(((Frame_Width/5)-4.225)*16+0.5)/16","v":-4.1875},null,null,null,null,null,null,null,null,null,null,null,null,null,null,null,null,null,null,null,null,null,null,null,null,null,null,null,null,"Triple Strength (5 mm)","T",4.8159999999999998]
[{"$f":"IF(OR(ModelNo=\"S175\",ModelNo=\"0975\"),6,\"\")","v":""},"S175","Operating Sash Glass Height",{"$f":"Frame_Height-4.625","v":-4.625},null,null,null,null,null,null,null,null,null,null,null,null,null,null,null,null,null,null,null,null,null,null,null,null,null,null,null,null,"Triple IG Single Strength","STG",3.4710000000000001]
[{"$f":"IF(OR(ModelNo=\"S175\",ModelNo=\"0975\"),7,\"\")","v":""},"S175","Fixed Sash Glass Width",{"$f":"TRUNC(((Frame_Width/5)-4.225)*16+0.5)/16","v":-4.1875},null,null,null,null,null,null,null,null,null,null,null,null,null,null,null,null,null,null,null,null,null,null,null,null,null,null,null,null,"Triple IG Double Strength","DTG",4.8]
[{"$f":"IF(OR(ModelNo=\"S175\",ModelNo=\"0975\"),8,\"\")","v":""},"S175","Fixed Sash Glass Height",{"$f":"Frame_Height-4.625","v":-4.625},null,null,null,null,null,null,null,null,null,null,null,null,null,null,null,null,null,null,null,null,null,null,null,null,null,null,null,null,"Laminated","L",5.3659999999999997]
[{"$f":"IF(OR(ModelNo=\"S175\",ModelNo=\"0975\"),9,\"\")","v":""},"S175","Screen Width",{"$f":"TRUNC(((Frame_Width/5)-3.7625)*16+0.5)/16","v":-3.6875},null,null,null,null,null,null,null,null,null,null,null,null,null,null,null,null,null,null,null,null,null,null,null,null,null,null,null,null,"HP package","H",4.8159999999999998]
[{"$f":"IF(OR(ModelNo=\"S175\",ModelNo=\"0975\"),10,\"\")","v":""},"S175","Screen Height",{"$f":"Frame_Height-4","v":-4},null,null,null,null,null,null,null,null,null,null,null,null,null,null,null,null,null,null,null,null,null,null,null,null,null,null,null,null,"Impact Laminated","IL",5.3659999999999997]
[{"$f":"IF(OR(ModelNo=\"S175\",ModelNo=\"0975\"),11,\"\")","v":""},"S175","Egress Opening Width (Standard Hinge)",{"$f":"TRUNC(((Frame_Width/5)-10.875)*16+0.5)/16","v":-10.8125}]
[{"$f":"IF(OR(ModelNo=\"S175\",ModelNo=\"0975\"),12,\"\")","v":""},"S175","Egress Opening Height (Standard Hinge)",{"$f":"Frame_Height-4.375","v":-4.375}]
[{"$f":"IF(OR(ModelNo=\"S175\",ModelNo=\"0975\"),13,\"\")","v":""},"S175","Egress Opening Area w/Standard Hinge (sq.ft.)",{"$f":"(D205*D206)/144","v":0.32850477430555558}]
[{"$f":"IF(OR(ModelNo=\"S175\",ModelNo=\"0975\"),14,\"\")","v":""},"S175","Egress Opening Width (Egress Hinge)",{"$f":"IF(D195<22.375,\"N/A\",TRUNC(((Frame_Width/5)-6.4375)*16+0.5)/16)","v":"N/A"}]
[{"$f":"IF(OR(ModelNo=\"S175\",ModelNo=\"0975\"),15,\"\")","v":""},"S175","Egress Opening Height (Egress Hinge)",{"$f":"IF(D195<22.375,\"N/A\",Frame_Height-4.375)","v":"N/A"}]
[{"$f":"IF(OR(ModelNo=\"S175\",ModelNo=\"0975\"),16,\"\")","v":""},"S175","Egress Opening Area w/Egress Hinge (sq.ft.)",{"$f":"IF(D195<22.375,\"N/A\",(D208*D209)/144)","v":"N/A"}]
[{"$f":"IF(OR(ModelNo=\"0201\",ModelNo=\"L201\"),1,\"\")","v":""},"0201","Top Sash Width",{"$f":"Frame_Width-3.25","v":-3.25}]
[{"$f":"IF(OR(ModelNo=\"0201\",ModelNo=\"L201\"),2,\"\")","v":""},"0201","Top Sash Height",{"$f":"CMR!$E$26-1.5625","v":-1.5625}]
[{"$f":"IF(OR(ModelNo=\"0201\",ModelNo=\"L201\"),3,\"\")","v":""},"0201","Bottom Sash Width",{"$f":"Frame_Width-2.25","v":-2.25}]
[{"$f":"IF(OR(ModelNo=\"0201\",ModelNo=\"L201\"),4,\"\")","v":""},"0201","Bottom Sash Height",{"$f":"CMR!$E$27-0.5625","v":-0.5625}]
[{"$f":"IF(OR(ModelNo=\"0201\",ModelNo=\"L201\"),5,\"\")","v":""},"0201","Top Glass Width",{"$f":"CMR!$E$29","v":-4.875}]
[{"$f":"IF(OR(ModelNo=\"0201\",ModelNo=\"L201\"),6,\"\")","v":""},"0201","Top Glass Height",{"$f":"CMR!$E$31","v":-3.15625}]
[{"$f":"IF(OR(ModelNo=\"0201\",ModelNo=\"L201\"),7,\"\")","v":""},"0201","Bottom Glass Width",{"$f":"CMR!$E$30","v":-3.875}]
[{"$f":"IF(OR(ModelNo=\"0201\",ModelNo=\"L201\"),8,\"\")","v":""},"0201","Bottom Glass Height",{"$f":"CMR!$E$32","v":-2.15625}]
[{"$f":"IF(OR(ModelNo=\"0201\",ModelNo=\"L201\"),9,\"\")","v":""},"0201","Screen Width",{"$f":"IF(Screen=\"L\",Frame_Width-1.6875,Frame_Width-3.6875)","v":-3.6875}]
[{"$f":"IF(OR(ModelNo=\"0201\",ModelNo=\"L201\"),10,\"\")","v":""},"0201","Screen Height",{"$f":"IF(Screen=\"L\",TRUNC((CMR!$E$27-1.375)*16+0.5)/16,IF(Screen=\"F\",TRUNC((Frame_Height-2.875)*16+0.5)/16,TRUNC((CMR!$E$27-0.3125)*16+0.5)/16))","v":-0.25}]
[{"$f":"IF(OR(ModelNo=\"0201\",ModelNo=\"L201\"),11,\"\")","v":""},"0201","Top Sash Weight",{"$f":"TOP_WGT&\" \"&\"lb\"","v":{"$error":"#N/A"}}]
[{"$f":"IF(OR(ModelNo=\"0201\",ModelNo=\"L201\"),12,\"\")","v":""},"0201","Top Balance Size",{"$f":"IF(TOP_TUBE=0,\"N/A\",TOP_TUBE)","v":{"$error":"#N/A"}}]
[{"$f":"IF(OR(ModelNo=\"0201\",ModelNo=\"L201\"),13,\"\")","v":""},"0201","Bottom Sash Weight",{"$f":"BTM_WGT&\" \"&\"lb\"","v":{"$error":"#N/A"}}]
[{"$f":"IF(OR(ModelNo=\"0201\",ModelNo=\"L201\"),14,\"\")","v":""},"0201","Bottom Balance Size",{"$f":"IF(BTM_TUBE=0,\"N/A\",BTM_TUBE)","v":{"$error":"#N/A"}}]
[{"$f":"IF(OR(ModelNo=\"0201\",ModelNo=\"L201\"),15,\"\")","v":""},"0201","Egress Opening Width",{"$f":"EW","v":{"$error":"#N/A"}}]
[{"$f":"IF(OR(ModelNo=\"0201\",ModelNo=\"L201\"),16,\"\")","v":""},"0201","Egress Opening Height",{"$f":"EH","v":{"$error":"#N/A"}}]
[{"$f":"IF(OR(ModelNo=\"0201\",ModelNo=\"L201\"),17,\"\")","v":""},"0201","Egress Opening Area (sq.ft.)",{"$f":"EO","v":{"$error":"#N/A"}}]
[{"$f":"IF(OR(ModelNo=\"0202\",ModelNo=\"L202\"),1,\"\")","v":""},"0202","Sash Width",{"$f":"(Frame_Width/2)-0.625","v":-0.625}]
[{"$f":"IF(OR(ModelNo=\"0202\",ModelNo=\"L202\"),2,\"\")","v":""},"0202","Sash Height",{"$f":"Frame_Height-3.25","v":-3.25}]
[{"$f":"IF(OR(ModelNo=\"0202\",ModelNo=\"L202\"),3,\"\")","v":""},"0202","Roller Track Length",{"$f":"Frame_Width-1.8125","v":-1.8125}]
[{"$f":"IF(OR(ModelNo=\"0202\",ModelNo=\"L202\"),4,\"\")","v":""},"0202","Glass Width",{"$f":"(Frame_Width/2)-2.3125","v":-2.3125}]
[{"$f":"IF(OR(ModelNo=\"0202\",ModelNo=\"L202\"),5,\"\")","v":""},"0202","Glass Height",{"$f":"Frame_Height-4.9375","v":-4.9375}]
[{"$f":"IF(OR(ModelNo=\"0202\",ModelNo=\"L202\"),6,\"\")","v":""},"0202","Screen Width",{"$f":"IF(Screen=\"F\",Frame_Width-4.125,IF(Screen=\"L\",\"N/A\",(Frame_Width/2)-1.5))","v":-1.5}]
[{"$f":"IF(OR(ModelNo=\"0202\",ModelNo=\"L202\"),7,\"\")","v":""},"0202","Screen Height",{"$f":"Frame_Height-3.6875","v":-3.6875}]
[{"$f":"IF(OR(ModelNo=\"0202\",ModelNo=\"L202\"),8,\"\")","v":""},"0202","Egress Opening Width",{"$f":"(Frame_Width/2)-4.25","v":-4.25}]
[{"$f":"IF(OR(ModelNo=\"0202\",ModelNo=\"L202\"),9,\"\")","v":""},"0202","Egress Opening Height",{"$f":"Frame_Height-4.4375","v":-4.4375}]
[{"$f":"IF(OR(ModelNo=\"0202\",ModelNo=\"L202\"),10,\"\")","v":""},"0202","Egress Opening Area (sq.ft.)",{"$f":"(D235*D236)/144","v":0.13096788194444445}]
[{"$f":"IF(OR(ModelNo=\"0203\",ModelNo=\"L203\"),1,\"\")","v":""},"0203","Operating Sash Width",{"$f":"(TRUNC((((Frame_Width/4)+0.6875))*16+0.5)/16)-0.4375","v":0.25}]
[{"$f":"IF(OR(ModelNo=\"0203\",ModelNo=\"L203\"),2,\"\")","v":""},"0203","Operating Sash Height",{"$f":"Frame_Height-3.25","v":-3.25}]
[{"$f":"IF(OR(ModelNo=\"0203\",ModelNo=\"L203\"),3,\"\")","v":""},"0203","Fixed Sash Width",{"$f":"(Frame_Width-(2*(TRUNC((((Frame_Width/4)+0.6875))*16+0.5)/16)))+0.125","v":-1.25}]
[{"$f":"IF(OR(ModelNo=\"0203\",ModelNo=\"L203\"),4,\"\")","v":""},"0203","Fixed Sash Height",{"$f":"Frame_Height-3.25","v":-3.25}]
[{"$f":"IF(OR(ModelNo=\"0203\",ModelNo=\"L203\"),5,\"\")","v":""},"0203","Roller Track Length",{"$f":"Frame_Width-2.3125","v":-2.3125}]
[{"$f":"IF(OR(ModelNo=\"0203\",ModelNo=\"L203\"),6,\"\")","v":""},"0203","Operating Sash Glass Width",{"$f":"(TRUNC((Frame_Width/4+0.6875)*16+0.5)/16)-2.125","v":-1.4375}]
[{"$f":"IF(OR(ModelNo=\"0203\",ModelNo=\"L203\"),7,\"\")","v":""},"0203","Operating Sash Glass Height",{"$f":"Frame_Height-4.9375","v":-4.9375}]
[{"$f":"IF(OR(ModelNo=\"0203\",ModelNo=\"L203\"),8,\"\")","v":""},"0203","Fixed Sash Glass Width",{"$f":"(Frame_Width-2*(TRUNC((Frame_Width/4+0.6875)*16+0.5)/16))-1.5625","v":-2.9375}]
[{"$f":"IF(OR(ModelNo=\"0203\",ModelNo=\"L203\"),9,\"\")","v":""},"0203","Fixed Sash Glass Height",{"$f":"Frame_Height-4.9375","v":-4.9375}]
[{"$f":"IF(OR(ModelNo=\"0203\",ModelNo=\"L203\"),10,\"\")","v":""},"0203","Screen Width",{"$f":"IF(Screen=\"F\",Frame_Width-4.125,IF(Screen=\"L\",\"N/A\",(TRUNC(((Frame_Width/4)+0.6875)*16+0.5)/16)-1.1875))","v":-0.5}]
[{"$f":"IF(OR(ModelNo=\"0203\",ModelNo=\"L203\"),11,\"\")","v":""},"0203","Screen Height",{"$f":"Frame_Height-3.6875","v":-3.6875}]
[{"$f":"IF(OR(ModelNo=\"0203\",ModelNo=\"L203\"),12,\"\")","v":""},"0203","Egress Opening Width",{"$f":"(Frame_Width/4)-1.5","v":-1.5}]
[{"$f":"IF(OR(ModelNo=\"0203\",ModelNo=\"L203\"),13,\"\")","v":""},"0203","Egress Opening Height",{"$f":"Frame_Height-3.875","v":-3.875}]
[{"$f":"IF(OR(ModelNo=\"0203\",ModelNo=\"L203\"),14,\"\")","v":""},"0203","Egress Opening Area (sq.ft.)",{"$f":"(D249*D250)/144","v":4.0364583333333336E-2}]
[{"$f":"IF(OR(ModelNo=\"0204\",ModelNo=\"i204\",ModelNo=\"02A4\",ModelNo=\"L204\"),1,\"\")","v":""},"0204","Glass Width",{"$f":"Frame_Width-3.4375","v":-3.4375}]
[{"$f":"IF(OR(ModelNo=\"0204\",ModelNo=\"i204\",ModelNo=\"02A4\",ModelNo=\"L204\"),2,\"\")","v":""},"0204","Glass Height",{"$f":"Frame_Height-3.4375","v":-3.4375}]
[{"$f":"IF(OR(ModelNo=\"0204\",ModelNo=\"i204\",ModelNo=\"02A4\",ModelNo=\"L204\"),3,\"\")","v":""},"0204","Glass Area (sq.ft.)",{"$f":"(D252*D253)/144","v":8.2058376736111105E-2}]
[{"$f":"IF(OR(ModelNo=\"0209\",ModelNo=\"L209\"),1,\"\")","v":""},"0209","Operating Sash Width",{"$f":"(TRUNC(((Frame_Width/3)+0.1875)*16+0.5)/16)-0.4375","v":-0.25}]
[{"$f":"IF(OR(ModelNo=\"0209\",ModelNo=\"L209\"),2,\"\")","v":""},"0209","Operating Sash Height",{"$f":"Frame_Height-3.25","v":-3.25}]
[{"$f":"IF(OR(ModelNo=\"0209\",ModelNo=\"L209\"),3,\"\")","v":""},"0209","Fixed Sash Width",{"$f":"((TRUNC(((Frame_Width/3)+0.1875)*16+0.5)/16)-0.5625)+0.125","v":-0.25}]
[{"$f":"IF(OR(ModelNo=\"0209\",ModelNo=\"L209\"),4,\"\")","v":""},"0209","Fixed Sash Height",{"$f":"Frame_Height-3.25","v":-3.25}]
[{"$f":"IF(OR(ModelNo=\"0209\",ModelNo=\"L209\"),5,\"\")","v":""},"0209","Roller Track Length",{"$f":"Frame_Width-2.3125","v":-2.3125}]
[{"$f":"IF(OR(ModelNo=\"0209\",ModelNo=\"L209\"),6,\"\")","v":""},"0209","Operating Sash Glass Width",{"$f":"(TRUNC((Frame_Width/3+0.1875)*16+0.5)/16)-2.125","v":-1.9375}]
[{"$f":"IF(OR(ModelNo=\"0209\",ModelNo=\"L209\"),7,\"\")","v":""},"0209","Operating Sash Glass Height",{"$f":"Frame_Height-4.9375","v":-4.9375}]
[{"$f":"IF(OR(ModelNo=\"0209\",ModelNo=\"L209\"),8,\"\")","v":""},"0209","Fixed Sash Glass Width",{"$f":"(TRUNC((Frame_Width/3+0.1875)*16+0.5)/16)-2.125","v":-1.9375}]
[{"$f":"IF(OR(ModelNo=\"0209\",ModelNo=\"L209\"),9,\"\")","v":""},"0209","Fixed Sash Glass Height",{"$f":"Frame_Height-4.9375","v":-4.9375}]
[{"$f":"IF(OR(ModelNo=\"0209\",ModelNo=\"L209\"),10,\"\")","v":""},"0209","Screen Width",{"$f":"IF(Screen=\"F\",Frame_Width-4.125,IF(Screen=\"L\",\"N/A\",(TRUNC(((Frame_Width/3)+0.1875)*16+0.5)/16)-1.1875))","v":-1}]
[{"$f":"IF(OR(ModelNo=\"0209\",ModelNo=\"L209\"),11,\"\")","v":""},"0209","Screen Height",{"$f":"Frame_Height-3.6875","v":-3.6875}]
[{"$f":"IF(OR(ModelNo=\"0209\",ModelNo=\"L209\"),12,\"\")","v":""},"0209","Egress Opening Width",{"$f":"(TRUNC(((Frame_Width/3)+0.1875)*16+0.5)/16)-4.15","v":-3.9625000000000004}]
[{"$f":"IF(OR(ModelNo=\"0209\",ModelNo=\"L209\"),13,\"\")","v":""},"0209","Egress Opening Height",{"$f":"Frame_Height-3.875","v":-3.875}]
[{"$f":"IF(OR(ModelNo=\"0209\",ModelNo=\"L209\"),14,\"\")","v":""},"0209","Egress Opening Area (sq.ft.)",{"$f":"(D266*D267)/144","v":0.10662977430555556}]
[{"$f":"IF(ModelNo=B269,1,\"\")","v":""},"02A0","Bottom Sash Width",{"$f":"Frame_Width-2.25","v":-2.25}]
[{"$f":"IF(ModelNo=B270,2,\"\")","v":""},"02A0","Bottom Sash Height",{"$f":"CMR!$L$27-0.75","v":-0.75}]
[{"$f":"IF(ModelNo=B271,3,\"\")","v":""},"02A0","Bottom Glass Width",{"$f":"CMR!$L$30","v":-3.875}]
[{"$f":"IF(ModelNo=B272,4,\"\")","v":""},"02A0","Bottom Glass Height",{"$f":"CMR!$L$32","v":-2.375}]
[{"$f":"IF(ModelNo=B273,5,\"\")","v":""},"02A0","Top Glass Width",{"$f":"CMR!$L$29","v":-3.375}]
[{"$f":"IF(ModelNo=B274,6,\"\")","v":""},"02A0","Top Glass Height",{"$f":"CMR!$L$31","v":-2.1875}]
[{"$f":"IF(ModelNo=B275,7,\"\")","v":""},"02A0","Astragal Length",{"$f":"TRUNC((Frame_Width-2.868)*16+0.5)/16","v":-2.8125}]
[{"$f":"IF(ModelNo=B276,8,\"\")","v":""},"02A0","Screen Width",{"$f":"IF(Screen=\"L\",Frame_Width-1.6875,Frame_Width-3.6875)","v":-3.6875}]
[{"$f":"IF(ModelNo=B277,9,\"\")","v":""},"02A0","Screen Height",{"$f":"IF(Screen=\"F\",Frame_Height-2.875,IF(Screen=\"L\",CMR!$L$27-1.75,CMR!$L$27-0.75))","v":-0.75}]
[{"$f":"IF(ModelNo=B278,10,\"\")","v":""},"02A0","Bottom Sash Weight",{"$f":"BTM_WGT&\" \"&\"lb\"","v":{"$error":"#N/A"}}]
[{"$f":"IF(ModelNo=B279,11,\"\")","v":""},"02A0","Balance Size",{"$f":"IF(BTM_TUBE=0,\"N/A\",BTM_TUBE)","v":{"$error":"#N/A"}}]
[{"$f":"IF(ModelNo=B280,12,\"\")","v":""},"02A0","Egress Opening Width",{"$f":"EW","v":{"$error":"#N/A"}}]
[{"$f":"IF(ModelNo=B281,13,\"\")","v":""},"02A0","Egress Opening Height",{"$f":"EH","v":{"$error":"#N/A"}}]
[{"$f":"IF(ModelNo=B282,14,\"\")","v":""},"02A0","Egress Opening Area (sq.ft.)",{"$f":"EO","v":{"$error":"#N/A"}}]
[{"$f":"IF(ModelNo=B283,1,\"\")","v":""},"02A2","Sash Width",{"$f":"TRUNC(((Frame_Width/2)-0.403)*32+0.5)/32","v":-0.375}]
[{"$f":"IF(ModelNo=B284,2,\"\")","v":""},"02A2","Sash Height",{"$f":"Frame_Height-2.4375","v":-2.4375}]
[{"$f":"IF(ModelNo=B285,3,\"\")","v":""},"02A2","Roller Track Length",{"$f":"Frame_Width-1","v":-1}]
[{"$f":"IF(ModelNo=B286,4,\"\")","v":""},"02A2","Sash Glass Width",{"$f":"TRUNC(((Frame_Width/2)-2.09064)*32+0.5)/32","v":-2.0625}]
[{"$f":"IF(ModelNo=B287,5,\"\")","v":""},"02A2","Sash Glass Height",{"$f":"Frame_Height-4.125","v":-4.125}]
[{"$f":"IF(ModelNo=B288,6,\"\")","v":""},"02A2","Fixed Glass Width",{"$f":"TRUNC(((Frame_Width/2)-2.09686)*32+0.5)/32","v":-2.0625}]
[{"$f":"IF(ModelNo=B289,7,\"\")","v":""},"02A2","Fixed Glass Height",{"$f":"TRUNC((Frame_Height-3.41634)*32+0.5)/32","v":-3.375}]
[{"$f":"IF(ModelNo=B290,8,\"\")","v":""},"02A2","Screen Width",{"$f":"IF(Screen=\"F\",Frame_Width-4.125,IF(Screen=\"L\",\"N/A\",TRUNC(((Frame_Width/2)-2.02638)*32+0.5)/32))","v":-2}]
[{"$f":"IF(ModelNo=B291,9,\"\")","v":""},"02A2","Screen Height",{"$f":"Frame_Height-3.6875","v":-3.6875}]
[{"$f":"IF(ModelNo=B292,10,\"\")","v":""},"02A2","Egress Opening Width",{"$f":"(Frame_Width/2)-3.75","v":-3.75}]
[{"$f":"IF(ModelNo=B293,11,\"\")","v":""},"02A2","Egress Opening Height",{"$f":"Frame_Height-4.5","v":-4.5}]
[{"$f":"IF(ModelNo=B294,12,\"\")","v":""},"02A2","Egress Opening Area (sq.ft.)",{"$f":"(D292*D293)/144","v":0.1171875}]
[{"$f":"IF(ModelNo=B295,1,\"\")","v":""},"02A3","Operating Sash Width",{"$f":"(TRUNC((((Frame_Width/4)+0.908))*32+0.5)/32)-0.1875","v":0.71875}]
[{"$f":"IF(ModelNo=B296,2,\"\")","v":""},"02A3","Operating Sash Height",{"$f":"Frame_Height-2.4375","v":-2.4375}]
[{"$f":"IF(ModelNo=B297,3,\"\")","v":""},"02A3","Astragal Length",{"$f":"TRUNC((Frame_Height-2.868)*32+0.5)/32","v":-2.84375}]
[{"$f":"IF(ModelNo=B298,4,\"\")","v":""},"02A3","Roller Track Length",{"$f":"Frame_Width-1","v":-1}]
[{"$f":"IF(ModelNo=B299,5,\"\")","v":""},"02A3","Operating Sash Glass Width",{"$f":"TRUNC((((TRUNC((((Frame_Width/4)+0.908))*32+0.5)/32)-0.1875)-1.6875)*32+0.5)/32","v":-0.9375}]
[{"$f":"IF(ModelNo=B300,6,\"\")","v":""},"02A3","Operating Sash Glass Height",{"$f":"Frame_Height-4.125","v":-4.125}]
[{"$f":"IF(ModelNo=B301,7,\"\")","v":""},"02A3","Fixed Glass Width",{"$f":"TRUNC(((Frame_Width-2*(TRUNC(((Frame_Width/4)+0.908)*32+0.5)/32))-1.14046)*32+0.5)/32","v":-2.90625}]
[{"$f":"IF(ModelNo=B302,8,\"\")","v":""},"02A3","Fixed Glass Height",{"$f":"TRUNC((Frame_Height-3.41634)*32+0.5)/32","v":-3.375}]
[{"$f":"IF(ModelNo=B303,9,\"\")","v":""},"02A3","Screen Width",{"$f":"IF(Screen=\"F\",Frame_Width-4.0625,TRUNC(((INT((((Frame_Width/4)+0.908))*32+0.5)/32)-1.81075)*16+0.5)/16)","v":-0.8125}]
[{"$f":"IF(ModelNo=B304,10,\"\")","v":""},"02A3","Screen Height",{"$f":"Frame_Height-3.6875","v":-3.6875}]
[{"$f":"IF(ModelNo=B305,11,\"\")","v":""},"02A3","Egress Opening Width",{"$f":"(TRUNC((((Frame_Width/4)+0.908))*32+0.5)/32)-3.375","v":-2.46875}]
[{"$f":"IF(ModelNo=B306,12,\"\")","v":""},"02A3","Egress Opening Height",{"$f":"Frame_Height-4.5","v":-4.5}]
[{"$f":"IF(ModelNo=B307,13,\"\")","v":""},"02A3","Egress Opening Area (sq.ft.)",{"$f":"(D305*D306)/144","v":7.71484375E-2}]
[{"$f":"IF(ModelNo=B308,1,\"\")","v":""},"02A9","Operating Sash Width",{"$f":"(TRUNC((((Frame_Width/3)+0.247))*32+0.5)/32)-0.1875","v":6.25E-2}]
[{"$f":"IF(ModelNo=B309,2,\"\")","v":""},"02A9","Operating Sash Height",{"$f":"Frame_Height-2.4375","v":-2.4375}]
[{"$f":"IF(ModelNo=B310,3,\"\")","v":""},"02A9","Astragal Length",{"$f":"TRUNC((Frame_Height-2.868)*32+0.5)/32","v":-2.84375}]
[{"$f":"IF(ModelNo=B311,4,\"\")","v":""},"02A9","Roller Track Length",{"$f":"Frame_Width-1","v":-1}]
[{"$f":"IF(ModelNo=B312,5,\"\")","v":""},"02A9","Operating Sash Glass Width",{"$f":"TRUNC((((TRUNC((((Frame_Width/3)+0.247))*32+0.5)/32)-0.1875)-1.6875)*32+0.5)/32","v":-1.59375}]
[{"$f":"IF(ModelNo=B313,6,\"\")","v":""},"02A9","Operating Sash Glass Height",{"$f":"Frame_Height-4.125","v":-4.125}]
[{"$f":"IF(ModelNo=B314,7,\"\")","v":""},"02A9","Fixed Glass Width",{"$f":"TRUNC(((TRUNC(((TRUNC(((Frame_Width/3)+0.247)*32+0.5)/32)-0.741)*32+0.5)/32)-1.14046)*32+0.5)/32","v":-1.5625}]
[{"$f":"IF(ModelNo=B315,8,\"\")","v":""},"02A9","Fixed Glass Height",{"$f":"TRUNC((Frame_Height-3.41634)*32+0.5)/32","v":-3.375}]
[{"$f":"IF(ModelNo=B316,9,\"\")","v":""},"02A9","Screen Width",{"$f":"IF(Screen=\"F\",Frame_Width-4.0625,TRUNC(((INT((((Frame_Width/3)+0.247))*32+0.5)/32)-1.81075)*16+0.5)/16)","v":-1.5}]
[{"$f":"IF(ModelNo=B317,10,\"\")","v":""},"02A9","Screen Height",{"$f":"Frame_Height-3.6875","v":-3.6875}]
[{"$f":"IF(ModelNo=B318,11,\"\")","v":""},"02A9","Egress Opening Width",{"$f":"(TRUNC((((Frame_Width/3)+0.247))*32+0.5)/32)-4.375","v":-4.125}]
[{"$f":"IF(ModelNo=B319,12,\"\")","v":""},"02A9","Egress Opening Height",{"$f":"Frame_Height-4.5","v":-4.5}]
[{"$f":"IF(ModelNo=B320,13,\"\")","v":""},"02A9","Egress Opening Area (sq.ft.)",{"$f":"(D318*D319)/144","v":0.12890625}]
[{"$f":"IF(ModelNo=B321,1,\"\")","v":""},"0301","Top Sash Width",{"$f":"Frame_Width-3.25","v":-3.25}]
[{"$f":"IF(ModelNo=B322,2,\"\")","v":""},"0301","Top Sash Height",{"$f":"CMR!$E$42-1.625","v":-1.625}]
[{"$f":"IF(ModelNo=B323,3,\"\")","v":""},"0301","Bottom Sash Width",{"$f":"Frame_Width-2.25","v":-2.25}]
[{"$f":"IF(ModelNo=B324,4,\"\")","v":""},"0301","Bottom Sash Height",{"$f":"CMR!$E$43-0.625","v":-0.625}]
[{"$f":"IF(ModelNo=B325,5,\"\")","v":""},"0301","Top Glass Width",{"$f":"CMR!$E$45","v":-4.875}]
[{"$f":"IF(ModelNo=B326,6,\"\")","v":""},"0301","Top Glass Height",{"$f":"CMR!$E$47","v":-3.25}]
[{"$f":"IF(ModelNo=B327,7,\"\")","v":""},"0301","Bottom Glass Width",{"$f":"CMR!$E$46","v":-3.875}]
[{"$f":"IF(ModelNo=B328,8,\"\")","v":""},"0301","Bottom Glass Height",{"$f":"CMR!$E$48","v":-2.25}]
[{"$f":"IF(ModelNo=B329,9,\"\")","v":""},"0301","Screen Width",{"$f":"IF(Screen=\"F\",Frame_Width-3.125,Frame_Width-3.5)","v":-3.5}]
[{"$f":"IF(ModelNo=B330,10,\"\")","v":""},"0301","Screen Height",{"$f":"IF(Screen=\"F\",Frame_Height-2.1875,CMR!$E$43-0.25)","v":-0.25}]
[{"$f":"IF(ModelNo=B331,11,\"\")","v":""},"0301","Top Sash Weight (Plus 5 lb)",{"$f":"TOP_WGT&\" \"&\"lb\"","v":{"$error":"#N/A"}}]
[{"$f":"IF(ModelNo=B332,12,\"\")","v":""},"0301","Top Balance Size",{"$f":"IF(ISERROR((VLOOKUP(TOP_WGT,CFB,2,FALSE))&(VLOOKUP(TOP_WGT,CFB,3,FALSE))),\"N/A\",(VLOOKUP(TOP_WGT,CFB,2,FALSE))&(VLOOKUP(TOP_WGT,CFB,3,FALSE)))","v":"N/A"}]
[{"$f":"IF(ModelNo=B333,13,\"\")","v":""},"0301","Bottom Sash Weight",{"$f":"BTM_WGT&\" \"&\"lb\"","v":{"$error":"#N/A"}}]
[{"$f":"IF(ModelNo=B334,14,\"\")","v":""},"0301","Bottom Balance Size",{"$f":"IF(ISERROR((VLOOKUP(BTM_WGT,CFB,2,FALSE))&(VLOOKUP(BTM_WGT,CFB,3,FALSE))),\"N/A\",(VLOOKUP(BTM_WGT,CFB,2,FALSE))&(VLOOKUP(BTM_WGT,CFB,3,FALSE)))","v":"N/A"}]
[{"$f":"IF(ModelNo=B335,15,\"\")","v":""},"0301","Egress Opening Width",{"$f":"EW","v":{"$error":"#N/A"}}]
[{"$f":"IF(ModelNo=B336,16,\"\")","v":""},"0301","Egress Opening Height",{"$f":"EH","v":{"$error":"#N/A"}}]
[{"$f":"IF(ModelNo=B337,17,\"\")","v":""},"0301","Egress Opening Area (sq.ft.)",{"$f":"EO","v":{"$error":"#N/A"}}]
[{"$f":"IF(OR(ModelNo=\"E301(3250)\",ModelNo=\"E301(3052)\",ModelNo=\"E301(2862)\"),1,\"\")","v":""},"E301","Top Sash Width",{"$f":"Frame_Width-3.25","v":-3.25}]
[{"$f":"IF(OR(ModelNo=\"E301(3250)\",ModelNo=\"E301(3052)\",ModelNo=\"E301(2862)\"),2,\"\")","v":""},"E301","Top Sash Height",{"$f":"CMR!$E$42-1.625","v":-1.625}]
[{"$f":"IF(OR(ModelNo=\"E301(3250)\",ModelNo=\"E301(3052)\",ModelNo=\"E301(2862)\"),3,\"\")","v":""},"E301","Bottom Sash Width",{"$f":"Frame_Width-2.25","v":-2.25}]
[{"$f":"IF(OR(ModelNo=\"E301(3250)\",ModelNo=\"E301(3052)\",ModelNo=\"E301(2862)\"),4,\"\")","v":""},"E301","Bottom Sash Height",{"$f":"CMR!$E$43-0.625","v":-0.625}]
[{"$f":"IF(OR(ModelNo=\"E301(3250)\",ModelNo=\"E301(3052)\",ModelNo=\"E301(2862)\"),5,\"\")","v":""},"E301","Top Glass Width",{"$f":"CMR!$E$45","v":-4.875}]
[{"$f":"IF(OR(ModelNo=\"E301(3250)\",ModelNo=\"E301(3052)\",ModelNo=\"E301(2862)\"),6,\"\")","v":""},"E301","Top Glass Height",{"$f":"CMR!$E$47","v":-3.25}]
[{"$f":"IF(OR(ModelNo=\"E301(3250)\",ModelNo=\"E301(3052)\",ModelNo=\"E301(2862)\"),7,\"\")","v":""},"E301","Bottom Glass Width",{"$f":"CMR!$E$46","v":-3.875}]
[{"$f":"IF(OR(ModelNo=\"E301(3250)\",ModelNo=\"E301(3052)\",ModelNo=\"E301(2862)\"),8,\"\")","v":""},"E301","Bottom Glass Height",{"$f":"CMR!$E$48","v":-2.25}]
[{"$f":"IF(OR(ModelNo=\"E301(3250)\",ModelNo=\"E301(3052)\",ModelNo=\"E301(2862)\"),9,\"\")","v":""},"E301","Screen Width",{"$f":"IF(Screen=\"F\",Frame_Width-3.125,Frame_Width-3.5)","v":-3.5}]
[{"$f":"IF(OR(ModelNo=\"E301(3250)\",ModelNo=\"E301(3052)\",ModelNo=\"E301(2862)\"),10,\"\")","v":""},"E301","Screen Height",{"$f":"IF(Screen=\"F\",Frame_Height-2.1875,CMR!$E$43-0.25)","v":-0.25}]
[{"$f":"IF(OR(ModelNo=\"E301(3250)\",ModelNo=\"E301(3052)\",ModelNo=\"E301(2862)\"),11,\"\")","v":""},"E301","Top Sash Weight (Plus 5 lb)",{"$f":"TOP_WGT&\" \"&\"lb\"","v":{"$error":"#N/A"}}]
[{"$f":"IF(OR(ModelNo=\"E301(3250)\",ModelNo=\"E301(3052)\",ModelNo=\"E301(2862)\"),12,\"\")","v":""},"E301","Top Balance Size",{"$f":"IF(ISERROR((VLOOKUP(TOP_WGT,CFB,2,FALSE))&(VLOOKUP(TOP_WGT,CFB,3,FALSE))),\"N/A\",(VLOOKUP(TOP_WGT,CFB,2,FALSE))&(VLOOKUP(TOP_WGT,CFB,3,FALSE)))","v":"N/A"}]
[{"$f":"IF(OR(ModelNo=\"E301(3250)\",ModelNo=\"E301(3052)\",ModelNo=\"E301(2862)\"),13,\"\")","v":""},"E301","Bottom Sash Weight",{"$f":"BTM_WGT&\" \"&\"lb\"","v":{"$error":"#N/A"}}]
[{"$f":"IF(OR(ModelNo=\"E301(3250)\",ModelNo=\"E301(3052)\",ModelNo=\"E301(2862)\"),14,\"\")","v":""},"E301","Bottom Balance Size","55EGR"]
[{"$f":"IF(OR(ModelNo=\"E301(3250)\",ModelNo=\"E301(3052)\",ModelNo=\"E301(2862)\"),15,\"\")","v":""},"E301","Egress Opening Width",{"$f":"EW","v":{"$error":"#N/A"}}]
[{"$f":"IF(OR(ModelNo=\"E301(3250)\",ModelNo=\"E301(3052)\",ModelNo=\"E301(2862)\"),16,\"\")","v":""},"E301","Egress Opening Height",{"$f":"E301EH","v":0}]
[{"$f":"IF(OR(ModelNo=\"E301(3250)\",ModelNo=\"E301(3052)\",ModelNo=\"E301(2862)\"),17,\"\")","v":""},"E301","Egress Opening Area (sq.ft.)",{"$f":"EO","v":{"$error":"#N/A"}}]
[{"$f":"IF(OR(ModelNo=\"0501\",ModelNo=\"B501\"),1,\"\")","v":""},"0501","Top Sash Width",{"$f":"Frame_Width-4.25","v":-4.25}]
[{"$f":"IF(OR(ModelNo=\"0501\",ModelNo=\"B501\"),2,\"\")","v":""},"0501","Top Sash Height",{"$f":"CMR!$L$42-2.25","v":-2.25}]
[{"$f":"IF(OR(ModelNo=\"0501\",ModelNo=\"B501\"),3,\"\")","v":""},"0501","Bottom Sash Width",{"$f":"Frame_Width-3.25","v":-3.25}]
[{"$f":"IF(OR(ModelNo=\"0501\",ModelNo=\"B501\"),4,\"\")","v":""},"0501","Bottom Sash Height",{"$f":"CMR!$L$43-1.25","v":-1.25}]
[{"$f":"IF(OR(ModelNo=\"0501\",ModelNo=\"B501\"),5,\"\")","v":""},"0501","Top Glass Width",{"$f":"CMR!$L$45","v":-6.0625}]
[{"$f":"IF(OR(ModelNo=\"0501\",ModelNo=\"B501\"),6,\"\")","v":""},"0501","Top Glass Height",{"$f":"CMR!$L$47","v":-4.0625}]
[{"$f":"IF(OR(ModelNo=\"0501\",ModelNo=\"B501\"),7,\"\")","v":""},"0501","Bottom Glass Width",{"$f":"CMR!$L$46","v":-6.0625}]
[{"$f":"IF(OR(ModelNo=\"0501\",ModelNo=\"B501\"),8,\"\")","v":""},"0501","Bottom Glass Height",{"$f":"CMR!$L$48","v":-4.0625}]
[{"$f":"IF(OR(ModelNo=\"0501\",ModelNo=\"B501\"),9,\"\")","v":""},"0501","Screen Width",{"$f":"IF(Screen=\"F\",Frame_Width-5,IF(Screen=\"L\",Frame_Width-2.5625,Frame_Width-4.5625))","v":-4.5625}]
[{"$f":"IF(OR(ModelNo=\"0501\",ModelNo=\"B501\"),10,\"\")","v":""},"0501","Screen Height",{"$f":"IF(Screen=\"F\",Frame_Height-4.6875,IF(Screen=\"L\",CMR!$L$43-3.0625,CMR!$L$43-1.5))","v":-1.5}]
[{"$f":"IF(OR(ModelNo=\"0501\",ModelNo=\"B501\"),11,\"\")","v":""},"0501","Top Sash Weight",{"$f":"TOP_WGT&\" \"&\"lb\"","v":{"$error":"#N/A"}}]
[{"$f":"IF(OR(ModelNo=\"0501\",ModelNo=\"B501\"),12,\"\")","v":""},"0501","Top Balance Size",{"$f":"IF(TOP_TUBE=0,\"N/A\",TOP_TUBE)","v":{"$error":"#N/A"}}]
[{"$f":"IF(OR(ModelNo=\"0501\",ModelNo=\"B501\"),13,\"\")","v":""},"0501","Bottom Sash Weight",{"$f":"BTM_WGT&\" \"&\"lb\"","v":{"$error":"#N/A"}}]
[{"$f":"IF(OR(ModelNo=\"0501\",ModelNo=\"B501\"),14,\"\")","v":""},"0501","Bottom Balance Size",{"$f":"IF(BTM_TUBE=0,\"N/A\",BTM_TUBE)","v":{"$error":"#N/A"}}]
[{"$f":"IF(OR(ModelNo=\"0501\",ModelNo=\"B501\"),15,\"\")","v":""},"0501","Egress Opening Width",{"$f":"EW","v":{"$error":"#N/A"}}]
[{"$f":"IF(OR(ModelNo=\"0501\",ModelNo=\"B501\"),16,\"\")","v":""},"0501","Egress Opening Height",{"$f":"EH","v":{"$error":"#N/A"}}]
[{"$f":"IF(OR(ModelNo=\"0501\",ModelNo=\"B501\"),17,\"\")","v":""},"0501","Egress Opening Area (sq.ft.)",{"$f":"EO","v":{"$error":"#N/A"}}]
[{"$f":"IF(ModelNo=B372,1,\"\")","v":""},"0502","Sash Width",{"$f":"(Frame_Width/2)-0.625","v":-0.625}]
[{"$f":"IF(ModelNo=B373,2,\"\")","v":""},"0502","Sash Height",{"$f":"Frame_Height-4.625","v":-4.625}]
[{"$f":"IF(ModelNo=B374,3,\"\")","v":""},"0502","Roller Track Length",{"$f":"Frame_Width-3.125","v":-3.125}]
[{"$f":"IF(ModelNo=B375,4,\"\")","v":""},"0502","Glass Width",{"$f":"Frame_Width/2-3.5","v":-3.5}]
[{"$f":"IF(ModelNo=B376,5,\"\")","v":""},"0502","Glass Height",{"$f":"Frame_Height-7.5","v":-7.5}]
[{"$f":"IF(ModelNo=B377,6,\"\")","v":""},"0502","Screen Width",{"$f":"IF(Screen=\"F\",INT((Frame_Width-4.882)*16+0.5)/16,IF(Screen=\"H\",INT(((Frame_Width/2)-2.69)*16+0.5)/16,\"N/A\"))","v":-2.6875}]
[{"$f":"IF(ModelNo=B378,7,\"\")","v":""},"0502","Screen Height",{"$f":"INT((Frame_Height-4.651)*16+0.5)/16","v":-4.625}]
[{"$f":"IF(ModelNo=B379,8,\"\")","v":""},"0502","Egress Opening Width",{"$f":"TRUNC((Frame_Width/2-6.438)*16+0.5)/16","v":-6.375}]
[{"$f":"IF(ModelNo=B380,9,\"\")","v":""},"0502","Egress Opening Height",{"$f":"TRUNC((Frame_Height-5.75)*16+0.5)/16","v":-5.6875}]
[{"$f":"IF(ModelNo=B381,10,\"\")","v":""},"0502","Egress Opening Area (sq.ft.)",{"$f":"(D379*D380)/144","v":0.25179036458333331}]
[{"$f":"IF(ModelNo=B382,1,\"\")","v":""},"0503","Operating Sash Width",{"$f":"(Frame_Width/4)+0.875","v":0.875}]
[{"$f":"IF(ModelNo=B383,2,\"\")","v":""},"0503","Operating Sash Height",{"$f":"Frame_Height-4.625","v":-4.625}]
[{"$f":"IF(ModelNo=B384,3,\"\")","v":""},"0503","Fixed Sash Width",{"$f":"(Frame_Width-(2*(Frame_Width/4)))-1.0625","v":-1.0625}]
[{"$f":"IF(ModelNo=B385,4,\"\")","v":""},"0503","Fixed Sash Height",{"$f":"Frame_Height-4.625","v":-4.625}]
[{"$f":"IF(ModelNo=B386,5,\"\")","v":""},"0503","Roller Track Length",{"$f":"Frame_Width-3.125","v":-3.125}]
[{"$f":"IF(ModelNo=B387,6,\"\")","v":""},"0503","Operating Sash Glass Width",{"$f":"TRUNC((Frame_Width/4-2)*16+0.5)/16","v":-1.9375}]
[{"$f":"IF(ModelNo=B388,7,\"\")","v":""},"0503","Operating Sash Glass Height",{"$f":"Frame_Height-7.5","v":-7.5}]
[{"$f":"IF(ModelNo=B389,8,\"\")","v":""},"0503","Fixed Sash Glass Width",{"$f":"TRUNC((Frame_Width-(2*(Frame_Width/4))-3.9375)*16+0.5)/16","v":-3.875}]
[{"$f":"IF(ModelNo=B390,9,\"\")","v":""},"0503","Fixed Sash Glass Height",{"$f":"Frame_Height-7.5","v":-7.5}]
[{"$f":"IF(ModelNo=B391,10,\"\")","v":""},"0503","Screen Width",{"$f":"IF(Screen=\"F\",INT((Frame_Width-4.882)*16+0.5)/16,IF(Screen=\"H\",INT(((Frame_Width/4)-0.938)*16+0.5)/16,\"N/A\"))","v":-0.9375}]
[{"$f":"IF(ModelNo=B392,11,\"\")","v":""},"0503","Screen Height",{"$f":"INT((Frame_Height-4.65)*16+0.5)/16","v":-4.625}]
[{"$f":"IF(ModelNo=B393,12,\"\")","v":""},"0503","Egress Opening Width",{"$f":"(Frame_Width/4)-2.125","v":-2.125}]
[{"$f":"IF(ModelNo=B394,13,\"\")","v":""},"0503","Egress Opening Height",{"$f":"Frame_Height-5.75","v":-5.75}]
[{"$f":"IF(ModelNo=B395,14,\"\")","v":""},"0503","Egress Opening Area (sq.ft.)",{"$f":"(D393*D394)/144","v":8.4852430555555552E-2}]
[{"$f":"IF(ModelNo=B396,1,\"\")","v":""},"0509","Operating Sash Width",{"$f":"(INT(((Frame_Width/3)-0.656)*16)/16)+0.875","v":0.1875}]
[{"$f":"IF(ModelNo=B397,2,\"\")","v":""},"0509","Operating Sash Height",{"$f":"Frame_Height-4.625","v":-4.625}]
[{"$f":"IF(ModelNo=B398,3,\"\")","v":""},"0509","Fixed Sash Width",{"$f":"(INT((((INT(((Frame_Width/3)-0.656)*16)/16))+1.938)*16+0.5)/16)-1.0625","v":0.1875}]
[{"$f":"IF(ModelNo=B399,4,\"\")","v":""},"0509","Fixed Sash Height",{"$f":"Frame_Height-4.625","v":-4.625}]
[{"$f":"IF(ModelNo=B400,5,\"\")","v":""},"0509","Roller Track Length",{"$f":"Frame_Width-3.125","v":-3.125}]
[{"$f":"IF(ModelNo=B401,6,\"\")","v":""},"0509","Operating Sash Glass Width",{"$f":"(INT((Frame_Width/3-0.656)*16)/16)-2","v":-2.6875}]
[{"$f":"IF(ModelNo=B402,7,\"\")","v":""},"0509","Operating Sash Glass Height",{"$f":"Frame_Height-7.5","v":-7.5}]
[{"$f":"IF(ModelNo=B403,8,\"\")","v":""},"0509","Fixed Sash Glass Width",{"$f":"(INT((Frame_Width/3-0.656)*16)/16)-2","v":-2.6875}]
[{"$f":"IF(ModelNo=B404,9,\"\")","v":""},"0509","Fixed Sash Glass Height",{"$f":"Frame_Height-7.5","v":-7.5}]
[{"$f":"IF(ModelNo=B405,10,\"\")","v":""},"0509","Screen Width",{"$f":"IF(Screen=\"F\",INT((Frame_Width-4.882)*16+0.5)/16,IF(Screen=\"H\",INT(((TRUNC(((Frame_Width/3)-0.656)*16)/16)-0.938)*16+0.5)/16,\"N/A\"))","v":-1.5625}]
[{"$f":"IF(ModelNo=B406,11,\"\")","v":""},"0509","Screen Height",{"$f":"INT((Frame_Height-4.65)*16+0.5)/16","v":-4.625}]
[{"$f":"IF(ModelNo=B407,12,\"\")","v":""},"0509","Egress Opening Width",{"$f":"(Frame_Width/3)-4.625","v":-4.625}]
[{"$f":"IF(ModelNo=B408,13,\"\")","v":""},"0509","Egress Opening Height",{"$f":"Frame_Height-5.75","v":-5.75}]
[{"$f":"IF(ModelNo=B409,14,\"\")","v":""},"0509","Egress Opening Area (sq.ft.)",{"$f":"(D407*D408)/144","v":0.18467881944444445}]
[{"$f":"IF(ModelNo=B410,1,\"\")","v":""},"0522","Inner Sash Width",{"$f":"(Frame_Width/2)-1.125","v":-1.125}]
[{"$f":"IF(ModelNo=B411,2,\"\")","v":""},"0522","Inner Sash Height",{"$f":"Frame_Height-3.9375","v":-3.9375}]
[{"$f":"IF(ModelNo=B412,3,\"\")","v":""},"0522","Outer Sash Width",{"$f":"(Frame_Width/2)-2.125","v":-2.125}]
[{"$f":"IF(ModelNo=B413,4,\"\")","v":""},"0522","Outer Sash Height",{"$f":"Frame_Height-4.9375","v":-4.9375}]
[{"$f":"IF(ModelNo=B414,5,\"\")","v":""},"0522","Inner Glass Width",{"$f":"Frame_Width/2-4","v":-4}]
[{"$f":"IF(ModelNo=B415,6,\"\")","v":""},"0522","Inner Glass Height",{"$f":"Frame_Height-6.75","v":-6.75}]
[{"$f":"IF(ModelNo=B416,7,\"\")","v":""},"0522","Outer Glass Width",{"$f":"Frame_Width/2-4","v":-4}]
[{"$f":"IF(ModelNo=B417,8,\"\")","v":""},"0522","Outer Glass Height",{"$f":"Frame_Height-6.75","v":-6.75}]
[{"$f":"IF(ModelNo=B418,9,\"\")","v":""},"0522","Screen Width",{"$f":"IF(Screen=\"F\",INT((Frame_Width-5.59375)*16+0.5)/16,IF(Screen=\"H\",INT(((Frame_Width/2)-2.5)*16+0.5)/16,\"N/A\"))","v":-2.5}]
[{"$f":"IF(ModelNo=B419,10,\"\")","v":""},"0522","Screen Height",{"$f":"Frame_Height-5.1875","v":-5.1875}]
[{"$f":"IF(ModelNo=B420,11,\"\")","v":""},"0522","Egress Opening Width",{"$f":"Frame_Width-(D410+7.875)","v":-6.75}]
[{"$f":"IF(ModelNo=B421,12,\"\")","v":""},"0522","Egress Opening Height",{"$f":"Frame_Height-6.125","v":-6.125}]
[{"$f":"IF(ModelNo=B422,13,\"\")","v":""},"0522","Egress Opening Area (sq.ft.)",{"$f":"(D420*D421)/144","v":0.287109375}]
[{"$f":"IF(ModelNo=B423,1,\"\")","v":""},"0523","Operating Sash Width",{"$f":"TRUNC(((Frame_Width/4)+0.59375)*32+0.5)/32","v":0.59375}]
[{"$f":"IF(ModelNo=B424,2,\"\")","v":""},"0523","Operating Sash Height",{"$f":"Frame_Height-3.9375","v":-3.9375}]
[{"$f":"IF(ModelNo=B425,3,\"\")","v":""},"0523","Fixed Sash Width",{"$f":"(Frame_Width/2)-2.75","v":-2.75}]
[{"$f":"IF(ModelNo=B426,4,\"\")","v":""},"0523","Fixed Sash Height",{"$f":"Frame_Height-4.9375","v":-4.9375}]
[{"$f":"IF(ModelNo=B427,5,\"\")","v":""},"0523","Operating Sash Glass Width",{"$f":"TRUNC((Frame_Width/4-2.28125)*32+0.5)/32","v":-2.25}]
[{"$f":"IF(ModelNo=B428,6,\"\")","v":""},"0523","Operating Sash Glass Height",{"$f":"Frame_Height-6.75","v":-6.75}]
[{"$f":"IF(ModelNo=B429,7,\"\")","v":""},"0523","Fixed Sash Glass Width",{"$f":"(Frame_Width/4)*2-4.625","v":-4.625}]
[{"$f":"IF(ModelNo=B430,8,\"\")","v":""},"0523","Fixed Sash Glass Height",{"$f":"Frame_Height-6.75","v":-6.75}]
[{"$f":"IF(ModelNo=B431,9,\"\")","v":""},"0523","Screen Width",{"$f":"IF(Screen=\"F\",INT((Frame_Width-5.59375)*16+0.5)/16,IF(Screen=\"H\",INT(((Frame_Width/4)-0.71875)*16+0.5)/16,\"N/A\"))","v":-0.6875}]
[{"$f":"IF(ModelNo=B432,10,\"\")","v":""},"0523","Screen Height",{"$f":"Frame_Height-5.1875","v":-5.1875}]
[{"$f":"IF(ModelNo=B433,11,\"\")","v":""},"0523","Egress Opening Width",{"$f":"(Frame_Width/4)-3.25","v":-3.25}]
[{"$f":"IF(ModelNo=B434,12,\"\")","v":""},"0523","Egress Opening Height",{"$f":"Frame_Height-6.125","v":-6.125}]
[{"$f":"IF(ModelNo=B435,13,\"\")","v":""},"0523","Egress Opening Area (sq.ft.)",{"$f":"(D433*D434)/144","v":0.13823784722222221}]
[{"$f":"IF(ModelNo=B436,1,\"\")","v":""},"0529","Operating Sash Width",{"$f":"TRUNC(((Frame_Width/3)-0.1875)*32+0.5)/32","v":-0.15625}]
[{"$f":"IF(ModelNo=B437,2,\"\")","v":""},"0529","Operating Sash Height",{"$f":"Frame_Height-3.9375","v":-3.9375}]
[{"$f":"IF(ModelNo=B438,3,\"\")","v":""},"0529","Fixed Sash Width",{"$f":"TRUNC(((Frame_Width/3)-1.1875)*32+0.5)/32","v":-1.15625}]
[{"$f":"IF(ModelNo=B439,4,\"\")","v":""},"0529","Fixed Sash Height",{"$f":"Frame_Height-4.9375","v":-4.9375}]
[{"$f":"IF(ModelNo=B440,5,\"\")","v":""},"0529","Operating Sash Glass Width",{"$f":"TRUNC(((Frame_Width/3-0.1875)-2.875)*32+0.5)/32","v":-3.03125}]
[{"$f":"IF(ModelNo=B441,6,\"\")","v":""},"0529","Operating Sash Glass Height",{"$f":"Frame_Height-6.75","v":-6.75}]
[{"$f":"IF(ModelNo=B442,7,\"\")","v":""},"0529","Fixed Sash Glass Width",{"$f":"TRUNC(((Frame_Width/3-0.1875)-2.875)*32+0.5)/32","v":-3.03125}]
[{"$f":"IF(ModelNo=B443,8,\"\")","v":""},"0529","Fixed Sash Glass Height",{"$f":"Frame_Height-6.75","v":-6.75}]
[{"$f":"IF(ModelNo=B444,9,\"\")","v":""},"0529","Screen Width",{"$f":"IF(Screen=\"F\",INT((Frame_Width-5.59375)*16+0.5)/16,IF(Screen=\"H\",INT(((Frame_Width/3)-1.4375)*16+0.5)/16,\"N/A\"))","v":-1.4375}]
[{"$f":"IF(ModelNo=B445,10,\"\")","v":""},"0529","Screen Height",{"$f":"Frame_Height-5.1875","v":-5.1875}]
[{"$f":"IF(ModelNo=B446,11,\"\")","v":""},"0529","Egress Opening Width",{"$f":"(Frame_Width/3)-4","v":-4}]
[{"$f":"IF(ModelNo=B447,12,\"\")","v":""},"0529","Egress Opening Height",{"$f":"Frame_Height-6.125","v":-6.125}]
[{"$f":"IF(ModelNo=B448,13,\"\")","v":""},"0529","Egress Opening Area (sq.ft.)",{"$f":"(D446*D447)/144","v":0.1701388888888889}]
[{"$f":"IF(ModelNo=B449,1,\"\")","v":""},"0700","Bottom Sash Width",{"$f":"Frame_Width-2.3125","v":-2.3125}]
[{"$f":"IF(ModelNo=B450,2,\"\")","v":""},"0700","Bottom Sash Height",{"$f":"CMR!$E$11+0.125","v":0.125}]
[{"$f":"IF(ModelNo=B451,3,\"\")","v":""},"0700","Bottom Glass Width",{"$f":"CMR!$E$14","v":-3.9375}]
[{"$f":"IF(ModelNo=B452,4,\"\")","v":""},"0700","Bottom Glass Height",{"$f":"CMR!$E$16","v":-1.5}]
[{"$f":"IF(ModelNo=B453,5,\"\")","v":""},"0700","Top Glass Width",{"$f":"CMR!$E$13","v":-1.9375}]
[{"$f":"IF(ModelNo=B454,6,\"\")","v":""},"0700","Top Glass Height",{"$f":"CMR!$E$15","v":-1.875}]
[{"$f":"IF(ModelNo=B455,7,\"\")","v":""},"0700","Astragal Length",{"$f":"TRUNC((Frame_Width-1.218)*32+0.5)/32","v":-1.1875}]
[{"$f":"IF(ModelNo=B456,8,\"\")","v":""},"0700","Screen Width",{"$f":"TRUNC((Frame_Width-1.75)*32+0.5)/32","v":-1.71875}]
[{"$f":"IF(ModelNo=B457,9,\"\")","v":""},"0700","Screen Height",{"$f":"TRUNC((CMR!$E$11-1.1875)*32+0.5)/32","v":-1.15625}]
[{"$f":"IF(ModelNo=B458,10,\"\")","v":""},"0700","Bottom Sash Weight",{"$f":"BTM_WGT&\" \"&\"lb\"","v":{"$error":"#N/A"}}]
[{"$f":"IF(ModelNo=B459,11,\"\")","v":""},"0700","Balance Size",{"$f":"IF(ISERROR((VLOOKUP(BTM_WGT,CFB,2,FALSE))&(VLOOKUP(BTM_WGT,CFB,3,FALSE))),\"N/A\",(VLOOKUP(BTM_WGT,CFB,2,FALSE))&(VLOOKUP(BTM_WGT,CFB,3,FALSE)))","v":"N/A"}]
[{"$f":"IF(ModelNo=B460,12,\"\")","v":""},"0700","Egress Opening Width",{"$f":"EW","v":{"$error":"#N/A"}}]
[{"$f":"IF(ModelNo=B461,13,\"\")","v":""},"0700","Egress Opening Height",{"$f":"EH","v":{"$error":"#N/A"}}]
[{"$f":"IF(ModelNo=B462,14,\"\")","v":""},"0700","Egress Opening Area (sq.ft.)",{"$f":"EO","v":{"$error":"#N/A"}}]
[{"$f":"IF(ModelNo=B463,1,\"\")","v":""},"07HP","Bottom Sash Width",{"$f":"Frame_Width-2.3125","v":-2.3125}]
[{"$f":"IF(ModelNo=B464,2,\"\")","v":""},"07HP","Bottom Sash Height",{"$f":"CMR!$E$11+0.125","v":0.125}]
[{"$f":"IF(ModelNo=B465,3,\"\")","v":""},"07HP","Bottom Glass Width",{"$f":"CMR!$E$14","v":-3.9375}]
[{"$f":"IF(ModelNo=B466,4,\"\")","v":""},"07HP","Bottom Glass Height",{"$f":"CMR!$E$16","v":-1.5}]
[{"$f":"IF(ModelNo=B467,5,\"\")","v":""},"07HP","Top Glass Width",{"$f":"CMR!$E$13","v":-1.9375}]
[{"$f":"IF(ModelNo=B468,6,\"\")","v":""},"07HP","Top Glass Height",{"$f":"CMR!$E$15","v":-1.875}]
[{"$f":"IF(ModelNo=B469,7,\"\")","v":""},"07HP","Astragal Length",{"$f":"TRUNC((Frame_Width-1.218)*32+0.5)/32","v":-1.1875}]
[{"$f":"IF(ModelNo=B470,8,\"\")","v":""},"07HP","Screen Width",{"$f":"TRUNC((Frame_Width-1.75)*32+0.5)/32","v":-1.71875}]
[{"$f":"IF(ModelNo=B471,9,\"\")","v":""},"07HP","Screen Height",{"$f":"TRUNC((CMR!$E$11-1.1875)*32+0.5)/32","v":-1.15625}]
[{"$f":"IF(ModelNo=B472,10,\"\")","v":""},"07HP","Bottom Sash Weight",{"$f":"BTM_WGT&\" \"&\"lb\"","v":{"$error":"#N/A"}}]
[{"$f":"IF(ModelNo=B473,11,\"\")","v":""},"07HP","Balance Size",{"$f":"IF(ISERROR((VLOOKUP(BTM_WGT,CFB,2,FALSE))&(VLOOKUP(BTM_WGT,CFB,3,FALSE))),\"N/A\",(VLOOKUP(BTM_WGT,CFB,2,FALSE))&(VLOOKUP(BTM_WGT,CFB,3,FALSE)))","v":"N/A"}]
[{"$f":"IF(ModelNo=B474,12,\"\")","v":""},"07HP","Egress Opening Width",{"$f":"EW","v":{"$error":"#N/A"}}]
[{"$f":"IF(ModelNo=B475,13,\"\")","v":""},"07HP","Egress Opening Height",{"$f":"EH","v":{"$error":"#N/A"}}]
[{"$f":"IF(ModelNo=B476,14,\"\")","v":""},"07HP","Egress Opening Area (sq.ft.)",{"$f":"EO","v":{"$error":"#N/A"}}]
[{"$f":"IF(ModelNo=B477,1,\"\")","v":""},"0702","Sash Width",{"$f":"(Frame_Width/2)+0.25","v":0.25}]
[{"$f":"IF(ModelNo=B478,2,\"\")","v":""},"0702","Sash Height",{"$f":"Frame_Height-2.25","v":-2.25}]
[{"$f":"IF(ModelNo=B479,3,\"\")","v":""},"0702","Sash Glass Width",{"$f":"(Frame_Width/2)-1.4375","v":-1.4375}]
[{"$f":"IF(ModelNo=B480,4,\"\")","v":""},"0702","Sash Glass Height",{"$f":"Frame_Height-3.9375","v":-3.9375}]
[{"$f":"IF(ModelNo=B481,5,\"\")","v":""},"0702","Fixed Glass Width",{"$f":"(Frame_Width/2)-1.9375","v":-1.9375}]
[{"$f":"IF(ModelNo=B482,6,\"\")","v":""},"0702","Fixed Glass Height",{"$f":"Frame_Height-2","v":-2}]
[{"$f":"IF(ModelNo=B483,7,\"\")","v":""},"0702","Astragal Length",{"$f":"TRUNC((Frame_Height-1.218)*16+0.5)/16","v":-1.125}]
[{"$f":"IF(ModelNo=B484,8,\"\")","v":""},"0702","Roller Track Length",{"$f":"Frame_Width-1","v":-1}]
[{"$f":"IF(ModelNo=B485,9,\"\")","v":""},"0702","Screen Width",{"$f":"(Frame_Width/2)-1.1875","v":-1.1875}]
[{"$f":"IF(ModelNo=B486,10,\"\")","v":""},"0702","Screen Height",{"$f":"Frame_Height-1.75","v":-1.75}]
[{"$f":"IF(ModelNo=B487,11,\"\")","v":""},"0702","Egress Opening Width",{"$f":"TRUNC(((Frame_Width/2)-3.25)*16+0.5)/16","v":-3.1875}]
[{"$f":"IF(ModelNo=B488,12,\"\")","v":""},"0702","Egress Opening Height",{"$f":"TRUNC((Frame_Height-3.074)*16+0.5)/16","v":-3}]
[{"$f":"IF(ModelNo=B489,13,\"\")","v":""},"0702","Egress Opening Area (sq.ft.)",{"$f":"(D487*D488)/144","v":6.640625E-2}]
[{"$f":"IF(ModelNo=B490,1,\"\")","v":""},"0703","Sash Width",{"$f":"Frame_Width/4","v":0}]
[{"$f":"IF(ModelNo=B491,2,\"\")","v":""},"0703","Sash Height",{"$f":"Frame_Height-2.25","v":-2.25}]
[{"$f":"IF(ModelNo=B492,3,\"\")","v":""},"0703","Sash Glass Width",{"$f":"(TRUNC((Frame_Width/4-0.25)*16+0.5)/16)-1.4375","v":-1.625}]
[{"$f":"IF(ModelNo=B493,4,\"\")","v":""},"0703","Sash Glass Height",{"$f":"Frame_Height-3.9375","v":-3.9375}]
[{"$f":"IF(ModelNo=B494,5,\"\")","v":""},"0703","Fixed Glass Width",{"$f":"(Frame_Width-2*(TRUNC((Frame_Width/4-0.25)*16+0.5)/16))-1.9375","v":-1.5625}]
[{"$f":"IF(ModelNo=B495,6,\"\")","v":""},"0703","Fixed Glass Height",{"$f":"Frame_Height-2","v":-2}]
[{"$f":"IF(ModelNo=B496,7,\"\")","v":""},"0703","Astragal Length",{"$f":"TRUNC((Frame_Height-1.218)*16+0.5)/16","v":-1.125}]
[{"$f":"IF(ModelNo=B497,8,\"\")","v":""},"0703","Roller Track Length",{"$f":"Frame_Width-1","v":-1}]
[{"$f":"IF(ModelNo=B498,9,\"\")","v":""},"0703","Screen Width",{"$f":"(Frame_Width/4)-1.3125","v":-1.3125}]
[{"$f":"IF(ModelNo=B499,10,\"\")","v":""},"0703","Screen Height",{"$f":"Frame_Height-1.75","v":-1.75}]
[{"$f":"IF(ModelNo=B500,11,\"\")","v":""},"0703","Egress Opening Width",{"$f":"(Frame_Width/4)-2.3125","v":-2.3125}]
[{"$f":"IF(ModelNo=B501,12,\"\")","v":""},"0703","Egress Opening Height",{"$f":"TRUNC((Frame_Height-3.074)*16+0.5)/16","v":-3}]
[{"$f":"IF(ModelNo=B502,13,\"\")","v":""},"0703","Egress Opening Area (sq.ft.)",{"$f":"(D500*D501)/144","v":4.8177083333333336E-2}]
[{"$f":"IF(ModelNo=B503,1,\"\")","v":""},"0704","Glass Width",{"$f":"Frame_Width-1.9375","v":-1.9375}]
[{"$f":"IF(ModelNo=B504,2,\"\")","v":""},"0704","Glass Height",{"$f":"Frame_Height-1.9375","v":-1.9375}]
[{"$f":"IF(ModelNo=B505,3,\"\")","v":""},"0704","Glass Area (sq.ft.)",{"$f":"(D503*D504)/144","v":2.6068793402777776E-2}]
[{"$f":"IF(ModelNo=B506,1,\"\")","v":""},"0709","Sash Width",{"$f":"TRUNC(((Frame_Width/3)+0.4375)*16+0.5)/16","v":0.4375}]
[{"$f":"IF(ModelNo=B507,2,\"\")","v":""},"0709","Sash Height",{"$f":"Frame_Height-2.25","v":-2.25}]
[{"$f":"IF(ModelNo=B508,3,\"\")","v":""},"0709","Sash Glass Width",{"$f":"(TRUNC((Frame_Width/3+0.1875)*16+0.5)/16)-1.4375","v":-1.25}]
[{"$f":"IF(ModelNo=B509,4,\"\")","v":""},"0709","Sash Glass Height",{"$f":"Frame_Height-3.9375","v":-3.9375}]
[{"$f":"IF(ModelNo=B510,5,\"\")","v":""},"0709","Fixed Glass Width",{"$f":"(Frame_Width-2*(TRUNC((Frame_Width/3+0.1875)*16+0.5)/16))-1.9375","v":-2.3125}]
[{"$f":"IF(ModelNo=B511,6,\"\")","v":""},"0709","Fixed Glass Height",{"$f":"Frame_Height-2","v":-2}]
[{"$f":"IF(ModelNo=B512,7,\"\")","v":""},"0709","Astragal Length",{"$f":"TRUNC((Frame_Height-1.218)*16+0.5)/16","v":-1.125}]
[{"$f":"IF(ModelNo=B513,8,\"\")","v":""},"0709","Roller Track Length",{"$f":"Frame_Width-1","v":-1}]
[{"$f":"IF(ModelNo=B514,9,\"\")","v":""},"0709","Screen Width",{"$f":"TRUNC(((Frame_Width/3)-0.875)*16+0.5)/16","v":-0.8125}]
[{"$f":"IF(ModelNo=B515,10,\"\")","v":""},"0709","Screen Height",{"$f":"Frame_Height-1.75","v":-1.75}]
[{"$f":"IF(ModelNo=B516,11,\"\")","v":""},"0709","Egress Opening Width",{"$f":"TRUNC(((Frame_Width/3)-4.3125)*16+0.5)/16","v":-4.25}]
[{"$f":"IF(ModelNo=B517,12,\"\")","v":""},"0709","Egress Opening Height",{"$f":"TRUNC((Frame_Height-3.074)*16+0.5)/16","v":-3}]
[{"$f":"IF(ModelNo=B518,13,\"\")","v":""},"0709","Egress Opening Area (sq.ft.)",{"$f":"(D516*D517)/144","v":8.8541666666666671E-2}]
[{"$f":"IF(OR(ModelNo=\"0901\",ModelNo=\"09A1\",ModelNo=\"09B1\",ModelNo=\"09L1\"),1,\"\")","v":""},"0901","Top Sash Width",{"$f":"Frame_Width-3.1875","v":-3.1875}]
[{"$f":"IF(OR(ModelNo=\"0901\",ModelNo=\"09A1\",ModelNo=\"09B1\",ModelNo=\"09L1\"),2,\"\")","v":""},"0901","Top Sash Height",{"$f":"CMR!$E$58-0.6875","v":-0.6875}]
[{"$f":"IF(OR(ModelNo=\"0901\",ModelNo=\"09A1\",ModelNo=\"09B1\",ModelNo=\"09L1\"),3,\"\")","v":""},"0901","Bottom Sash Width",{"$f":"Frame_Width-2.6875","v":-2.6875}]
[{"$f":"IF(OR(ModelNo=\"0901\",ModelNo=\"09A1\",ModelNo=\"09B1\",ModelNo=\"09L1\"),4,\"\")","v":""},"0901","Bottom Sash Height",{"$f":"CMR!$E$59-0.6875","v":-0.6875}]
[{"$f":"IF(OR(ModelNo=\"0901\",ModelNo=\"09A1\",ModelNo=\"09B1\",ModelNo=\"09L1\"),5,\"\")","v":""},"0901","Top Glass Width",{"$f":"CMR!$E$61","v":-4.8125}]
[{"$f":"IF(OR(ModelNo=\"0901\",ModelNo=\"09A1\",ModelNo=\"09B1\",ModelNo=\"09L1\"),6,\"\")","v":""},"0901","Top Glass Height",{"$f":"CMR!$E$63","v":-3}]
[{"$f":"IF(OR(ModelNo=\"0901\",ModelNo=\"09A1\",ModelNo=\"09B1\",ModelNo=\"09L1\"),7,\"\")","v":""},"0901","Bottom Glass Width",{"$f":"CMR!$E$62","v":-4.8125}]
[{"$f":"IF(OR(ModelNo=\"0901\",ModelNo=\"09A1\",ModelNo=\"09B1\",ModelNo=\"09L1\"),8,\"\")","v":""},"0901","Bottom Glass Height",{"$f":"CMR!$E$64","v":-3}]
[{"$f":"IF(OR(ModelNo=\"0901\",ModelNo=\"09A1\",ModelNo=\"09B1\",ModelNo=\"09L1\"),9,\"\")","v":""},"0901","Screen Width",{"$f":"IF(Screen=\"L\",Frame_Width-1.5625,Frame_Width-3.5625)","v":-3.5625}]
[{"$f":"IF(OR(ModelNo=\"0901\",ModelNo=\"09A1\",ModelNo=\"09B1\",ModelNo=\"09L1\"),10,\"\")","v":""},"0901","Screen Height",{"$f":"IF(Screen=\"F\",Frame_Height-2,IF(Screen=\"L\",CMR!$E$59-1.75,CMR!$E$59-0.75))","v":-0.75}]
[{"$f":"IF(OR(ModelNo=\"0901\",ModelNo=\"09A1\",ModelNo=\"09B1\",ModelNo=\"09L1\"),11,\"\")","v":""},"0901","Top Sash Weight",{"$f":"TOP_WGT&\" \"&\"lb\"","v":{"$error":"#N/A"}}]
[{"$f":"IF(OR(ModelNo=\"0901\",ModelNo=\"09A1\",ModelNo=\"09B1\",ModelNo=\"09L1\"),12,\"\")","v":""},"0901","Top Balance Size",{"$f":"IF(TOP_TUBE=0,\"N/A\",TOP_TUBE)","v":{"$error":"#N/A"}}]
[{"$f":"IF(OR(ModelNo=\"0901\",ModelNo=\"09A1\",ModelNo=\"09B1\",ModelNo=\"09L1\"),13,\"\")","v":""},"0901","Bottom Sash Weight",{"$f":"BTM_WGT&\" \"&\"lb\"","v":{"$error":"#N/A"}}]
[{"$f":"IF(OR(ModelNo=\"0901\",ModelNo=\"09A1\",ModelNo=\"09B1\",ModelNo=\"09L1\"),14,\"\")","v":""},"0901","Bottom Balance Size",{"$f":"IF(BTM_TUBE=0,\"N/A\",BTM_TUBE)","v":{"$error":"#N/A"}}]
[{"$f":"IF(OR(ModelNo=\"0901\",ModelNo=\"09A1\",ModelNo=\"09B1\",ModelNo=\"09L1\"),15,\"\")","v":""},"0901","Egress Opening Width",{"$f":"EW","v":{"$error":"#N/A"}}]
[{"$f":"IF(OR(ModelNo=\"0901\",ModelNo=\"09A1\",ModelNo=\"09B1\",ModelNo=\"09L1\"),16,\"\")","v":""},"0901","Egress Opening Height",{"$f":"EH","v":{"$error":"#N/A"}}]
[{"$f":"IF(OR(ModelNo=\"0901\",ModelNo=\"09A1\",ModelNo=\"09B1\",ModelNo=\"09L1\"),17,\"\")","v":""},"0901","Egress Opening Area (sq.ft.)",{"$f":"EO","v":{"$error":"#N/A"}}]
[{"$f":"IF(OR(ModelNo=\"0902\",ModelNo=\"09A2\",ModelNo=\"09B2\",ModelNo=\"09L2\"),1,\"\")","v":""},"0902","Sash Width",{"$f":"(Frame_Width/2)-0.375","v":-0.375}]
[{"$f":"IF(OR(ModelNo=\"0902\",ModelNo=\"09A2\",ModelNo=\"09B2\",ModelNo=\"09L2\"),2,\"\")","v":""},"0902","Sash Height",{"$f":"Frame_Height-3.4375","v":-3.4375}]
[{"$f":"IF(OR(ModelNo=\"0902\",ModelNo=\"09A2\",ModelNo=\"09B2\",ModelNo=\"09L2\"),3,\"\")","v":""},"0902","Roller Track Length",{"$f":"Frame_Width-2.25","v":-2.25}]
[{"$f":"IF(OR(ModelNo=\"0902\",ModelNo=\"09A2\",ModelNo=\"09B2\",ModelNo=\"09L2\"),4,\"\")","v":""},"0902","Glass Width",{"$f":"INT((Frame_Width/2-2.75)*16+0.5)/16","v":-2.75}]
[{"$f":"IF(OR(ModelNo=\"0902\",ModelNo=\"09A2\",ModelNo=\"09B2\",ModelNo=\"09L2\"),5,\"\")","v":""},"0902","Glass Height",{"$f":"TRUNC((Frame_Height-5.5625)*16+0.5)/16","v":-5.5}]
[{"$f":"IF(OR(ModelNo=\"0902\",ModelNo=\"09A2\",ModelNo=\"09B2\",ModelNo=\"09L2\"),6,\"\")","v":""},"0902","Screen Width",{"$f":"IF(Screen=\"F\",Frame_Width-2.75,IF(Screen=\"H\",(Frame_Width/2)-1.6875,\"N/A\"))","v":-1.6875}]
[{"$f":"IF(OR(ModelNo=\"0902\",ModelNo=\"09A2\",ModelNo=\"09B2\",ModelNo=\"09L2\"),7,\"\")","v":""},"0902","Screen Height",{"$f":"Frame_Height-3.75","v":-3.75}]
[{"$f":"IF(OR(ModelNo=\"0902\",ModelNo=\"09A2\",ModelNo=\"09B2\",ModelNo=\"09L2\"),8,\"\")","v":""},"0902","Egress Opening Width",{"$f":"(Frame_Width/2)-4.25","v":-4.25}]
[{"$f":"IF(OR(ModelNo=\"0902\",ModelNo=\"09A2\",ModelNo=\"09B2\",ModelNo=\"09L2\"),9,\"\")","v":""},"0902","Egress Opening Height",{"$f":"Frame_Height-4.1875","v":-4.1875}]
[{"$f":"IF(OR(ModelNo=\"0902\",ModelNo=\"09A2\",ModelNo=\"09B2\",ModelNo=\"09L2\"),10,\"\")","v":""},"0902","Egress Opening Area (sq.ft.)",{"$f":"(D543*D544)/144","v":0.12358940972222222}]
[{"$f":"IF(OR(ModelNo=\"0903\",ModelNo=\"09A3\",ModelNo=\"09B3\",ModelNo=\"09L3\"),1,\"\")","v":""},"0903","Operating Sash Width",{"$f":"(IF(4*Frame_Width-TRUNC(4*Frame_Width)=0,INT(((Frame_Width-7.75)/4)*16+0.5)/16,INT(((Frame_Width-7.875)/4)*16+0.5)/16))+2.375","v":0.4375}]
[{"$f":"IF(OR(ModelNo=\"0903\",ModelNo=\"09A3\",ModelNo=\"09B3\",ModelNo=\"09L3\"),2,\"\")","v":""},"0903","Operating Sash Height",{"$f":"Frame_Height-3.4375","v":-3.4375}]
[{"$f":"IF(OR(ModelNo=\"0903\",ModelNo=\"09A3\",ModelNo=\"09B3\",ModelNo=\"09L3\"),3,\"\")","v":""},"0903","Fixed Sash Width",{"$f":"(Frame_Width/2)+0.125","v":0.125}]
[{"$f":"IF(OR(ModelNo=\"0903\",ModelNo=\"09A3\",ModelNo=\"09B3\",ModelNo=\"09L3\"),4,\"\")","v":""},"0903","Fixed Sash Height",{"$f":"Frame_Height-3.4375","v":-3.4375}]
[{"$f":"IF(OR(ModelNo=\"0903\",ModelNo=\"09A3\",ModelNo=\"09B3\",ModelNo=\"09L3\"),5,\"\")","v":""},"0903","Roller Track Length",{"$f":"Frame_Width-2.25","v":-2.25}]
[{"$f":"IF(OR(ModelNo=\"0903\",ModelNo=\"09A3\",ModelNo=\"09B3\",ModelNo=\"09L3\"),6,\"\")","v":""},"0903","Operating Sash Glass Width",{"$f":"IF(4*Frame_Width-TRUNC(4*Frame_Width)=0,INT(((Frame_Width-7.75)/4)*16+0.5)/16,INT(((Frame_Width-7.875)/4)*16+0.5)/16)","v":-1.9375}]
[{"$f":"IF(OR(ModelNo=\"0903\",ModelNo=\"09A3\",ModelNo=\"09B3\",ModelNo=\"09L3\"),7,\"\")","v":""},"0903","Operating Sash Glass Height",{"$f":"TRUNC((Frame_Height-5.5625)*16+0.5)/16","v":-5.5}]
[{"$f":"IF(OR(ModelNo=\"0903\",ModelNo=\"09A3\",ModelNo=\"09B3\",ModelNo=\"09L3\"),8,\"\")","v":""},"0903","Fixed Sash Glass Width",{"$f":"TRUNC(((Frame_Width/2-2.25))*16+0.5)/16","v":-2.1875}]
[{"$f":"IF(OR(ModelNo=\"0903\",ModelNo=\"09A3\",ModelNo=\"09B3\",ModelNo=\"09L3\"),9,\"\")","v":""},"0903","Fixed Sash Glass Height",{"$f":"TRUNC((Frame_Height-5.5625)*16+0.5)/16","v":-5.5}]
[{"$f":"IF(OR(ModelNo=\"0903\",ModelNo=\"09A3\",ModelNo=\"09B3\",ModelNo=\"09L3\"),10,\"\")","v":""},"0903","Screen Width",{"$f":"IF(Screen=\"F\",Frame_Width-2,IF(Screen=\"H\",(Frame_Width/4)-0.875,\"N/A\"))","v":-0.875}]
[{"$f":"IF(OR(ModelNo=\"0903\",ModelNo=\"09A3\",ModelNo=\"09B3\",ModelNo=\"09L3\"),11,\"\")","v":""},"0903","Screen Height",{"$f":"Frame_Height-3.75","v":-3.75}]
[{"$f":"IF(OR(ModelNo=\"0903\",ModelNo=\"09A3\",ModelNo=\"09B3\",ModelNo=\"09L3\"),12,\"\")","v":""},"0903","Egress Opening Width",{"$f":"TRUNC(((Frame_Width/4)-3.5)*16)/16","v":-3.5}]
[{"$f":"IF(OR(ModelNo=\"0903\",ModelNo=\"09A3\",ModelNo=\"09B3\",ModelNo=\"09L3\"),13,\"\")","v":""},"0903","Egress Opening Height",{"$f":"Frame_Height-4.25","v":-4.25}]
[{"$f":"IF(OR(ModelNo=\"0903\",ModelNo=\"09A3\",ModelNo=\"09B3\",ModelNo=\"09L3\"),14,\"\")","v":""},"0903","Egress Opening Area (sq.ft.)",{"$f":"(D557*D558)/144","v":0.1032986111111111}]
[{"$f":"IF(OR(ModelNo=\"0907\",ModelNo=\"09A7\",ModelNo=\"09B7\"),1,\"\")","v":""},"0907","Sash Width",{"$f":"Frame_Width-3.1875","v":-3.1875}]
[{"$f":"IF(OR(ModelNo=\"0907\",ModelNo=\"09A7\",ModelNo=\"09B7\"),2,\"\")","v":""},"0907","Sash Height",{"$f":"Frame_Height-2.5625","v":-2.5625}]
[{"$f":"IF(OR(ModelNo=\"0907\",ModelNo=\"09A7\",ModelNo=\"09B7\"),3,\"\")","v":""},"0907","Glass Width",{"$f":"TRUNC((Frame_Width-4.875)*16+0.5)/16","v":-4.8125}]
[{"$f":"IF(OR(ModelNo=\"0907\",ModelNo=\"09A7\",ModelNo=\"09B7\"),4,\"\")","v":""},"0907","Glass Height",{"$f":"TRUNC((Frame_Height-4.9375)*16+0.5)/16","v":-4.875}]
[{"$f":"IF(OR(ModelNo=\"0907\",ModelNo=\"09A7\",ModelNo=\"09B7\"),5,\"\")","v":""},"0907","Glass Area (sq.ft.)",{"$f":"(D562*D563)/144","v":0.16292317708333334}]
[{"$f":"IF(OR(ModelNo=\"0907\",ModelNo=\"09A7\",ModelNo=\"09B7\"),6,\"\")","v":""},"0907","Screen Width",{"$f":"Frame_Width-3.5625","v":-3.5625}]
[{"$f":"IF(OR(ModelNo=\"0907\",ModelNo=\"09A7\",ModelNo=\"09B7\"),7,\"\")","v":""},"0907","Screen Height",{"$f":"Frame_Height-2","v":-2}]
[{"$f":"IF(OR(ModelNo=\"0907\",ModelNo=\"09A7\",ModelNo=\"09B7\"),8,\"\")","v":""},"0907","Hopper Does not Meet Egress"]
[{"$f":"IF(OR(ModelNo=\"0909\",ModelNo=\"09A9\",ModelNo=\"09B9\",ModelNo=\"09L9\"),1,\"\")","v":""},"0909","Operating Sash Width",{"$f":"(IF(4*Frame_Width-TRUNC(4*Frame_Width)=0,TRUNC(((Frame_Width-6.125)/3)*16+0.5)/16,TRUNC(((Frame_Width-6)/3)*16+0.5)/16))+2.375","v":0.375}]
[{"$f":"IF(OR(ModelNo=\"0909\",ModelNo=\"09A9\",ModelNo=\"09B9\",ModelNo=\"09L9\"),2,\"\")","v":""},"0909","Operating Sash Height",{"$f":"Frame_Height-3.4375","v":-3.4375}]
[{"$f":"IF(OR(ModelNo=\"0909\",ModelNo=\"09A9\",ModelNo=\"09B9\",ModelNo=\"09L9\"),3,\"\")","v":""},"0909","Fixed Sash Width",{"$f":"(IF(4*Frame_Width-TRUNC(4*Frame_Width)=0,TRUNC(((Frame_Width-6.125)/3)*16+0.5)/16,TRUNC(((Frame_Width-6)/3)*16+0.5)/16))+2.375","v":0.375}]
[{"$f":"IF(OR(ModelNo=\"0909\",ModelNo=\"09A9\",ModelNo=\"09B9\",ModelNo=\"09L9\"),4,\"\")","v":""},"0909","Fixed Sash Height",{"$f":"Frame_Height-3.4375","v":-3.4375}]
[{"$f":"IF(OR(ModelNo=\"0909\",ModelNo=\"09A9\",ModelNo=\"09B9\",ModelNo=\"09L9\"),5,\"\")","v":""},"0909","Roller Track Length",{"$f":"Frame_Width-2.25","v":-2.25}]
[{"$f":"IF(OR(ModelNo=\"0909\",ModelNo=\"09A9\",ModelNo=\"09B9\",ModelNo=\"09L9\"),6,\"\")","v":""},"0909","Operating Sash Glass Width",{"$f":"IF(4*Frame_Width-TRUNC(4*Frame_Width)=0,TRUNC(((Frame_Width-6.125)/3)*16+0.5)/16,TRUNC(((Frame_Width-6)/3)*16+0.5)/16)","v":-2}]
[{"$f":"IF(OR(ModelNo=\"0909\",ModelNo=\"09A9\",ModelNo=\"09B9\",ModelNo=\"09L9\"),7,\"\")","v":""},"0909","Operating Sash Glass Height",{"$f":"TRUNC((Frame_Height-5.5625)*16+0.5)/16","v":-5.5}]
[{"$f":"IF(OR(ModelNo=\"0909\",ModelNo=\"09A9\",ModelNo=\"09B9\",ModelNo=\"09L9\"),8,\"\")","v":""},"0909","Fixed Sash Glass Width",{"$f":"IF(4*Frame_Width-TRUNC(4*Frame_Width)=0,TRUNC(((Frame_Width-6.125)/3)*16+0.5)/16,TRUNC(((Frame_Width-6)/3)*16+0.5)/16)","v":-2}]
[{"$f":"IF(OR(ModelNo=\"0909\",ModelNo=\"09A9\",ModelNo=\"09B9\",ModelNo=\"09L9\"),9,\"\")","v":""},"0909","Fixed Sash Glass Height",{"$f":"TRUNC((Frame_Height-5.5625)*16+0.5)/16","v":-5.5}]
[{"$f":"IF(OR(ModelNo=\"0909\",ModelNo=\"09A9\",ModelNo=\"09B9\",ModelNo=\"09L9\"),10,\"\")","v":""},"0909","Screen Width",{"$f":"IF(Screen=\"F\",Frame_Width-2,IF(Screen=\"H\",(IF(4*Frame_Width-TRUNC(4*Frame_Width)=0,TRUNC(((Frame_Width-6.125)/3)*16+0.5)/16,TRUNC(((Frame_Width-6)/3)*16+0.5)/16))+1.75,\"N/A\"))","v":-0.25}]
[{"$f":"IF(OR(ModelNo=\"0909\",ModelNo=\"09A9\",ModelNo=\"09B9\",ModelNo=\"09L9\"),11,\"\")","v":""},"0909","Screen Height",{"$f":"Frame_Height-3.75","v":-3.75}]
[{"$f":"IF(OR(ModelNo=\"0909\",ModelNo=\"09A9\",ModelNo=\"09B9\",ModelNo=\"09L9\"),12,\"\")","v":""},"0909","Egress Opening Width",{"$f":"TRUNC(((Frame_Width/3)-3.639)*16)/16","v":-3.625}]
[{"$f":"IF(OR(ModelNo=\"0909\",ModelNo=\"09A9\",ModelNo=\"09B9\",ModelNo=\"09L9\"),13,\"\")","v":""},"0909","Egress Opening Height",{"$f":"Frame_Height-4.25","v":-4.25}]
[{"$f":"IF(OR(ModelNo=\"0909\",ModelNo=\"09A9\",ModelNo=\"09B9\",ModelNo=\"09L9\"),14,\"\")","v":""},"0909","Egress Opening Area (sq.ft.)",{"$f":"(D579*D580)/144","v":0.10698784722222222}]
[{"$f":"IF(OR(ModelNo=\"0914\",ModelNo=\"09L4\"),1,\"\")","v":""},"0914","Glass Width",{"$f":"TRUNC((Frame_Width-2.8125)*16+0.5)/16","v":-2.75}]
[{"$f":"IF(OR(ModelNo=\"0914\",ModelNo=\"09L4\"),2,\"\")","v":""},"0914","Glass Height",{"$f":"TRUNC((Frame_Height-2.8125)*16+0.5)/16","v":-2.75}]
[{"$f":"IF(OR(ModelNo=\"0914\",ModelNo=\"09L4\"),3,\"\")","v":""},"0914","Glass Area (sq.ft.)",{"$f":"(D582*D583)/144","v":5.2517361111111112E-2}]
[{"$f":"IF(ModelNo=B585,1,\"\")","v":""},"3100","Bottom Sash Width",{"$f":"TRUNC((Frame_Width-2.14315)*32+0.5)/32","v":-2.125}]
[{"$f":"IF(ModelNo=B586,2,\"\")","v":""},"3100","Bottom Sash Height",{"$f":"TRUNC(((CMR!$E$75-0.375)*32+0.5))/32","v":-0.34375}]
[{"$f":"IF(ModelNo=B587,3,\"\")","v":""},"3100","Bottom Glass Width",{"$f":"CMR!$E$78","v":-4.75}]
[{"$f":"IF(ModelNo=B588,4,\"\")","v":""},"3100","Bottom Glass Height",{"$f":"CMR!$E$80","v":-2.96875}]
[{"$f":"IF(ModelNo=B589,5,\"\")","v":""},"3100","Top Glass Width",{"$f":"CMR!$E$77","v":-4}]
[{"$f":"IF(ModelNo=B590,6,\"\")","v":""},"3100","Top Glass Height",{"$f":"CMR!$E$79","v":-3.03125}]
[{"$f":"IF(ModelNo=B591,7,\"\")","v":""},"3100","Astragal Length",{"$f":"Frame_Width-2.6875","v":-2.6875}]
[{"$f":"IF(ModelNo=B592,8,\"\")","v":""},"3100","Screen Width",{"$f":"Frame_Width-4.25","v":-4.25}]
[{"$f":"IF(ModelNo=B593,9,\"\")","v":""},"3100","Screen Height",{"$f":"CMR!$E$75-2.125","v":-2.125}]
[{"$f":"IF(ModelNo=B594,10,\"\")","v":""},"3100","Bottom Sash Weight",{"$f":"BTM_WGT&\" \"&\"lb\"","v":{"$error":"#N/A"}}]
[{"$f":"IF(ModelNo=B595,11,\"\")","v":""},"3100","Balance Size",{"$f":"IF(ISERROR((VLOOKUP(BTM_WGT,CURVE,2,FALSE))&(VLOOKUP(BTM_WGT,CURVE,3,FALSE))),\"N/A\",(VLOOKUP(BTM_WGT,CURVE,2,FALSE))&(VLOOKUP(BTM_WGT,CURVE,3,FALSE)))","v":"N/A"}]
[{"$f":"IF(ModelNo=B596,12,\"\")","v":""},"3100","Egress Opening Width",{"$f":"EW","v":{"$error":"#N/A"}}]
[{"$f":"IF(ModelNo=B597,13,\"\")","v":""},"3100","Egress Opening Height",{"$f":"EH","v":{"$error":"#N/A"}}]
[{"$f":"IF(ModelNo=B598,14,\"\")","v":""},"3100","Egress Opening Area (sq.ft.)",{"$f":"EO","v":{"$error":"#N/A"}}]
[{"$f":"IF(ModelNo=B599,1,\"\")","v":""},"3102","Sash Width",{"$f":"TRUNC((CMR!$E$85-0.7)*16+0.5)/16","v":-0.625}]
[{"$f":"IF(ModelNo=B600,2,\"\")","v":""},"3102","Sash Height",{"$f":"TRUNC((Frame_Height-3.4)*16+0.5)/16","v":-3.3125}]
[{"$f":"IF(ModelNo=B601,3,\"\")","v":""},"3102","Sash Glass Width",{"$f":"CMR!$E$88","v":-2.25}]
[{"$f":"IF(ModelNo=B602,4,\"\")","v":""},"3102","Sash Glass Height",{"$f":"CMR!$E$90","v":-4.9375}]
[{"$f":"IF(ModelNo=B603,5,\"\")","v":""},"3102","Fixed Glass Width",{"$f":"CMR!$E$87","v":-3.09375}]
[{"$f":"IF(ModelNo=B604,6,\"\")","v":""},"3102","Fixed Glass Height",{"$f":"CMR!$E$89","v":-5.09375}]
[{"$f":"IF(ModelNo=B605,7,\"\")","v":""},"3102","Astragal Length",{"$f":"Frame_Height-4.5625","v":-4.5625}]
[{"$f":"IF(ModelNo=B606,8,\"\")","v":""},"3102","Roller Track Length",{"$f":"Frame_Width-1.8125","v":-1.8125}]
[{"$f":"IF(ModelNo=B607,9,\"\")","v":""},"3102","Screen Width",{"$f":"CMR!$E$85-3.4375","v":-3.4375}]
[{"$f":"IF(ModelNo=B608,10,\"\")","v":""},"3102","Screen Height",{"$f":"Frame_Height-5.375","v":-5.375}]
[{"$f":"IF(ModelNo=B609,11,\"\")","v":""},"3102","Egress Opening Width",{"$f":"TRUNC(((Frame_Width/2)-4.8125)*32+0.5)/32","v":-4.78125}]
[{"$f":"IF(ModelNo=B610,12,\"\")","v":""},"3102","Egress Opening Height",{"$f":"TRUNC((Frame_Height-6)*32+0.5)/32","v":-5.96875}]
[{"$f":"IF(ModelNo=B611,13,\"\")","v":""},"3102","Egress Opening Area (sq.ft.)",{"$f":"(D609*D610)/144","v":0.19818115234375}]
[{"$f":"IF(ModelNo=B612,1,\"\")","v":""},"3104","Glass Width",{"$f":"Frame_Width-4.28125","v":-4.28125}]
[{"$f":"IF(ModelNo=B613,2,\"\")","v":""},"3104","Glass Height",{"$f":"Frame_Height-4.28125","v":-4.28125}]
[{"$f":"IF(ModelNo=B614,3,\"\")","v":""},"3104","Glass Area (sq.ft.)",{"$f":"(D612*D613)/144","v":0.1272854275173611}]
[{"$f":"IF(ModelNo=B615,1,\"\")","v":""},"3109","Operating Sash Width",{"$f":"TRUNC((((Frame_Width/3)+0.5781)-1.2587)*16+0.5)/16","v":-0.625}]
[{"$f":"IF(ModelNo=B616,2,\"\")","v":""},"3109","Operating Sash Height",{"$f":"TRUNC((Frame_Height-3.46875)*16+0.5)/16","v":-3.4375}]
[{"$f":"IF(ModelNo=B617,3,\"\")","v":""},"3109","Astragal Length",{"$f":"Frame_Height-4.5625","v":-4.5625}]
[{"$f":"IF(ModelNo=B618,4,\"\")","v":""},"3109","Roller Track Length",{"$f":"Frame_Width-1.8125","v":-1.8125}]
[{"$f":"IF(ModelNo=B619,5,\"\")","v":""},"3109","Sash Glass Width",{"$f":"TRUNC((D615-1.625)*16+0.5)/16","v":-2.1875}]
[{"$f":"IF(ModelNo=B620,6,\"\")","v":""},"3109","Sash Glass Height",{"$f":"D616-1.625","v":-5.0625}]
[{"$f":"IF(ModelNo=B621,7,\"\")","v":""},"3109","Fixed Glass Width",{"$f":"TRUNC(((Frame_Width-(((Frame_Width/3)+0.5781)*2))-1.1476)*16+0.5)/16","v":-2.25}]
[{"$f":"IF(ModelNo=B622,8,\"\")","v":""},"3109","Fixed Glass Height",{"$f":"TRUNC((Frame_Height-5.09375)*16+0.5)/16","v":-5.0625}]
[{"$f":"IF(ModelNo=B623,9,\"\")","v":""},"3109","Screen Width",{"$f":"TRUNC((((Frame_Width/3)+0.5781)-3.3275)*16+0.5)/16","v":-2.6875}]
[{"$f":"IF(ModelNo=B624,10,\"\")","v":""},"3109","Screen Height",{"$f":"Frame_Height-5.375","v":-5.375}]
[{"$f":"IF(ModelNo=B625,11,\"\")","v":""},"3109","Egress Opening Width",{"$f":"TRUNC(((Frame_Width/3)-3.25)*32+0.5)/32","v":-3.21875}]
[{"$f":"IF(ModelNo=B626,12,\"\")","v":""},"3109","Egress Opening Height",{"$f":"TRUNC((Frame_Height-6)*32+0.5)/32","v":-5.96875}]
[{"$f":"IF(ModelNo=B627,13,\"\")","v":""},"3109","Egress Opening Area (sq.ft.)",{"$f":"(D625*D626)/144","v":0.13341606987847221}]
[{"$f":"IF(ModelNo=B628,1,\"\")","v":""},"i201","Top Sash Width",{"$f":"Frame_Width-3.25","v":-3.25}]
[{"$f":"IF(ModelNo=B629,2,\"\")","v":""},"i201","Top Sash Height",{"$f":"CMR!$E$26-1.5625","v":-1.5625}]
[{"$f":"IF(ModelNo=B630,3,\"\")","v":""},"i201","Bottom Sash Width",{"$f":"Frame_Width-2.25","v":-2.25}]
[{"$f":"IF(ModelNo=B631,4,\"\")","v":""},"i201","Bottom Sash Height",{"$f":"CMR!$E$27-0.5625","v":-0.5625}]
[{"$f":"IF(ModelNo=B632,5,\"\")","v":""},"i201","Top Glass Width",{"$f":"CMR!$E$29","v":-4.875}]
[{"$f":"IF(ModelNo=B633,6,\"\")","v":""},"i201","Top Glass Height",{"$f":"CMR!$E$31","v":-3.15625}]
[{"$f":"IF(ModelNo=B634,7,\"\")","v":""},"i201","Bottom Glass Width",{"$f":"CMR!$E$30","v":-3.875}]
[{"$f":"IF(ModelNo=B635,8,\"\")","v":""},"i201","Bottom Glass Height",{"$f":"CMR!$E$32","v":-2.15625}]
[{"$f":"IF(ModelNo=B636,9,\"\")","v":""},"i201","Screen Width",{"$f":"IF(Screen=\"L\",Frame_Width-1.6875,Frame_Width-3.6875)","v":-3.6875}]
[{"$f":"IF(ModelNo=B637,10,\"\")","v":""},"i201","Screen Height",{"$f":"IF(Screen=\"L\",TRUNC((CMR!$E$27-1.375)*16+0.5)/16,IF(Screen=\"F\",TRUNC((Frame_Height-2.875)*16+0.5)/16,TRUNC((CMR!$E$27-0.3125)*16+0.5)/16))","v":-0.25}]
[{"$f":"IF(ModelNo=B638,11,\"\")","v":""},"i201","Top Sash Weight (Plus 5 lb)",{"$f":"TOP_WGT&\" \"&\"lb\"","v":{"$error":"#N/A"}}]
[{"$f":"IF(ModelNo=B639,12,\"\")","v":""},"i201","Top Balance Size",{"$f":"IF(ISERROR((VLOOKUP(TOP_WGT,CURVE,2,FALSE))&(VLOOKUP(TOP_WGT,CURVE,3,FALSE))),\"N/A\",(VLOOKUP(TOP_WGT,CURVE,2,FALSE))&(VLOOKUP(TOP_WGT,CURVE,3,FALSE)))","v":"N/A"}]
[{"$f":"IF(ModelNo=B640,13,\"\")","v":""},"i201","Bottom Sash Weight",{"$f":"BTM_WGT&\" \"&\"lb\"","v":{"$error":"#N/A"}}]
[{"$f":"IF(ModelNo=B641,14,\"\")","v":""},"i201","Bottom Balance Size",{"$f":"IF(ISERROR((VLOOKUP(BTM_WGT,CURVE,2,FALSE))&(VLOOKUP(BTM_WGT,CURVE,3,FALSE))),\"N/A\",(VLOOKUP(BTM_WGT,CURVE,2,FALSE))&(VLOOKUP(BTM_WGT,CURVE,3,FALSE)))","v":"N/A"}]
[{"$f":"IF(ModelNo=B642,15,\"\")","v":""},"i201","Egress Opening Width",{"$f":"EW","v":{"$error":"#N/A"}}]
[{"$f":"IF(ModelNo=B643,16,\"\")","v":""},"i201","Egress Opening Height",{"$f":"EH","v":{"$error":"#N/A"}}]
[{"$f":"IF(ModelNo=B644,17,\"\")","v":""},"i201","Egress Opening Area (sq.ft.)",{"$f":"EO","v":{"$error":"#N/A"}}]
[{"$f":"IF(OR(ModelNo=\"S140\",ModelNo=\"S144\",ModelNo=\"S146\",ModelNo=\"S140 (HP)\",ModelNo=\"S144 (HP)\",ModelNo=\"S146 (HP)\"),1,\"\")","v":""},"S140","Frame Radius",{"$f":"IF(ModelNo=\"S146\",((Frame_Height-LEG)/2)+(((Frame_Width*2)^2)/(8*(Frame_Height-LEG))),((Frame_Height-LEG)/2)+((Frame_Width^2)/(8*(Frame_Height-LEG))))","v":{"$error":"#DIV/0!"}}]
[{"$f":"IF(OR(ModelNo=\"S140\",ModelNo=\"S144\",ModelNo=\"S146\",ModelNo=\"S140 (HP)\",ModelNo=\"S144 (HP)\",ModelNo=\"S146 (HP)\"),2,\"\")","v":""},"S140","Bottom Sash Width",{"$f":"BSW_S140","v":{"$error":"#N/A"}}]
[{"$f":"IF(OR(ModelNo=\"S140\",ModelNo=\"S144\",ModelNo=\"S146\",ModelNo=\"S140 (HP)\",ModelNo=\"S144 (HP)\",ModelNo=\"S146 (HP)\"),3,\"\")","v":""},"S140","Bottom Sash Height",{"$f":"BSH_S140","v":{"$error":"#N/A"}}]
[{"$f":"IF(OR(ModelNo=\"S140\",ModelNo=\"S144\",ModelNo=\"S146\",ModelNo=\"S140 (HP)\",ModelNo=\"S144 (HP)\",ModelNo=\"S146 (HP)\"),4,\"\")","v":""},"S140","Bottom Glass Width",{"$f":"BGW_S140","v":{"$error":"#N/A"}}]
[{"$f":"IF(OR(ModelNo=\"S140\",ModelNo=\"S144\",ModelNo=\"S146\",ModelNo=\"S140 (HP)\",ModelNo=\"S144 (HP)\",ModelNo=\"S146 (HP)\"),5,\"\")","v":""},"S140","Bottom Glass Height",{"$f":"BGH_S140","v":{"$error":"#N/A"}}]
[{"$f":"IF(OR(ModelNo=\"S140\",ModelNo=\"S144\",ModelNo=\"S146\",ModelNo=\"S140 (HP)\",ModelNo=\"S144 (HP)\",ModelNo=\"S146 (HP)\"),6,\"\")","v":""},"S140","Top Glass Radius",{"$f":"CMR!$N$13","v":{"$error":"#DIV/0!"}}]
[{"$f":"IF(OR(ModelNo=\"S140\",ModelNo=\"S144\",ModelNo=\"S146\",ModelNo=\"S140 (HP)\",ModelNo=\"S144 (HP)\",ModelNo=\"S146 (HP)\"),7,\"\")","v":""},"S140","Top Glass Width",{"$f":"Frame_Width-(2*EXT)","v":0}]
[{"$f":"IF(OR(ModelNo=\"S140\",ModelNo=\"S144\",ModelNo=\"S146\",ModelNo=\"S140 (HP)\",ModelNo=\"S144 (HP)\",ModelNo=\"S146 (HP)\"),8,\"\")","v":""},"S140","Top Glass Height",{"$f":"CMR!$L$15","v":-0.51370000000000005}]
[{"$f":"IF(OR(ModelNo=\"S140\",ModelNo=\"S144\",ModelNo=\"S146\",ModelNo=\"S140 (HP)\",ModelNo=\"S144 (HP)\",ModelNo=\"S146 (HP)\"),9,\"\")","v":""},"S140","Top Glass Leg Height",{"$f":"CMR!$N$16","v":{"$error":"#DIV/0!"}}]
[{"$f":"IF(OR(ModelNo=\"S140\",ModelNo=\"S144\",ModelNo=\"S146\",ModelNo=\"S140 (HP)\",ModelNo=\"S144 (HP)\",ModelNo=\"S146 (HP)\"),10,\"\")","v":""},"S140","Astragal Length",{"$f":"IF(EXTSELECT=8,TRUNC((Frame_Width-2.875)*16+0.5)/16,IF(EXTSELECT=7,TRUNC((Frame_Width-2.95)*16+0.5)/16,IF(EXTSELECT=6,TRUNC((Frame_Width-2.868)*16+0.5)/16,IF(OR(EXTSELECT=4,EXTSELECT=5),TRUNC((Frame_Width-1.218)*16+0.5)/16,TRUNC((Frame_Width-4.125)*16+0.5)/16))))","v":-4.0625}]
[{"$f":"IF(OR(ModelNo=\"S140\",ModelNo=\"S144\",ModelNo=\"S146\",ModelNo=\"S140 (HP)\",ModelNo=\"S144 (HP)\",ModelNo=\"S146 (HP)\"),11,\"\")","v":""},"S140","Screen Width",{"$f":"IF(OR(EXTSELECT=7,EXTSELECT=8),Frame_Width-3.3125,IF(OR(EXTSELECT=4,EXTSELECT=5),Frame_Width-1.75,IF(EXTSELECT=6,Frame_Width-3.6875,Frame_Width-4.5)))","v":-4.5}]
[{"$f":"IF(OR(ModelNo=\"S140\",ModelNo=\"S144\",ModelNo=\"S146\",ModelNo=\"S140 (HP)\",ModelNo=\"S144 (HP)\",ModelNo=\"S146 (HP)\"),12,\"\")","v":""},"S140","Screen Height",{"$f":"IF(OR(EXTSELECT=2,EXTSELECT=3),CDIMS140-1.3125,IF(EXTSELECT=6,CDIMS140-0.75,IF(EXTSELECT=7,CDIMS140-1.46875,IF(EXTSELECT=8,CDIMS140-1.75,CDIMS140-1.1875))))","v":-1.1875}]
[{"$f":"IF(OR(ModelNo=\"S140\",ModelNo=\"S144\",ModelNo=\"S146\",ModelNo=\"S140 (HP)\",ModelNo=\"S144 (HP)\",ModelNo=\"S146 (HP)\"),13,\"\")","v":""},"S140","Bottom Sash Weight",{"$f":"IF(ISERROR(BTM_WGT&\" \"&\"lb\"),\"N/A\",BTM_WGT&\" \"&\"lb\")","v":"N/A"}]
[{"$f":"IF(OR(ModelNo=\"S140\",ModelNo=\"S144\",ModelNo=\"S146\",ModelNo=\"S140 (HP)\",ModelNo=\"S144 (HP)\",ModelNo=\"S146 (HP)\"),14,\"\")","v":""},"S140","Balance Size",{"$f":"IF(ISERROR((VLOOKUP(BTM_WGT,CFB,2,FALSE))&(VLOOKUP(BTM_WGT,CFB,3,FALSE))),\"N/A\",(VLOOKUP(BTM_WGT,CFB,2,FALSE))&(VLOOKUP(BTM_WGT,CFB,3,FALSE)))","v":"N/A"}]
[{"$f":"IF(OR(ModelNo=\"S140\",ModelNo=\"S144\",ModelNo=\"S146\",ModelNo=\"S140 (HP)\",ModelNo=\"S144 (HP)\",ModelNo=\"S146 (HP)\"),15,\"\")","v":""},"S140","Egress Opening Width",{"$f":"IF(ISERROR(EW),\"N/A\",EW)","v":"N/A"}]
[{"$f":"IF(OR(ModelNo=\"S140\",ModelNo=\"S144\",ModelNo=\"S146\",ModelNo=\"S140 (HP)\",ModelNo=\"S144 (HP)\",ModelNo=\"S146 (HP)\"),16,\"\")","v":""},"S140","Egress Opening Height",{"$f":"IF(ISERROR(EH),\"N/A\",EH)","v":"N/A"}]
[{"$f":"IF(OR(ModelNo=\"S140\",ModelNo=\"S144\",ModelNo=\"S146\",ModelNo=\"S140 (HP)\",ModelNo=\"S144 (HP)\",ModelNo=\"S146 (HP)\"),17,\"\")","v":""},"S140","Egress Opening Area (sq.ft.)",{"$f":"(D659*D660)/144","v":{"$error":"#VALUE!"}}]
[{"$f":"IF(ModelNo=B662,1,\"\")","v":""},"V100","Bottom Sash Width",{"$f":"TRUNC((Frame_Width-2.188)*32+0.5)/32","v":-2.15625}]
[{"$f":"IF(ModelNo=B663,2,\"\")","v":""},"V100","Bottom Sash Height",{"$f":"TRUNC(((V100_CDIM-1.0625)*16+0.5))/16","v":-1}]
[{"$f":"IF(ModelNo=B664,3,\"\")","v":""},"V100","Bottom Glass Width",{"$f":"V100_BGW","v":-3.4375}]
[{"$f":"IF(ModelNo=B665,4,\"\")","v":""},"V100","Bottom Glass Height",{"$f":"V100_BGH","v":-2.28125}]
[{"$f":"IF(ModelNo=B666,5,\"\")","v":""},"V100","Top Glass Width",{"$f":"V100_TGW","v":-3.46875}]
[{"$f":"IF(ModelNo=B667,6,\"\")","v":""},"V100","Top Glass Height",{"$f":"V100_TGH","v":-2.125}]
[{"$f":"IF(ModelNo=B668,7,\"\")","v":""},"V100","Astragal Length",{"$f":"Frame_Width-2.875","v":-2.875}]
[{"$f":"IF(ModelNo=B669,8,\"\")","v":""},"V100","Screen Width",{"$f":"Frame_Width-3.3125","v":-3.3125}]
[{"$f":"IF(ModelNo=B670,9,\"\")","v":""},"V100","Screen Height",{"$f":"TRUNC((V100_CDIM-1.678)*32+0.5)/32-0.0625","v":-1.71875}]
[{"$f":"IF(ModelNo=B671,10,\"\")","v":""},"V100","Bottom Sash Weight",{"$f":"IF(ISERROR(BTM_WGT&\" \"&\"lb\"),\"N/A\",BTM_WGT&\" \"&\"lb\")","v":"N/A"}]
[{"$f":"IF(ModelNo=B672,11,\"\")","v":""},"V100","Balance Size",{"$f":"IF(V_BOTTBALANCE=0,\"N/A\",V_BOTTBALANCE)","v":{"$error":"#N/A"}}]
[{"$f":"IF(ModelNo=B673,12,\"\")","v":""},"V100","Egress Opening Width",{"$f":"IF(ISERROR(EW),\"N/A\",EW)","v":"N/A"}]
[{"$f":"IF(ModelNo=B674,13,\"\")","v":""},"V100","Egress Opening Height",{"$f":"IF(ISERROR(EH),\"N/A\",EH)","v":"N/A"}]
[{"$f":"IF(ModelNo=B675,14,\"\")","v":""},"V100","Egress Opening Area (sq.ft.)",{"$f":"IF(ISERROR(EO),\"N/A\",EO)","v":"N/A"}]
[{"$f":"IF(ModelNo=B676,1,\"\")","v":""},"V101","Top Sash Width",{"$f":"Frame_Width-3.4375","v":-3.4375}]
[{"$f":"IF(ModelNo=B677,2,\"\")","v":""},"V101","Top Sash Height",{"$f":"V101_DDIM-1.5625","v":-1.5625}]
[{"$f":"IF(ModelNo=B678,3,\"\")","v":""},"V101","Bottom Sash Width",{"$f":"Frame_Width-2.1875","v":-2.1875}]
[{"$f":"IF(ModelNo=B679,4,\"\")","v":""},"V101","Bottom Sash Height",{"$f":"V101_CDIM-0.3125","v":-0.3125}]
[{"$f":"IF(ModelNo=B680,5,\"\")","v":""},"V101","Top Glass Width",{"$f":"V101_TGW","v":-4.6875}]
[{"$f":"IF(ModelNo=B681,6,\"\")","v":""},"V101","Top Glass Height",{"$f":"V101_TGH","v":-2.875}]
[{"$f":"IF(ModelNo=B682,7,\"\")","v":""},"V101","Bottom Glass Width",{"$f":"V101_BGW","v":-3.4375}]
[{"$f":"IF(ModelNo=B683,8,\"\")","v":""},"V101","Bottom Glass Height",{"$f":"V101_BGH","v":-1.625}]
[{"$f":"IF(ModelNo=B684,9,\"\")","v":""},"V101","Screen Width",{"$f":"Frame_Width-3.75","v":-3.75}]
[{"$f":"IF(ModelNo=B685,10,\"\")","v":""},"V101","Screen Height",{"$f":"IF(Screen=\"F\",Frame_Height-2.9375,V101_CDIM-0.25)","v":-0.25}]
[{"$f":"IF(ModelNo=B686,11,\"\")","v":""},"V101","Top Sash Weight (Plus 5 lb)",{"$f":"IF(ISERROR(TOP_WGT&\" \"&\"lb\"),\"N/A\",TOP_WGT&\" \"&\"lb\")","v":"N/A"}]
[{"$f":"IF(ModelNo=B687,12,\"\")","v":""},"V101","Top Balance Size",{"$f":"IF(V_TOPBALANCE=0,\"N/A\",V_TOPBALANCE)","v":{"$error":"#N/A"}}]
[{"$f":"IF(ModelNo=B688,13,\"\")","v":""},"V101","Bottom Sash Weight",{"$f":"IF(ISERROR(BTM_WGT&\" \"&\"lb\"),\"N/A\",BTM_WGT&\" \"&\"lb\")","v":"N/A"}]
[{"$f":"IF(ModelNo=B689,14,\"\")","v":""},"V101","Bottom Balance Size",{"$f":"IF(V_BOTTBALANCE=0,\"N/A\",V_BOTTBALANCE)","v":{"$error":"#N/A"}}]
[{"$f":"IF(ModelNo=B690,15,\"\")","v":""},"V101","Egress Opening Width",{"$f":"IF(ISERROR(EW),\"N/A\",EW)","v":"N/A"}]
[{"$f":"IF(ModelNo=B691,16,\"\")","v":""},"V101","Egress Opening Height",{"$f":"IF(ISERROR(EH),\"N/A\",EH)","v":"N/A"}]
[{"$f":"IF(ModelNo=B692,17,\"\")","v":""},"V101","Egress Opening Area (sq.ft.)",{"$f":"IF(ISERROR(EO),\"N/A\",EO)","v":"N/A"}]
[{"$f":"IF(ModelNo=B693,1,\"\")","v":""},"V200","Bottom Sash Width",{"$f":"TRUNC((Frame_Width-2.188)*32+0.5)/32","v":-2.15625}]
[{"$f":"IF(ModelNo=B694,2,\"\")","v":""},"V200","Bottom Sash Height",{"$f":"TRUNC(((V200_CDIM-0.8125)*32+0.5))/32-0.0625","v":-0.84375}]
[{"$f":"IF(ModelNo=B695,3,\"\")","v":""},"V200","Bottom Glass Width",{"$f":"V200_BGW","v":-3.5}]
[{"$f":"IF(ModelNo=B696,4,\"\")","v":""},"V200","Bottom Glass Height",{"$f":"V200_BGH","v":-2.25}]
[{"$f":"IF(ModelNo=B697,5,\"\")","v":""},"V200","Top Glass Width",{"$f":"V200_TGW","v":-3.53125}]
[{"$f":"IF(ModelNo=B698,6,\"\")","v":""},"V200","Top Glass Height",{"$f":"V200_TGH","v":-2.21875}]
[{"$f":"IF(ModelNo=B699,7,\"\")","v":""},"V200","Astragal Length",{"$f":"TRUNC((Frame_Width-2.95)*16+0.5)/16","v":-2.875}]
[{"$f":"IF(ModelNo=B700,8,\"\")","v":""},"V200","Screen Width",{"$f":"Frame_Width-3.5625","v":-3.5625}]
[{"$f":"IF(ModelNo=B701,9,\"\")","v":""},"V200","Screen Height",{"$f":"TRUNC((V200_CDIM-1.4375)*32+0.5)/32","v":-1.40625}]
[{"$f":"IF(ModelNo=B702,10,\"\")","v":""},"V200","Bottom Sash Weight",{"$f":"IF(ISERROR(BTM_WGT&\" \"&\"lb\"),\"N/A\",BTM_WGT&\" \"&\"lb\")","v":"N/A"}]
[{"$f":"IF(ModelNo=B703,11,\"\")","v":""},"V200","Balance Size",{"$f":"IF(V_BOTTBALANCE=0,\"N/A\",V_BOTTBALANCE)","v":{"$error":"#N/A"}}]
[{"$f":"IF(ModelNo=B704,12,\"\")","v":""},"V200","Egress Opening Width",{"$f":"IF(ISERROR(EW),\"N/A\",EW)","v":"N/A"}]
[{"$f":"IF(ModelNo=B705,13,\"\")","v":""},"V200","Egress Opening Height",{"$f":"IF(ISERROR(EH),\"N/A\",EH)","v":"N/A"}]
[{"$f":"IF(ModelNo=B706,14,\"\")","v":""},"V200","Egress Opening Area (sq.ft.)",{"$f":"IF(ISERROR(EO),\"N/A\",EO)","v":"N/A"}]
[{"$f":"IF(ModelNo=B707,1,\"\")","v":""},"V102","Sash Width",{"$f":"(Frame_Width/2)-0.6875","v":-0.6875}]
[{"$f":"IF(ModelNo=B708,2,\"\")","v":""},"V102","Sash Height",{"$f":"Frame_Height-2.1875","v":-2.1875}]
[{"$f":"IF(ModelNo=B709,3,\"\")","v":""},"V102","Sash Glass Width",{"$f":"((Frame_Width/2)-0.6875)-1.375","v":-2.0625}]
[{"$f":"IF(ModelNo=B710,4,\"\")","v":""},"V102","Sash Glass Height",{"$f":"Frame_Height-3.5","v":-3.5}]
[{"$f":"IF(ModelNo=B711,5,\"\")","v":""},"V102","Fixed Glass Width",{"$f":"(Frame_Width/2)-2.0625","v":-2.0625}]
[{"$f":"IF(ModelNo=B712,6,\"\")","v":""},"V102","Fixed Glass Height",{"$f":"Frame_Height-3.5","v":-3.5}]
[{"$f":"IF(ModelNo=B713,7,\"\")","v":""},"V102","Astragal Length",{"$f":"Frame_Height-2.875","v":-2.875}]
[{"$f":"IF(ModelNo=B714,8,\"\")","v":""},"V102","Roller Track Length",{"$f":"Frame_Width-1","v":-1}]
[{"$f":"IF(ModelNo=B715,9,\"\")","v":""},"V102","Screen Width",{"$f":"TRUNC(((Frame_Width/2)-2.5625)*16+0.5)/16","v":-2.5}]
[{"$f":"IF(ModelNo=B716,10,\"\")","v":""},"V102","Screen Height",{"$f":"TRUNC((Frame_Height-3.375)*16+0.5)/16","v":-3.3125}]
[{"$f":"IF(ModelNo=B717,11,\"\")","v":""},"V102","Egress Opening Width",{"$f":"TRUNC(((Frame_Width-D707)-4.5)*32+0.5)/32","v":-3.78125}]
[{"$f":"IF(ModelNo=B718,12,\"\")","v":""},"V102","Egress Opening Height",{"$f":"TRUNC((Frame_Height-6)*32+0.5)/32","v":-5.96875}]
[{"$f":"IF(ModelNo=B719,13,\"\")","v":""},"V102","Egress Opening Area (sq.ft.)",{"$f":"(D717*D718)/144","v":0.15673149956597221}]
[{"$f":"IF(ModelNo=B720,1,\"\")","v":""},"V103","Sash Width",{"$f":"TRUNC((Frame_Width/4+0.219)*16+0.5)/16","v":0.25}]
[{"$f":"IF(ModelNo=B721,2,\"\")","v":""},"V103","Sash Height",{"$f":"TRUNC((Frame_Height-2.1875)*16+0.5)/16","v":-2.125}]
[{"$f":"IF(ModelNo=B722,3,\"\")","v":""},"V103","Sash Glass Width",{"$f":"TRUNC(((TRUNC((Frame_Width/4+0.219)*16+0.5)/16)-1.3125)*16+0.5)/16","v":-1}]
[{"$f":"IF(ModelNo=B723,4,\"\")","v":""},"V103","Sash Glass Height",{"$f":"(TRUNC((Frame_Height-2.1875)*16+0.5)/16)-1.3125","v":-3.4375}]
[{"$f":"IF(ModelNo=B724,5,\"\")","v":""},"V103","Fixed Glass Width",{"$f":"TRUNC((Frame_Width/2-2.219)*16+0.5)/16","v":-2.1875}]
[{"$f":"IF(ModelNo=B725,6,\"\")","v":""},"V103","Fixed Glass Height",{"$f":"TRUNC((Frame_Height-3.5)*16+0.5)/16","v":-3.4375}]
[{"$f":"IF(ModelNo=B726,7,\"\")","v":""},"V103","Astragal Length",{"$f":"Frame_Height-2.875","v":-2.875}]
[{"$f":"IF(ModelNo=B727,8,\"\")","v":""},"V103","Roller Track Length",{"$f":"Frame_Width-0.75","v":-0.75}]
[{"$f":"IF(ModelNo=B728,9,\"\")","v":""},"V103","Screen Width",{"$f":"TRUNC((Frame_Width/4-1.719)*16+0.5)/16","v":-1.6875}]
[{"$f":"IF(ModelNo=B729,10,\"\")","v":""},"V103","Screen Height",{"$f":"Frame_Height-3.375","v":-3.375}]
[{"$f":"IF(ModelNo=B730,11,\"\")","v":""},"V103","Egress Opening Width",{"$f":"TRUNC(((Frame_Width/3)-3.25)*32+0.5)/32","v":-3.21875}]
[{"$f":"IF(ModelNo=B731,12,\"\")","v":""},"V103","Egress Opening Height",{"$f":"TRUNC((Frame_Height-6)*32+0.5)/32","v":-5.96875}]
[{"$f":"IF(ModelNo=B732,13,\"\")","v":""},"V103","Egress Opening Area (sq.ft.)",{"$f":"(D730*D731)/144","v":0.13341606987847221}]
[{"$f":"IF(OR(ModelNo=\"V104\",ModelNo=\"V114\",ModelNo=\"V204\"),1,\"\")","v":""},"V104","Glass Width",{"$f":"Frame_Width-3.5","v":-3.5}]
[{"$f":"IF(OR(ModelNo=\"V104\",ModelNo=\"V114\",ModelNo=\"V204\"),2,\"\")","v":""},"V104","Glass Height",{"$f":"Frame_Height-3.5","v":-3.5}]
[{"$f":"IF(OR(ModelNo=\"V104\",ModelNo=\"V114\",ModelNo=\"V204\"),3,\"\")","v":""},"V104","Glass Area (sq.ft.)",{"$f":"(D733*D734)/144","v":8.5069444444444448E-2}]
[{"$f":"IF(ModelNo=B736,1,\"\")","v":""},"V109","Sash Width",{"$f":"TRUNC((Frame_Width/3-0.188)*16+0.5)/16","v":-0.125}]
[{"$f":"IF(ModelNo=B737,2,\"\")","v":""},"V109","Sash Height",{"$f":"TRUNC((Frame_Height-2.1875)*16+0.5)/16","v":-2.125}]
[{"$f":"IF(ModelNo=B738,3,\"\")","v":""},"V109","Sash Glass Width",{"$f":"TRUNC((Frame_Width/3-1.5)*16+0.5)/16","v":-1.4375}]
[{"$f":"IF(ModelNo=B739,4,\"\")","v":""},"V109","Sash Glass Height",{"$f":"(TRUNC((Frame_Height-2.1875)*16+0.5)/16)-1.3125","v":-3.4375}]
[{"$f":"IF(ModelNo=B740,5,\"\")","v":""},"V109","Fixed Glass Width",{"$f":"TRUNC((Frame_Width/3-1.5)*16+0.5)/16","v":-1.4375}]
[{"$f":"IF(ModelNo=B741,6,\"\")","v":""},"V109","Fixed Glass Height",{"$f":"TRUNC((Frame_Height-3.5)*16+0.5)/16","v":-3.4375}]
[{"$f":"IF(ModelNo=B742,7,\"\")","v":""},"V109","Astragal Length",{"$f":"Frame_Height-2.875","v":-2.875}]
[{"$f":"IF(ModelNo=B743,8,\"\")","v":""},"V109","Roller Track Length",{"$f":"Frame_Width-0.75","v":-0.75}]
[{"$f":"IF(ModelNo=B744,9,\"\")","v":""},"V109","Screen Width",{"$f":"TRUNC((Frame_Width/3-2)*16+0.5)/16","v":-1.9375}]
[{"$f":"IF(ModelNo=B745,10,\"\")","v":""},"V109","Screen Height",{"$f":"Frame_Height-3.375","v":-3.375}]
[{"$f":"IF(ModelNo=B746,11,\"\")","v":""},"V109","Egress Opening Width",{"$f":"TRUNC(((Frame_Width/3)-3.25)*32+0.5)/32","v":-3.21875}]
[{"$f":"IF(ModelNo=B747,12,\"\")","v":""},"V109","Egress Opening Height",{"$f":"TRUNC((Frame_Height-6)*32+0.5)/32","v":-5.96875}]
[{"$f":"IF(ModelNo=B748,13,\"\")","v":""},"V109","Egress Opening Area (sq.ft.)",{"$f":"(D746*D747)/144","v":0.13341606987847221}]
[{"$f":"IF(ModelNo=B749,1,\"\")","v":""},"V202","Sash Width",{"$f":"(Frame_Width/2)-0.9375","v":-0.9375}]
[{"$f":"IF(ModelNo=B750,2,\"\")","v":""},"V202","Sash Height",{"$f":"Frame_Height-2.1875","v":-2.1875}]
[{"$f":"IF(ModelNo=B751,3,\"\")","v":""},"V202","Sash Glass Width",{"$f":"((Frame_Width/2)-0.9375)-1.3125","v":-2.25}]
[{"$f":"IF(ModelNo=B752,4,\"\")","v":""},"V202","Sash Glass Height",{"$f":"Frame_Height-3.5","v":-3.5}]
[{"$f":"IF(ModelNo=B753,5,\"\")","v":""},"V202","Fixed Glass Width",{"$f":"(Frame_Width/2)-2.25","v":-2.25}]
[{"$f":"IF(ModelNo=B754,6,\"\")","v":""},"V202","Fixed Glass Height",{"$f":"Frame_Height-3.5","v":-3.5}]
[{"$f":"IF(ModelNo=B755,7,\"\")","v":""},"V202","Astragal Length",{"$f":"TRUNC((Frame_Height-2.95)*16+0.5)/16","v":-2.875}]
[{"$f":"IF(ModelNo=B756,8,\"\")","v":""},"V202","Roller Track Length",{"$f":"TRUNC((Frame_Width-1.1875)*16+0.5)/16","v":-1.125}]
[{"$f":"IF(ModelNo=B757,9,\"\")","v":""},"V202","Screen Width",{"$f":"TRUNC(((Frame_Width/2)-2.5)*16+0.5)/16","v":-2.4375}]
[{"$f":"IF(ModelNo=B758,10,\"\")","v":""},"V202","Screen Height",{"$f":"TRUNC((Frame_Height-3.375)*16+0.5)/16","v":-3.3125}]
[{"$f":"IF(ModelNo=B759,11,\"\")","v":""},"V202","Egress Opening Width",{"$f":"TRUNC(((Frame_Width/2)-4.8125)*32+0.5)/32","v":-4.78125}]
[{"$f":"IF(ModelNo=B760,12,\"\")","v":""},"V202","Egress Opening Height",{"$f":"TRUNC((Frame_Height-6)*32+0.5)/32","v":-5.96875}]
[{"$f":"IF(ModelNo=B761,13,\"\")","v":""},"V202","Egress Opening Area (sq.ft.)",{"$f":"(D759*D760)/144","v":0.19818115234375}]
[{"$f":"IF(ModelNo=B762,1,\"\")","v":""},"V203","Sash Width",{"$f":"(Frame_Width/4)-0.0625","v":-6.25E-2}]
[{"$f":"IF(ModelNo=B763,2,\"\")","v":""},"V203","Sash Height",{"$f":"Frame_Height-2.1875","v":-2.1875}]
[{"$f":"IF(ModelNo=B764,3,\"\")","v":""},"V203","Sash Glass Width",{"$f":"(Frame_Width/4)-1.375","v":-1.375}]
[{"$f":"IF(ModelNo=B765,4,\"\")","v":""},"V203","Sash Glass Height",{"$f":"Frame_Height-3.5","v":-3.5}]
[{"$f":"IF(ModelNo=B766,5,\"\")","v":""},"V203","Fixed Glass Width",{"$f":"(Frame_Width/2)-2.75","v":-2.75}]
[{"$f":"IF(ModelNo=B767,6,\"\")","v":""},"V203","Fixed Glass Height",{"$f":"Frame_Height-3.5","v":-3.5}]
[{"$f":"IF(ModelNo=B768,7,\"\")","v":""},"V203","Astragal Length",{"$f":"TRUNC((Frame_Height-2.95)*16+0.5)/16","v":-2.875}]
[{"$f":"IF(ModelNo=B769,8,\"\")","v":""},"V203","Roller Track Length",{"$f":"TRUNC((Frame_Width-1.1875)*16+0.5)/16","v":-1.125}]
[{"$f":"IF(ModelNo=B770,9,\"\")","v":""},"V203","Screen Width",{"$f":"TRUNC((Frame_Width/4-1.625)*16+0.5)/16","v":-1.5625}]
[{"$f":"IF(ModelNo=B771,10,\"\")","v":""},"V203","Screen Height",{"$f":"TRUNC((Frame_Height-3.375)*16+0.5)/16","v":-3.3125}]
[{"$f":"IF(ModelNo=B772,11,\"\")","v":""},"V203","Egress Opening Width",{"$f":"TRUNC(((Frame_Width/2)-4.8125)*32+0.5)/32","v":-4.78125}]
[{"$f":"IF(ModelNo=B773,12,\"\")","v":""},"V203","Egress Opening Height",{"$f":"TRUNC((Frame_Height-6)*32+0.5)/32","v":-5.96875}]
[{"$f":"IF(ModelNo=B774,13,\"\")","v":""},"V203","Egress Opening Area (sq.ft.)",{"$f":"(D772*D773)/144","v":0.19818115234375}]
[{"$f":"IF(ModelNo=B775,1,\"\")","v":""},"V209","Sash Width",{"$f":"TRUNC((Frame_Width/3-0.521)*16+0.5)/16","v":-0.4375}]
[{"$f":"IF(ModelNo=B776,2,\"\")","v":""},"V209","Sash Height",{"$f":"Frame_Height-2.1875","v":-2.1875}]
[{"$f":"IF(ModelNo=B777,3,\"\")","v":""},"V209","Sash Glass Width",{"$f":"TRUNC((Frame_Width/3-1.833)*16+0.5)/16","v":-1.75}]
[{"$f":"IF(ModelNo=B778,4,\"\")","v":""},"V209","Sash Glass Height",{"$f":"TRUNC((Frame_Height-3.5)*16+0.5)/16","v":-3.4375}]
[{"$f":"IF(ModelNo=B779,5,\"\")","v":""},"V209","Fixed Glass Width",{"$f":"TRUNC((Frame_Width/3-1.833)*16+0.5)/16","v":-1.75}]
[{"$f":"IF(ModelNo=B780,6,\"\")","v":""},"V209","Fixed Glass Height",{"$f":"TRUNC((Frame_Height-3.5)*16+0.5)/16","v":-3.4375}]
[{"$f":"IF(ModelNo=B781,7,\"\")","v":""},"V209","Astragal Length",{"$f":"Frame_Height-2.875","v":-2.875}]
[{"$f":"IF(ModelNo=B782,8,\"\")","v":""},"V209","Roller Track Length",{"$f":"TRUNC((Frame_Width-1.1875)*16+0.5)/16","v":-1.125}]
[{"$f":"IF(ModelNo=B783,9,\"\")","v":""},"V209","Screen Width",{"$f":"TRUNC((Frame_Width/3-1.75)*16+0.5)/16","v":-1.6875}]
[{"$f":"IF(ModelNo=B784,10,\"\")","v":""},"V209","Screen Height",{"$f":"Frame_Height-3.375","v":-3.375}]
[{"$f":"IF(ModelNo=B785,11,\"\")","v":""},"V209","Egress Opening Width",{"$f":"TRUNC(((Frame_Width/3)-3.25)*32+0.5)/32","v":-3.21875}]
[{"$f":"IF(ModelNo=B786,12,\"\")","v":""},"V209","Egress Opening Height",{"$f":"TRUNC((Frame_Height-6)*32+0.5)/32","v":-5.96875}]
[{"$f":"IF(ModelNo=B787,13,\"\")","v":""},"V209","Egress Opening Area (sq.ft.)",{"$f":"(D785*D786)/144","v":0.13341606987847221}]
[{"$f":"IF(OR(ModelNo=\"1105\",ModelNo=\"1106\",ModelNo=\"1108\",ModelNo=\"1176\"),1,\"\")","v":""},"1100","Sash Width",{"$f":"(Frame_Width/2)+1.0625","v":1.0625}]
[{"$f":"IF(OR(ModelNo=\"1105\",ModelNo=\"1106\",ModelNo=\"1108\",ModelNo=\"1176\"),2,\"\")","v":""},"1100","Sash Height",{"$f":"Frame_Height-2.1875","v":-2.1875}]
[{"$f":"IF(OR(ModelNo=\"1105\",ModelNo=\"1106\",ModelNo=\"1108\",ModelNo=\"1176\"),3,\"\")","v":""},"1100","Roller Track Length",{"$f":"Frame_Width-1.25","v":-1.25}]
[{"$f":"IF(OR(ModelNo=\"1105\",ModelNo=\"1106\",ModelNo=\"1108\",ModelNo=\"1176\"),4,\"\")","v":""},"1100","Glass Width",{"$f":"(Frame_Width/2)-2.8125","v":-2.8125}]
[{"$f":"IF(OR(ModelNo=\"1105\",ModelNo=\"1106\",ModelNo=\"1108\",ModelNo=\"1176\"),5,\"\")","v":""},"1100","Glass Height",{"$f":"Frame_Height-6.125","v":-6.125}]
[{"$f":"IF(OR(ModelNo=\"1105\",ModelNo=\"1106\",ModelNo=\"1108\",ModelNo=\"1176\"),6,\"\")","v":""},"1100","Screen Width",{"$f":"(Frame_Width/2)+0.0625","v":6.25E-2}]
[{"$f":"IF(OR(ModelNo=\"1105\",ModelNo=\"1106\",ModelNo=\"1108\",ModelNo=\"1176\"),7,\"\")","v":""},"1100","Screen Height",{"$f":"Frame_Height-1.625","v":-1.625}]
[{"$f":"IF(OR(ModelNo=\"1105\",ModelNo=\"1106\",ModelNo=\"1108\",ModelNo=\"1176\"),8,\"\")","v":""},"1100","Egress Opening Width",{"$f":"(Frame_Width/2)-5.59375","v":-5.59375}]
[{"$f":"IF(OR(ModelNo=\"1105\",ModelNo=\"1106\",ModelNo=\"1108\",ModelNo=\"1176\"),9,\"\")","v":""},"1100","Egress Opening Height",{"$f":"Frame_Height-3.125","v":-3.125}]
[{"$f":"IF(OR(ModelNo=\"1105\",ModelNo=\"1106\",ModelNo=\"1108\",ModelNo=\"1176\"),10,\"\")","v":""},"1100","Egress Opening Area (sq.ft.)",{"$f":"(D795*D796)/144","v":0.12139214409722222}]
[{"$f":"IF(ModelNo=B798,1,\"\")","v":""},"1109","Sash Width",{"$f":"TRUNC(((Frame_Width/3)+1.5625)*16+0.5)/16","v":1.5625}]
[{"$f":"IF(ModelNo=B799,2,\"\")","v":""},"1109","Sash Height",{"$f":"Frame_Height-2.1875","v":-2.1875}]
[{"$f":"IF(ModelNo=B800,3,\"\")","v":""},"1109","Roller Track Length",{"$f":"TRUNC(((((Frame_Width+0.625)/3)*2)-0.75)*16+0.5)/16","v":-0.25}]
[{"$f":"IF(ModelNo=B801,4,\"\")","v":""},"1109","Glass Width",{"$f":"TRUNC(((Frame_Width/3)-2.3125)*16+0.5)/16","v":-2.25}]
[{"$f":"IF(ModelNo=B802,5,\"\")","v":""},"1109","Glass Height",{"$f":"Frame_Height-6.125","v":-6.125}]
[{"$f":"IF(ModelNo=B803,6,\"\")","v":""},"1109","Screen Width",{"$f":"TRUNC(((Frame_Width/3)-0.0625)*16+0.5)/16","v":0}]
[{"$f":"IF(ModelNo=B804,7,\"\")","v":""},"1109","Screen Height",{"$f":"Frame_Height-1.625","v":-1.625}]
[{"$f":"IF(ModelNo=B805,8,\"\")","v":""},"1109","Egress Opening Width",{"$f":"(Frame_Width/3)-5.25","v":-5.25}]
[{"$f":"IF(ModelNo=B806,9,\"\")","v":""},"1109","Egress Opening Height",{"$f":"Frame_Height-3.125","v":-3.125}]
[{"$f":"IF(ModelNo=B807,10,\"\")","v":""},"1109","Egress Opening Area (sq.ft.)",{"$f":"(D805*D806)/144","v":0.11393229166666667}]
[{"$f":"IF(OR(ModelNo=\"11C5\",ModelNo=\"11i5\",ModelNo=\"11C6\",ModelNo=\"11i6\",ModelNo=\"11C8\",ModelNo=\"11i8\"),1,\"\")","v":""},"11C/i","Sash Width",{"$f":"(Frame_Width/2)+0.6875","v":0.6875}]
[{"$f":"IF(OR(ModelNo=\"11C5\",ModelNo=\"11i5\",ModelNo=\"11C6\",ModelNo=\"11i6\",ModelNo=\"11C8\",ModelNo=\"11i8\"),2,\"\")","v":""},"11C/i","Sash Height",{"$f":"Frame_Height-3.0625","v":-3.0625}]
[{"$f":"IF(OR(ModelNo=\"11C5\",ModelNo=\"11i5\",ModelNo=\"11C6\",ModelNo=\"11i6\",ModelNo=\"11C8\",ModelNo=\"11i8\"),3,\"\")","v":""},"11C/i","Roller Track Length",{"$f":"Frame_Width-2.125","v":-2.125}]
[{"$f":"IF(OR(ModelNo=\"11C5\",ModelNo=\"11i5\",ModelNo=\"11C6\",ModelNo=\"11i6\",ModelNo=\"11C8\",ModelNo=\"11i8\"),4,\"\")","v":""},"11C/i","Glass Width",{"$f":"(Frame_Width/2)-3.1875","v":-3.1875}]
[{"$f":"IF(OR(ModelNo=\"11C5\",ModelNo=\"11i5\",ModelNo=\"11C6\",ModelNo=\"11i6\",ModelNo=\"11C8\",ModelNo=\"11i8\"),5,\"\")","v":""},"11C/i","Glass Height",{"$f":"Frame_Height-6.9375","v":-6.9375}]
[{"$f":"IF(OR(ModelNo=\"11C5\",ModelNo=\"11i5\",ModelNo=\"11C6\",ModelNo=\"11i6\",ModelNo=\"11C8\",ModelNo=\"11i8\"),6,\"\")","v":""},"11C/i","Screen Width",{"$f":"Frame_Width/2","v":0}]
[{"$f":"IF(OR(ModelNo=\"11C5\",ModelNo=\"11i5\",ModelNo=\"11C6\",ModelNo=\"11i6\",ModelNo=\"11C8\",ModelNo=\"11i8\"),7,\"\")","v":""},"11C/i","Screen Height",{"$f":"Frame_Height-2.125","v":-2.125}]
[{"$f":"IF(OR(ModelNo=\"11C5\",ModelNo=\"11i5\",ModelNo=\"11C6\",ModelNo=\"11i6\",ModelNo=\"11C8\",ModelNo=\"11i8\"),8,\"\")","v":""},"11C/i","Egress Opening Width",{"$f":"(Frame_Width/2)-6","v":-6}]
[{"$f":"IF(OR(ModelNo=\"11C5\",ModelNo=\"11i5\",ModelNo=\"11C6\",ModelNo=\"11i6\",ModelNo=\"11C8\",ModelNo=\"11i8\"),9,\"\")","v":""},"11C/i","Egress Opening Height",{"$f":"Frame_Height-4","v":-4}]
[{"$f":"IF(OR(ModelNo=\"11C5\",ModelNo=\"11i5\",ModelNo=\"11C6\",ModelNo=\"11i6\",ModelNo=\"11C8\",ModelNo=\"11i8\"),10,\"\")","v":""},"11C/i","Egress Opening Area (sq.ft.)",{"$f":"(D815*D816)/144","v":0.16666666666666666}]
[{"$f":"IF(ModelNo=B818,1,\"\")","v":""},"11C9","Sash Width",{"$f":"TRUNC(((Frame_Width/3)+1.25)*16+0.5)/16","v":1.25}]
[{"$f":"IF(ModelNo=B819,2,\"\")","v":""},"11C9","Sash Height",{"$f":"Frame_Height-3","v":-3}]
[{"$f":"IF(ModelNo=B820,3,\"\")","v":""},"11C9","Roller Track Length",{"$f":"TRUNC(((((Frame_Width+0.625)/3)*2)-0.75)*16+0.5)/16","v":-0.25}]
[{"$f":"IF(ModelNo=B821,4,\"\")","v":""},"11C9","Glass Width",{"$f":"TRUNC(((Frame_Width/3)-2.625)*16+0.5)/16","v":-2.5625}]
[{"$f":"IF(ModelNo=B822,5,\"\")","v":""},"11C9","Glass Height",{"$f":"Frame_Height-6.9375","v":-6.9375}]
[{"$f":"IF(ModelNo=B823,6,\"\")","v":""},"11C9","Screen Width",{"$f":"TRUNC(((Frame_Width/3)-0.1875)*16+0.5)/16","v":-0.125}]
[{"$f":"IF(ModelNo=B824,7,\"\")","v":""},"11C9","Screen Height",{"$f":"Frame_Height-2.125","v":-2.125}]
[{"$f":"IF(ModelNo=B825,8,\"\")","v":""},"11C9","Egress Opening Width",{"$f":"(Frame_Width/3)-5.75","v":-5.75}]
[{"$f":"IF(ModelNo=B826,9,\"\")","v":""},"11C9","Egress Opening Height",{"$f":"Frame_Height-4","v":-4}]
[{"$f":"IF(ModelNo=B827,10,\"\")","v":""},"11C9","Egress Opening Area (sq.ft.)",{"$f":"(D825*D826)/144","v":0.15972222222222221}]
[{"$f":"IF(OR(ModelNo=\"5102\",ModelNo=\"5105\",ModelNo=\"5106\",ModelNo=\"5108\",,ModelNo=\"5175\"),1,\"\")","v":""},"5102","Sash Width",{"$f":"(Frame_Width/2)+1.0625","v":1.0625}]
[{"$f":"IF(OR(ModelNo=\"5102\",ModelNo=\"5105\",ModelNo=\"5106\",ModelNo=\"5108\",,ModelNo=\"5175\"),2,\"\")","v":""},"5102","Sash Height",{"$f":"Frame_Height-2.1875","v":-2.1875}]
[{"$f":"IF(OR(ModelNo=\"5102\",ModelNo=\"5105\",ModelNo=\"5106\",ModelNo=\"5108\",,ModelNo=\"5175\"),3,\"\")","v":""},"5102","Roller Track Length",{"$f":"Frame_Width-1.25","v":-1.25}]
[{"$f":"IF(OR(ModelNo=\"5102\",ModelNo=\"5105\",ModelNo=\"5106\",ModelNo=\"5108\",,ModelNo=\"5175\"),4,\"\")","v":""},"5102","Glass Width",{"$f":"(Frame_Width/2)-2.8125","v":-2.8125}]
[{"$f":"IF(OR(ModelNo=\"5102\",ModelNo=\"5105\",ModelNo=\"5106\",ModelNo=\"5108\",,ModelNo=\"5175\"),5,\"\")","v":""},"5102","Glass Height",{"$f":"Frame_Height-6.125","v":-6.125}]
[{"$f":"IF(OR(ModelNo=\"5102\",ModelNo=\"5105\",ModelNo=\"5106\",ModelNo=\"5108\",,ModelNo=\"5175\"),6,\"\")","v":""},"5102","Screen Width",{"$f":"(Frame_Width/2)+0.0625","v":6.25E-2}]
[{"$f":"IF(OR(ModelNo=\"5102\",ModelNo=\"5105\",ModelNo=\"5106\",ModelNo=\"5108\",,ModelNo=\"5175\"),7,\"\")","v":""},"5102","Screen Height",{"$f":"Frame_Height-1.625","v":-1.625}]
[{"$f":"IF(OR(ModelNo=\"5102\",ModelNo=\"5105\",ModelNo=\"5106\",ModelNo=\"5108\",,ModelNo=\"5175\"),8,\"\")","v":""},"5102","Egress Opening Width",{"$f":"(Frame_Width/2)-5.59375","v":-5.59375}]
[{"$f":"IF(OR(ModelNo=\"5102\",ModelNo=\"5105\",ModelNo=\"5106\",ModelNo=\"5108\",,ModelNo=\"5175\"),9,\"\")","v":""},"5102","Egress Opening Height",{"$f":"Frame_Height-3.125","v":-3.125}]
[{"$f":"IF(OR(ModelNo=\"5102\",ModelNo=\"5105\",ModelNo=\"5106\",ModelNo=\"5108\",,ModelNo=\"5175\"),10,\"\")","v":""},"5102","Egress Opening Area (sq.ft.)",{"$f":"(D835*D836)/144","v":0.12139214409722222}]
[{"$f":"IF(OR(ModelNo=\"5103\",ModelNo=\"5109\"),1,\"\")","v":""},"5103","Sash Width",{"$f":"TRUNC(((Frame_Width/3)+1.5625)*16+0.5)/16","v":1.5625}]
[{"$f":"IF(OR(ModelNo=\"5103\",ModelNo=\"5109\"),2,\"\")","v":""},"5103","Sash Height",{"$f":"Frame_Height-2.1875","v":-2.1875}]
[{"$f":"IF(OR(ModelNo=\"5103\",ModelNo=\"5109\"),3,\"\")","v":""},"5103","Roller Track Length",{"$f":"TRUNC(((((Frame_Width+0.625)/3)*2)-0.75)*16+0.5)/16","v":-0.25}]
[{"$f":"IF(OR(ModelNo=\"5103\",ModelNo=\"5109\"),4,\"\")","v":""},"5103","Glass Width",{"$f":"TRUNC(((Frame_Width/3)-2.3125)*16+0.5)/16","v":-2.25}]
[{"$f":"IF(OR(ModelNo=\"5103\",ModelNo=\"5109\"),5,\"\")","v":""},"5103","Glass Height",{"$f":"Frame_Height-6.125","v":-6.125}]
[{"$f":"IF(OR(ModelNo=\"5103\",ModelNo=\"5109\"),6,\"\")","v":""},"5103","Screen Width",{"$f":"TRUNC(((Frame_Width/3)+0.1875)*16+0.5)/16","v":0.1875}]
[{"$f":"IF(OR(ModelNo=\"5103\",ModelNo=\"5109\"),7,\"\")","v":""},"5103","Screen Height",{"$f":"Frame_Height-1.625","v":-1.625}]
[{"$f":"IF(OR(ModelNo=\"5103\",ModelNo=\"5109\"),8,\"\")","v":""},"5103","Egress Opening Width",{"$f":"(Frame_Width/3)-5.25","v":-5.25}]
[{"$f":"IF(OR(ModelNo=\"5103\",ModelNo=\"5109\"),9,\"\")","v":""},"5103","Egress Opening Height",{"$f":"Frame_Height-3.125","v":-3.125}]
[{"$f":"IF(OR(ModelNo=\"5103\",ModelNo=\"5109\"),10,\"\")","v":""},"5103","Egress Opening Area (sq.ft.)",{"$f":"(D845*D846)/144","v":0.11393229166666667}]
[{"$f":"IF(OR(ModelNo=\"51I5\",ModelNo=\"51I6\",ModelNo=\"51I8\"),1,\"\")","v":""},"51i5","Sash Width",{"$f":"(Frame_Width/2)+1.0625","v":1.0625}]
[{"$f":"IF(OR(ModelNo=\"51I5\",ModelNo=\"51I6\",ModelNo=\"51I8\"),2,\"\")","v":""},"51i5","Sash Height",{"$f":"Frame_Height-2.1875","v":-2.1875}]
[{"$f":"IF(OR(ModelNo=\"51I5\",ModelNo=\"51I6\",ModelNo=\"51I8\"),3,\"\")","v":""},"51i5","Roller Track Length",{"$f":"Frame_Width-1.25","v":-1.25}]
[{"$f":"IF(OR(ModelNo=\"51I5\",ModelNo=\"51I6\",ModelNo=\"51I8\"),4,\"\")","v":""},"51i5","Glass Width",{"$f":"(Frame_Width/2)-3.1875","v":-3.1875}]
[{"$f":"IF(OR(ModelNo=\"51I5\",ModelNo=\"51I6\",ModelNo=\"51I8\"),5,\"\")","v":""},"51i5","Glass Height",{"$f":"Frame_Height-6.9375","v":-6.9375}]
[{"$f":"IF(OR(ModelNo=\"51I5\",ModelNo=\"51I6\",ModelNo=\"51I8\"),6,\"\")","v":""},"51i5","Screen Width",{"$f":"Frame_Width/2","v":0}]
[{"$f":"IF(OR(ModelNo=\"51I5\",ModelNo=\"51I6\",ModelNo=\"51I8\"),7,\"\")","v":""},"51i5","Screen Height",{"$f":"Frame_Height-2.125","v":-2.125}]
[{"$f":"IF(OR(ModelNo=\"51I5\",ModelNo=\"51I6\",ModelNo=\"51I8\"),8,\"\")","v":""},"51i5","Egress Opening Width",{"$f":"(Frame_Width/2)-5.5","v":-5.5}]
[{"$f":"IF(OR(ModelNo=\"51I5\",ModelNo=\"51I6\",ModelNo=\"51I8\"),9,\"\")","v":""},"51i5","Egress Opening Height",{"$f":"Frame_Height-3.125","v":-3.125}]
[{"$f":"IF(OR(ModelNo=\"51I5\",ModelNo=\"51I6\",ModelNo=\"51I8\"),10,\"\")","v":""},"51i5","Egress Opening Area (sq.ft.)",{"$f":"(D855*D856)/144","v":0.1193576388888889}]
[{"$f":"IF(OR(ModelNo=\"5202\",ModelNo=\"5205\",ModelNo=\"5206\",ModelNo=\"5208\"),1,\"\")","v":""},"5202","Sash Width",{"$f":"TRUNC(((Frame_Width/2)-0.078)*16+0.5)/16","v":0}]
[{"$f":"IF(OR(ModelNo=\"5202\",ModelNo=\"5205\",ModelNo=\"5206\",ModelNo=\"5208\"),2,\"\")","v":""},"5202","Sash Height",{"$f":"TRUNC((Frame_Height-4.275)*16+0.5)/16","v":-4.1875}]
[{"$f":"IF(OR(ModelNo=\"5202\",ModelNo=\"5205\",ModelNo=\"5206\",ModelNo=\"5208\"),3,\"\")","v":""},"5202","Roller Track Length",{"$f":"TRUNC((Frame_Width-2.66)*16+0.5)/16","v":-2.625}]
[{"$f":"IF(OR(ModelNo=\"5202\",ModelNo=\"5205\",ModelNo=\"5206\",ModelNo=\"5208\"),4,\"\")","v":""},"5202","Glass Width",{"$f":"TRUNC(((Frame_Width/2)-5.393)*16+0.5)/16","v":-5.3125}]
[{"$f":"IF(OR(ModelNo=\"5202\",ModelNo=\"5205\",ModelNo=\"5206\",ModelNo=\"5208\"),5,\"\")","v":""},"5202","Glass Height",{"$f":"TRUNC((Frame_Height-9.59)*16+0.5)/16","v":-9.5}]
[{"$f":"IF(OR(ModelNo=\"5202\",ModelNo=\"5205\",ModelNo=\"5206\",ModelNo=\"5208\"),6,\"\")","v":""},"5202","Screen Width",{"$f":"TRUNC(((Frame_Width/2)-0.709)*16+0.5)/16","v":-0.625}]
[{"$f":"IF(OR(ModelNo=\"5202\",ModelNo=\"5205\",ModelNo=\"5206\",ModelNo=\"5208\"),7,\"\")","v":""},"5202","Screen Height",{"$f":"TRUNC((Frame_Height-3.886)*16+0.5)/16","v":-3.8125}]
[{"$f":"IF(OR(ModelNo=\"5202\",ModelNo=\"5205\",ModelNo=\"5206\",ModelNo=\"5208\"),8,\"\")","v":""},"5202","Egress Opening Width",{"$f":"TRUNC(((Frame_Width/2)-7.78)*16+0.5)/16","v":-7.6875}]
[{"$f":"IF(OR(ModelNo=\"5202\",ModelNo=\"5205\",ModelNo=\"5206\",ModelNo=\"5208\"),9,\"\")","v":""},"5202","Egress Opening Height",{"$f":"Frame_Height-5.25","v":-5.25}]
[{"$f":"IF(OR(ModelNo=\"5202\",ModelNo=\"5205\",ModelNo=\"5206\",ModelNo=\"5208\"),10,\"\")","v":""},"5202","Egress Opening Area (sq.ft.)",{"$f":"(D865*D866)/144","v":0.2802734375}]
[{"$f":"IF(OR(ModelNo=\"5203\",ModelNo=\"5209\",ModelNo=\"5210\",ModelNo=\"5212\"),1,\"\")","v":""},"5203","Sash Width",{"$f":"TRUNC(((Frame_Width/3)+0.853)*16+0.5)/16","v":0.875}]
[{"$f":"IF(OR(ModelNo=\"5203\",ModelNo=\"5209\",ModelNo=\"5210\",ModelNo=\"5212\"),2,\"\")","v":""},"5203","Sash Height",{"$f":"TRUNC((Frame_Height-4.275)*16+0.5)/16","v":-4.1875}]
[{"$f":"IF(OR(ModelNo=\"5203\",ModelNo=\"5209\",ModelNo=\"5210\",ModelNo=\"5212\"),3,\"\")","v":""},"5203","Roller Track Length",{"$f":"TRUNC((Frame_Width-2.66)*16+0.5)/16","v":-2.625}]
[{"$f":"IF(OR(ModelNo=\"5203\",ModelNo=\"5209\",ModelNo=\"5210\",ModelNo=\"5212\"),4,\"\")","v":""},"5203","Glass Width",{"$f":"TRUNC(((Frame_Width/3)-4.461)*16+0.5)/16","v":-4.375}]
[{"$f":"IF(OR(ModelNo=\"5203\",ModelNo=\"5209\",ModelNo=\"5210\",ModelNo=\"5212\"),5,\"\")","v":""},"5203","Glass Height",{"$f":"TRUNC((Frame_Height-9.59)*16+0.5)/16","v":-9.5}]
[{"$f":"IF(OR(ModelNo=\"5203\",ModelNo=\"5209\",ModelNo=\"5210\",ModelNo=\"5212\"),6,\"\")","v":""},"5203","Screen Width",{"$f":"TRUNC(((Frame_Width/3)+0.223)*16+0.5)/16","v":0.25}]
[{"$f":"IF(OR(ModelNo=\"5203\",ModelNo=\"5209\",ModelNo=\"5210\",ModelNo=\"5212\"),7,\"\")","v":""},"5203","Screen Height",{"$f":"TRUNC((Frame_Height-3.886)*16+0.5)/16","v":-3.8125}]
[{"$f":"IF(OR(ModelNo=\"5203\",ModelNo=\"5209\",ModelNo=\"5210\",ModelNo=\"5212\"),8,\"\")","v":""},"5203","Egress Opening Width",{"$f":"TRUNC(((Frame_Width/3)-6.75)*16+0.5)/16","v":-6.6875}]
[{"$f":"IF(OR(ModelNo=\"5203\",ModelNo=\"5209\",ModelNo=\"5210\",ModelNo=\"5212\"),9,\"\")","v":""},"5203","Egress Opening Height",{"$f":"Frame_Height-5.25","v":-5.25}]
[{"$f":"IF(OR(ModelNo=\"5203\",ModelNo=\"5209\",ModelNo=\"5210\",ModelNo=\"5212\"),10,\"\")","v":""},"5203","Egress Opening Area (sq.ft.)",{"$f":"(D875*D876)/144","v":0.24381510416666666}]
[{"$f":"IF(OR(ModelNo=\"6102\",ModelNo=\"6105\",ModelNo=\"6106\",ModelNo=\"6108\",ModelNo=\"6175\"),1,\"\")","v":""},"6102","Sash Width",{"$f":"(Frame_Width/2)-0.1875","v":-0.1875}]
[{"$f":"IF(OR(ModelNo=\"6102\",ModelNo=\"6105\",ModelNo=\"6106\",ModelNo=\"6108\",ModelNo=\"6175\"),2,\"\")","v":""},"6102","Sash Height",{"$f":"Frame_Height-3.6875","v":-3.6875}]
[{"$f":"IF(OR(ModelNo=\"6102\",ModelNo=\"6105\",ModelNo=\"6106\",ModelNo=\"6108\",ModelNo=\"6175\"),3,\"\")","v":""},"6102","Operating Sash Roller Track Length",{"$f":"Frame_Width-2.5","v":-2.5}]
[{"$f":"IF(OR(ModelNo=\"6102\",ModelNo=\"6105\",ModelNo=\"6106\",ModelNo=\"6108\",ModelNo=\"6175\"),4,\"\")","v":""},"6102","Screen Roller Track Length",{"$f":"Frame_Width","v":0}]
[{"$f":"IF(OR(ModelNo=\"6102\",ModelNo=\"6105\",ModelNo=\"6106\",ModelNo=\"6108\",ModelNo=\"6175\"),5,\"\")","v":""},"6102","Fixed Panel Support",{"$f":"(Frame_Width/2)-0.25","v":-0.25}]
[{"$f":"IF(OR(ModelNo=\"6102\",ModelNo=\"6105\",ModelNo=\"6106\",ModelNo=\"6108\",ModelNo=\"6175\"),6,\"\")","v":""},"6102","Glass Width",{"$f":"(Frame_Width/2)-3.75","v":-3.75}]
[{"$f":"IF(OR(ModelNo=\"6102\",ModelNo=\"6105\",ModelNo=\"6106\",ModelNo=\"6108\",ModelNo=\"6175\"),7,\"\")","v":""},"6102","Glass Height",{"$f":"Frame_Height-8.9375","v":-8.9375}]
[{"$f":"IF(OR(ModelNo=\"6102\",ModelNo=\"6105\",ModelNo=\"6106\",ModelNo=\"6108\",ModelNo=\"6175\"),8,\"\")","v":""},"6102","Screen Width",{"$f":"(Frame_Width/2)-0.9375","v":-0.9375}]
[{"$f":"IF(OR(ModelNo=\"6102\",ModelNo=\"6105\",ModelNo=\"6106\",ModelNo=\"6108\",ModelNo=\"6175\"),9,\"\")","v":""},"6102","Screen Height",{"$f":"Frame_Height-3.125","v":-3.125}]
[{"$f":"IF(OR(ModelNo=\"6102\",ModelNo=\"6105\",ModelNo=\"6106\",ModelNo=\"6108\",ModelNo=\"6175\"),10,\"\")","v":""},"6102","Egress Opening Width",{"$f":"(Frame_Width/2)-6.4375","v":-6.4375}]
[{"$f":"IF(OR(ModelNo=\"6102\",ModelNo=\"6105\",ModelNo=\"6106\",ModelNo=\"6108\",ModelNo=\"6175\"),11,\"\")","v":""},"6102","Egress Opening Height",{"$f":"Frame_Height-4.875","v":-4.875}]
[{"$f":"IF(OR(ModelNo=\"6102\",ModelNo=\"6105\",ModelNo=\"6106\",ModelNo=\"6108\",ModelNo=\"6175\"),12,\"\")","v":""},"6102","Egress Opening Area (sq.ft.)",{"$f":"(D887*D888)/144","v":0.21793619791666666}]
[{"$f":"IF(OR(ModelNo=\"6103\",ModelNo=\"6109\",ModelNo=\"6122\"),1,\"\")","v":""},"6103","Sash Width",{"$f":"(TRUNC(((Frame_Width/3)-0.4792)*16+0.5)/16)+0.4375","v":0}]
[{"$f":"IF(OR(ModelNo=\"6103\",ModelNo=\"6109\",ModelNo=\"6122\"),2,\"\")","v":""},"6103","Sash Height",{"$f":"Frame_Height-3.6875","v":-3.6875}]
[{"$f":"IF(OR(ModelNo=\"6103\",ModelNo=\"6109\",ModelNo=\"6122\"),3,\"\")","v":""},"6103","Operating Sash Roller Track Length",{"$f":"Frame_Width-2.5","v":-2.5}]
[{"$f":"IF(OR(ModelNo=\"6103\",ModelNo=\"6109\",ModelNo=\"6122\"),4,\"\")","v":""},"6103","Screen Roller Track Length",{"$f":"Frame_Width","v":0}]
[{"$f":"IF(OR(ModelNo=\"6103\",ModelNo=\"6109\",ModelNo=\"6122\"),5,\"\")","v":""},"6103","Fixed Panel Support",{"$f":"TRUNC(((Frame_Width/3)-0.10412)*16+0.5)/16","v":-6.25E-2}]
[{"$f":"IF(OR(ModelNo=\"6103\",ModelNo=\"6109\",ModelNo=\"6122\"),6,\"\")","v":""},"6103","Glass Width",{"$f":"TRUNC(((Frame_Width/3)-3.60412)*16+0.5)/16","v":-3.5625}]
[{"$f":"IF(OR(ModelNo=\"6103\",ModelNo=\"6109\",ModelNo=\"6122\"),7,\"\")","v":""},"6103","Glass Height",{"$f":"Frame_Height-8.9375","v":-8.9375}]
[{"$f":"IF(OR(ModelNo=\"6103\",ModelNo=\"6109\",ModelNo=\"6122\"),8,\"\")","v":""},"6103","Screen Width",{"$f":"TRUNC(((Frame_Width/3)-0.7917)*16+0.5)/16","v":-0.75}]
[{"$f":"IF(OR(ModelNo=\"6103\",ModelNo=\"6109\",ModelNo=\"6122\"),9,\"\")","v":""},"6103","Screen Height",{"$f":"Frame_Height-3.125","v":-3.125}]
[{"$f":"IF(OR(ModelNo=\"6103\",ModelNo=\"6109\",ModelNo=\"6122\"),10,\"\")","v":""},"6103","Egress Opening Width",{"$f":"TRUNC(((Frame_Width/3)-6.16666667)*16+0.5)/16","v":-6.125}]
[{"$f":"IF(OR(ModelNo=\"6103\",ModelNo=\"6109\",ModelNo=\"6122\"),11,\"\")","v":""},"6103","Egress Opening Height",{"$f":"Frame_Height-4.875","v":-4.875}]
[{"$f":"IF(OR(ModelNo=\"6103\",ModelNo=\"6109\",ModelNo=\"6122\"),12,\"\")","v":""},"6103","Egress Opening Area (sq.ft.)",{"$f":"(D899*D900)/144","v":0.20735677083333334}]
[{"$f":"IF(OR(ModelNo=\"6104\",ModelNo=\"6112\"),1,\"\")","v":""},"6104","Sash Width",{"$f":"(TRUNC(((Frame_Width/4)-0.1875)*16+0.5)/16)+0.4375","v":0.3125}]
[{"$f":"IF(OR(ModelNo=\"6104\",ModelNo=\"6112\"),2,\"\")","v":""},"6104","Sash Height",{"$f":"Frame_Height-3.6875","v":-3.6875}]
[{"$f":"IF(OR(ModelNo=\"6104\",ModelNo=\"6112\"),3,\"\")","v":""},"6104","Operating Sash Roller Track Length",{"$f":"Frame_Width-2.5","v":-2.5}]
[{"$f":"IF(OR(ModelNo=\"6104\",ModelNo=\"6112\"),4,\"\")","v":""},"6104","Screen Roller Track Length",{"$f":"Frame_Width","v":0}]
[{"$f":"IF(OR(ModelNo=\"6104\",ModelNo=\"6112\"),5,\"\")","v":""},"6104","Fixed Panel Support",{"$f":"TRUNC(((Frame_Width/4)+0.1875)*16+0.5)/16","v":0.1875}]
[{"$f":"IF(OR(ModelNo=\"6104\",ModelNo=\"6112\"),6,\"\")","v":""},"6104","Four Panel Mullion",{"$f":"Frame_Height-3.6875","v":-3.6875}]
[{"$f":"IF(OR(ModelNo=\"6104\",ModelNo=\"6112\"),7,\"\")","v":""},"6104","Screw Cover Snap on Mullion",{"$f":"Frame_Height-6","v":-6}]
[{"$f":"IF(OR(ModelNo=\"6104\",ModelNo=\"6112\"),8,\"\")","v":""},"6104","Glass Width",{"$f":"TRUNC(((Frame_Width/4)-3.3125)*16+0.5)/16","v":-3.25}]
[{"$f":"IF(OR(ModelNo=\"6104\",ModelNo=\"6112\"),9,\"\")","v":""},"6104","Glass Height",{"$f":"Frame_Height-8.9375","v":-8.9375}]
[{"$f":"IF(OR(ModelNo=\"6104\",ModelNo=\"6112\"),10,\"\")","v":""},"6104","Screen Width",{"$f":"TRUNC((Frame_Width/4)*16+0.5)/16","v":0}]
[{"$f":"IF(OR(ModelNo=\"6104\",ModelNo=\"6112\"),11,\"\")","v":""},"6104","Screen Height",{"$f":"Frame_Height-3.125","v":-3.125}]
[{"$f":"IF(OR(ModelNo=\"6104\",ModelNo=\"6112\"),12,\"\")","v":""},"6104","Egress Opening Width",{"$f":"TRUNC(((Frame_Width/4)+6)*16+0.5)/16","v":6}]
[{"$f":"IF(OR(ModelNo=\"6104\",ModelNo=\"6112\"),13,\"\")","v":""},"6104","Egress Opening Height",{"$f":"Frame_Height-4.875","v":-4.875}]
[{"$f":"IF(OR(ModelNo=\"6104\",ModelNo=\"6112\"),14,\"\")","v":""},"6104","Egress Opening Area (sq.ft.)",{"$f":"(D913*D914)/144","v":-0.203125}]
[{"$f":"IF(OR(ModelNo=\"6202\",ModelNo=\"6205\",ModelNo=\"6206\",ModelNo=\"6208\",ModelNo=\"6275\",ModelNo=\"8202\",ModelNo=\"8205\",ModelNo=\"8206\",ModelNo=\"8208\",ModelNo=\"8275\"),1,\"\")","v":""},6202,"Sash Width",{"$f":"(Frame_Width/2)-0.0625","v":-6.25E-2}]
[{"$f":"IF(OR(ModelNo=\"6202\",ModelNo=\"6205\",ModelNo=\"6206\",ModelNo=\"6208\",ModelNo=\"6275\",ModelNo=\"8202\",ModelNo=\"8205\",ModelNo=\"8206\",ModelNo=\"8208\",ModelNo=\"8275\"),2,\"\")","v":""},6202,"Sash Height",{"$f":"Frame_Height-3.25","v":-3.25}]
[{"$f":"IF(OR(ModelNo=\"6202\",ModelNo=\"6205\",ModelNo=\"6206\",ModelNo=\"6208\",ModelNo=\"6275\",ModelNo=\"8202\",ModelNo=\"8205\",ModelNo=\"8206\",ModelNo=\"8208\",ModelNo=\"8275\"),3,\"\")","v":""},6202,"Operating Sash Roller Track Length",{"$f":"Frame_Width-1.875","v":-1.875}]
[{"$f":"IF(OR(ModelNo=\"6202\",ModelNo=\"6205\",ModelNo=\"6206\",ModelNo=\"6208\",ModelNo=\"6275\",ModelNo=\"8202\",ModelNo=\"8205\",ModelNo=\"8206\",ModelNo=\"8208\",ModelNo=\"8275\"),4,\"\")","v":""},6202,"Screen Roller Track Length",{"$f":"Frame_Width-1.8125","v":-1.8125}]
[{"$f":"IF(OR(ModelNo=\"6202\",ModelNo=\"6205\",ModelNo=\"6206\",ModelNo=\"6208\",ModelNo=\"6275\",ModelNo=\"8202\",ModelNo=\"8205\",ModelNo=\"8206\",ModelNo=\"8208\",ModelNo=\"8275\"),5,\"\")","v":""},6202,"Fixed Panel Support",{"$f":"(Frame_Width/2)-0.1875","v":-0.1875}]
[{"$f":"IF(OR(ModelNo=\"6202\",ModelNo=\"6205\",ModelNo=\"6206\",ModelNo=\"6208\",ModelNo=\"6275\",ModelNo=\"8202\",ModelNo=\"8205\",ModelNo=\"8206\",ModelNo=\"8208\",ModelNo=\"8275\"),6,\"\")","v":""},6202,"Glass Width",{"$f":"(Frame_Width/2)-3.6875","v":-3.6875}]
[{"$f":"IF(OR(ModelNo=\"6202\",ModelNo=\"6205\",ModelNo=\"6206\",ModelNo=\"6208\",ModelNo=\"6275\",ModelNo=\"8202\",ModelNo=\"8205\",ModelNo=\"8206\",ModelNo=\"8208\",ModelNo=\"8275\"),7,\"\")","v":""},6202,"Glass Height",{"$f":"Frame_Height-6.875","v":-6.875}]
[{"$f":"IF(OR(ModelNo=\"6202\",ModelNo=\"6205\",ModelNo=\"6206\",ModelNo=\"6208\",ModelNo=\"6275\",ModelNo=\"8202\",ModelNo=\"8205\",ModelNo=\"8206\",ModelNo=\"8208\",ModelNo=\"8275\"),8,\"\")","v":""},6202,"Screen Width",{"$f":"(Frame_Width/2)-1.5","v":-1.5}]
[{"$f":"IF(OR(ModelNo=\"6202\",ModelNo=\"6205\",ModelNo=\"6206\",ModelNo=\"6208\",ModelNo=\"6275\",ModelNo=\"8202\",ModelNo=\"8205\",ModelNo=\"8206\",ModelNo=\"8208\",ModelNo=\"8275\"),9,\"\")","v":""},6202,"Screen Height",{"$f":"Frame_Height-2.75","v":-2.75}]
[{"$f":"IF(OR(ModelNo=\"6202\",ModelNo=\"6205\",ModelNo=\"6206\",ModelNo=\"6208\",ModelNo=\"6275\",ModelNo=\"8202\",ModelNo=\"8205\",ModelNo=\"8206\",ModelNo=\"8208\",ModelNo=\"8275\"),10,\"\")","v":""},6202,"Egress Opening Width",{"$f":"Frame_Width-D916-((2.108*2)+2.5)","v":-6.6535000000000002}]
[{"$f":"IF(OR(ModelNo=\"6202\",ModelNo=\"6205\",ModelNo=\"6206\",ModelNo=\"6208\",ModelNo=\"6275\",ModelNo=\"8202\",ModelNo=\"8205\",ModelNo=\"8206\",ModelNo=\"8208\",ModelNo=\"8275\"),11,\"\")","v":""},6202,"Egress Opening Height",{"$f":"Frame_Height-(2.108*2)","v":-4.2160000000000002}]
[{"$f":"IF(OR(ModelNo=\"6202\",ModelNo=\"6205\",ModelNo=\"6206\",ModelNo=\"6208\",ModelNo=\"6275\",ModelNo=\"8202\",ModelNo=\"8205\",ModelNo=\"8206\",ModelNo=\"8208\",ModelNo=\"8275\"),12,\"\")","v":""},6202,"Egress Opening Area (sq.ft.)",{"$f":"(D925*D926)/144","v":0.19479969444444445}]
[{"$f":"IF(OR(ModelNo=\"6203\",ModelNo=\"6209\",ModelNo=\"6222\",ModelNo=\"8203\",ModelNo=\"8209\",ModelNo=\"8222\"),1,\"\")","v":""},6203,"Sash Width",{"$f":"TRUNC(((Frame_Width+0.375)/3)*16+0.5)/16","v":0.125}]
[{"$f":"IF(OR(ModelNo=\"6203\",ModelNo=\"6209\",ModelNo=\"6222\",ModelNo=\"8203\",ModelNo=\"8209\",ModelNo=\"8222\"),2,\"\")","v":""},6203,"Sash Height",{"$f":"Frame_Height-3.25","v":-3.25}]
[{"$f":"IF(OR(ModelNo=\"6203\",ModelNo=\"6209\",ModelNo=\"6222\",ModelNo=\"8203\",ModelNo=\"8209\",ModelNo=\"8222\"),3,\"\")","v":""},6203,"Operating Sash Roller Track Length",{"$f":"TRUNC((((2*Frame_Width)-4.3125)/3)*16+0.5)/16","v":-1.375}]
[{"$f":"IF(OR(ModelNo=\"6203\",ModelNo=\"6209\",ModelNo=\"6222\",ModelNo=\"8203\",ModelNo=\"8209\",ModelNo=\"8222\"),4,\"\")","v":""},6203,"Screen Roller Track Length",{"$f":"TRUNC(((Frame_Width-0.75)/3)*16+0.5)/16","v":-0.1875}]
[{"$f":"IF(OR(ModelNo=\"6203\",ModelNo=\"6209\",ModelNo=\"6222\",ModelNo=\"8203\",ModelNo=\"8209\",ModelNo=\"8222\"),5,\"\")","v":""},6203,"Fixed Panel Support",{"$f":"TRUNC((Frame_Width/3)*16+0.5)/16","v":0}]
[{"$f":"IF(OR(ModelNo=\"6203\",ModelNo=\"6209\",ModelNo=\"6222\",ModelNo=\"8203\",ModelNo=\"8209\",ModelNo=\"8222\"),6,\"\")","v":""},6203,"Glass Width",{"$f":"TRUNC(((Frame_Width/3)-3.5)*16+0.5)/16","v":-3.4375}]
[{"$f":"IF(OR(ModelNo=\"6203\",ModelNo=\"6209\",ModelNo=\"6222\",ModelNo=\"8203\",ModelNo=\"8209\",ModelNo=\"8222\"),7,\"\")","v":""},6203,"Glass Height",{"$f":"Frame_Height-6.875","v":-6.875}]
[{"$f":"IF(OR(ModelNo=\"6203\",ModelNo=\"6209\",ModelNo=\"6222\",ModelNo=\"8203\",ModelNo=\"8209\",ModelNo=\"8222\"),8,\"\")","v":""},6203,"Screen Width",{"$f":"TRUNC(((Frame_Width-3.9375)/3)*16+0.5)/16","v":-1.25}]
[{"$f":"IF(OR(ModelNo=\"6203\",ModelNo=\"6209\",ModelNo=\"6222\",ModelNo=\"8203\",ModelNo=\"8209\",ModelNo=\"8222\"),9,\"\")","v":""},6203,"Screen Height",{"$f":"Frame_Height-2.75","v":-2.75}]
[{"$f":"IF(OR(ModelNo=\"6203\",ModelNo=\"6209\",ModelNo=\"6222\",ModelNo=\"8203\",ModelNo=\"8209\",ModelNo=\"8222\"),10,\"\")","v":""},6203,"Egress Opening Width",{"$f":"Frame_Width-(2.108*2)-(D928*2)-2.5-0.5","v":-7.4660000000000002}]
[{"$f":"IF(OR(ModelNo=\"6203\",ModelNo=\"6209\",ModelNo=\"6222\",ModelNo=\"8203\",ModelNo=\"8209\",ModelNo=\"8222\"),11,\"\")","v":""},6203,"Egress Opening Height",{"$f":"Frame_Height-(2.108*2)","v":-4.2160000000000002}]
[{"$f":"IF(OR(ModelNo=\"6203\",ModelNo=\"6209\",ModelNo=\"6222\",ModelNo=\"8203\",ModelNo=\"8209\",ModelNo=\"8222\"),12,\"\")","v":""},6203,"Egress Opening Area (sq.ft.)",{"$f":"(D937*D938)/144","v":0.21858788888888891}]
[{"$f":"IF(OR(ModelNo=\"6204\",ModelNo=\"6212\",ModelNo=\"8204\",ModelNo=\"8212\"),1,\"\")","v":""},6204,"Sash Width",{"$f":"(TRUNC(((Frame_Width+1.375)/4)*16+0.5)/16)+0.4375","v":0.8125}]
[{"$f":"IF(OR(ModelNo=\"6204\",ModelNo=\"6212\",ModelNo=\"8204\",ModelNo=\"8212\"),2,\"\")","v":""},6204,"Sash Height",{"$f":"Frame_Height-3.25","v":-3.25}]
[{"$f":"IF(OR(ModelNo=\"6204\",ModelNo=\"6212\",ModelNo=\"8204\",ModelNo=\"8212\"),3,\"\")","v":""},6204,"Operating Sash Roller Track Length",{"$f":"Frame_Width-1.875","v":-1.875}]
[{"$f":"IF(OR(ModelNo=\"6204\",ModelNo=\"6212\",ModelNo=\"8204\",ModelNo=\"8212\"),4,\"\")","v":""},6204,"Screen Roller Track Length",{"$f":"Frame_Width-1.8125","v":-1.8125}]
[{"$f":"IF(OR(ModelNo=\"6204\",ModelNo=\"6212\",ModelNo=\"8204\",ModelNo=\"8212\"),5,\"\")","v":""},6204,"Fixed Panel Support",{"$f":"TRUNC(((Frame_Width+0.875)/4)*16+0.5)/16","v":0.25}]
[{"$f":"IF(OR(ModelNo=\"6204\",ModelNo=\"6212\",ModelNo=\"8204\",ModelNo=\"8212\"),6,\"\")","v":""},6204,"Glass Width",{"$f":"TRUNC(((Frame_Width/4)-3.281)*16+0.5)/16","v":-3.1875}]
[{"$f":"IF(OR(ModelNo=\"6204\",ModelNo=\"6212\",ModelNo=\"8204\",ModelNo=\"8212\"),7,\"\")","v":""},6204,"Glass Height",{"$f":"Frame_Height-6.875","v":-6.875}]
[{"$f":"IF(OR(ModelNo=\"6204\",ModelNo=\"6212\",ModelNo=\"8204\",ModelNo=\"8212\"),8,\"\")","v":""},6204,"Screen Width",{"$f":"TRUNC(((Frame_Width/4)-1.125)*16+0.5)/16","v":-1.0625}]
[{"$f":"IF(OR(ModelNo=\"6204\",ModelNo=\"6212\",ModelNo=\"8204\",ModelNo=\"8212\"),9,\"\")","v":""},6204,"Screen Height",{"$f":"Frame_Height-2.75","v":-2.75}]
[{"$f":"IF(OR(ModelNo=\"6204\",ModelNo=\"6212\",ModelNo=\"8204\",ModelNo=\"8212\"),10,\"\")","v":""},6204,"Egress Opening Width",{"$f":"Frame_Width-(D940*2)-(2.108*2)-(2.5*2)-0.875","v":-11.716000000000001}]
[{"$f":"IF(OR(ModelNo=\"6204\",ModelNo=\"6212\",ModelNo=\"8204\",ModelNo=\"8212\"),11,\"\")","v":""},6204,"Egress Opening Height",{"$f":"Frame_Height-(2.108*2)","v":-4.2160000000000002}]
[{"$f":"IF(OR(ModelNo=\"6204\",ModelNo=\"6212\",ModelNo=\"8204\",ModelNo=\"8212\"),12,\"\")","v":""},6204,"Egress Opening Area (sq.ft.)",{"$f":"(D949*D950)/144","v":0.34301844444444446}]
[{"$f":"IF(OR(ModelNo=\"6402\",ModelNo=\"6405\",ModelNo=\"6406\",ModelNo=\"6408\",ModelNo=\"6475\"),1,\"\")","v":""},"6402","Sash Width",{"$f":"IF(TYPE=2,TRUNC(((Frame_Width/2)+1)*16+0.5)/16,TRUNC(((Frame_Width/2)+0.1875)*16+0.5)/16)","v":0.1875}]
[{"$f":"IF(OR(ModelNo=\"6402\",ModelNo=\"6405\",ModelNo=\"6406\",ModelNo=\"6408\",ModelNo=\"6475\"),2,\"\")","v":""},"6402","Sash Height",{"$f":"Frame_Height-3.375","v":-3.375}]
[{"$f":"IF(OR(ModelNo=\"6402\",ModelNo=\"6405\",ModelNo=\"6406\",ModelNo=\"6408\",ModelNo=\"6475\"),3,\"\")","v":""},"6402","Operating Sash Roller Track Length",{"$f":"IF(TYPE=3,Frame_Width-8.1875,Frame_Width-4.0625)","v":-4.0625}]
[{"$f":"IF(OR(ModelNo=\"6402\",ModelNo=\"6405\",ModelNo=\"6406\",ModelNo=\"6408\",ModelNo=\"6475\"),4,\"\")","v":""},"6402","Screen Roller Track Length (Sill)",{"$f":"IF(TYPE=3,Frame_Width-2.25,\"N/A\")","v":"N/A"}]
[{"$f":"IF(OR(ModelNo=\"6402\",ModelNo=\"6405\",ModelNo=\"6406\",ModelNo=\"6408\",ModelNo=\"6475\"),5,\"\")","v":""},"6402","Screen Roller Track Length (Head)",{"$f":"Frame_Width-3.0625","v":-3.0625}]
[{"$f":"IF(OR(ModelNo=\"6402\",ModelNo=\"6405\",ModelNo=\"6406\",ModelNo=\"6408\",ModelNo=\"6475\"),6,\"\")","v":""},"6402","Fixed Panel Support",{"$f":"IF(TYPE=1,TRUNC(((Frame_Width/2)-0.8125)*16+0.5)/16,IF(TYPE=2,TRUNC(((Frame_Width/2))*32+0.5)/32,IF(TYPE=3,TRUNC(((Frame_Width/2)-10)*32+0.5)/32,\"\")))","v":-0.75}]
[{"$f":"IF(OR(ModelNo=\"6402\",ModelNo=\"6405\",ModelNo=\"6406\",ModelNo=\"6408\",ModelNo=\"6475\"),7,\"\")","v":""},"6402","Glass Width",{"$f":"IF(TYPE=2,TRUNC(((Frame_Width/2)-7.875)*16+0.5)/16,TRUNC(((Frame_Width/2)-5.1875)*16+0.5)/16)","v":-5.125}]
[{"$f":"IF(OR(ModelNo=\"6402\",ModelNo=\"6405\",ModelNo=\"6406\",ModelNo=\"6408\",ModelNo=\"6475\"),8,\"\")","v":""},"6402","Glass Height",{"$f":"IF(TYPE=1,TRUNC((Frame_Height-8.6875)*16+0.5)/16,IF(TYPE=2,TRUNC((Frame_Height-12.1875)*32+0.5)/32,IF(TYPE=3,TRUNC((Frame_Height-14.1875)*32+0.5)/32,\"\")))","v":-8.625}]
[{"$f":"IF(OR(ModelNo=\"6402\",ModelNo=\"6405\",ModelNo=\"6406\",ModelNo=\"6408\",ModelNo=\"6475\"),9,\"\")","v":""},"6402","Screen Width",{"$f":"(Frame_Width/2)-0.125","v":-0.125}]
[{"$f":"IF(OR(ModelNo=\"6402\",ModelNo=\"6405\",ModelNo=\"6406\",ModelNo=\"6408\",ModelNo=\"6475\"),10,\"\")","v":""},"6402","Screen Height",{"$f":"IF(TYPE=3,Frame_Height-2.9375,Frame_Height-2.5625)","v":-2.5625}]
[{"$f":"IF(OR(ModelNo=\"6402\",ModelNo=\"6405\",ModelNo=\"6406\",ModelNo=\"6408\",ModelNo=\"6475\"),11,\"\")","v":""},"6402","Egress Opening Width",{"$f":"TRUNC((Frame_Width-D952-(2.176*2)-4)*16+0.5)/16","v":-8.5}]
[{"$f":"IF(OR(ModelNo=\"6402\",ModelNo=\"6405\",ModelNo=\"6406\",ModelNo=\"6408\",ModelNo=\"6475\"),12,\"\")","v":""},"6402","Egress Opening Height",{"$f":"Frame_Height-(2.25*2)","v":-4.5}]
[{"$f":"IF(OR(ModelNo=\"6402\",ModelNo=\"6405\",ModelNo=\"6406\",ModelNo=\"6408\",ModelNo=\"6475\"),13,\"\")","v":""},"6402","Egress Opening Area (sq.ft.)",{"$f":"(D963*D962)/144","v":0.265625}]
[{"$f":"IF(OR(ModelNo=\"6403\",ModelNo=\"6409\",ModelNo=\"6422\"),1,\"\")","v":""},"6403","Sash Width",{"$f":"IF(TYPE=2,TRUNC(((Frame_Width/3)+0.958)*16+0.5)/16,TRUNC(((Frame_Width/3)+0.333)*16+0.5)/16)","v":0.3125}]
[{"$f":"IF(OR(ModelNo=\"6403\",ModelNo=\"6409\",ModelNo=\"6422\"),2,\"\")","v":""},"6403","Sash Height",{"$f":"Frame_Height-3.375","v":-3.375}]
[{"$f":"IF(OR(ModelNo=\"6403\",ModelNo=\"6409\",ModelNo=\"6422\"),3,\"\")","v":""},"6403","Operating Sash Roller Track Length",{"$f":"IF(TYPE=3,Frame_Width-12.375,Frame_Width-4.0625)","v":-4.0625}]
[{"$f":"IF(OR(ModelNo=\"6403\",ModelNo=\"6409\",ModelNo=\"6422\"),4,\"\")","v":""},"6403","Screen Roller Track Length (Sill)",{"$f":"IF(TYPE=3,Frame_Width-2.25,\"N/A\")","v":"N/A"}]
[{"$f":"IF(OR(ModelNo=\"6403\",ModelNo=\"6409\",ModelNo=\"6422\"),5,\"\")","v":""},"6403","Screen Roller Track Length (Head)",{"$f":"Frame_Width-3.0625","v":-3.0625}]
[{"$f":"IF(OR(ModelNo=\"6403\",ModelNo=\"6409\",ModelNo=\"6422\"),6,\"\")","v":""},"6403","Fixed Panel Support",{"$f":"IF(TYPE=1,TRUNC(((Frame_Width/3)-0.541)*16+0.5)/16,IF(TYPE=2,TRUNC(((Frame_Width/3)+0.042)*32+0.5)/32,IF(TYPE=3,TRUNC(((Frame_Width/3)-9.854)*32+0.5)/32,\"\")))","v":-0.5}]
[{"$f":"IF(OR(ModelNo=\"6403\",ModelNo=\"6409\",ModelNo=\"6422\"),7,\"\")","v":""},"6403","Glass Width",{"$f":"IF(TYPE=2,TRUNC(((Frame_Width/3)-7.917)*16+0.5)/16,TRUNC(((Frame_Width/3)-5.042)*16+0.5)/16)","v":-5}]
[{"$f":"IF(OR(ModelNo=\"6403\",ModelNo=\"6409\",ModelNo=\"6422\"),8,\"\")","v":""},"6403","Glass Height",{"$f":"IF(TYPE=1,TRUNC((Frame_Height-8.6875)*16+0.5)/16,IF(TYPE=2,TRUNC((Frame_Height-12.1875)*32+0.5)/32,IF(TYPE=3,TRUNC((Frame_Height-14.1875)*32+0.5)/32,\"\")))","v":-8.625}]
[{"$f":"IF(OR(ModelNo=\"6403\",ModelNo=\"6409\",ModelNo=\"6422\"),9,\"\")","v":""},"6403","Screen Width",{"$f":"TRUNC(((Frame_Width/3)+0.021)*16+0.5)/16","v":0}]
[{"$f":"IF(OR(ModelNo=\"6403\",ModelNo=\"6409\",ModelNo=\"6422\"),10,\"\")","v":""},"6403","Screen Height",{"$f":"IF(TYPE=3,Frame_Height-2.9375,Frame_Height-2.5625)","v":-2.5625}]
[{"$f":"IF(OR(ModelNo=\"6403\",ModelNo=\"6409\",ModelNo=\"6422\"),11,\"\")","v":""},"6403","Egress Opening Width",{"$f":"(TRUNC((Frame_Width-(D965*2)-(2.176*2)-4)*16+0.5)/16)+0.875","v":-8.0625}]
[{"$f":"IF(OR(ModelNo=\"6403\",ModelNo=\"6409\",ModelNo=\"6422\"),12,\"\")","v":""},"6403","Egress Opening Height",{"$f":"Frame_Height-(2.25*2)","v":-4.5}]
[{"$f":"IF(OR(ModelNo=\"6403\",ModelNo=\"6409\",ModelNo=\"6422\"),13,\"\")","v":""},"6403","Egress Opening Area (sq.ft.)",{"$f":"(D976*D975)/144","v":0.251953125}]
[{"$f":"IF(OR(ModelNo=\"6404\",ModelNo=\"6412\"),1,\"\")","v":""},"6404","Sash Width",{"$f":"IF(TYPE=2,TRUNC(((Frame_Width/4)+1.4375)*16+0.5)/16,TRUNC(((Frame_Width/4)+0.625)*16+0.5)/16)","v":0.625}]
[{"$f":"IF(OR(ModelNo=\"6404\",ModelNo=\"6412\"),2,\"\")","v":""},"6404","Sash Height",{"$f":"Frame_Height-3.375","v":-3.375}]
[{"$f":"IF(OR(ModelNo=\"6404\",ModelNo=\"6412\"),3,\"\")","v":""},"6404","Operating Sash Roller Track Length",{"$f":"IF(TYPE=3,Frame_Width-12.375,Frame_Width-4.0625)","v":-4.0625}]
[{"$f":"IF(OR(ModelNo=\"6404\",ModelNo=\"6412\"),4,\"\")","v":""},"6404","Screen Roller Track Length (Sill)",{"$f":"IF(TYPE=3,Frame_Width-2.25,\"N/A\")","v":"N/A"}]
[{"$f":"IF(OR(ModelNo=\"6404\",ModelNo=\"6412\"),5,\"\")","v":""},"6404","Screen Roller Track Length (Head)",{"$f":"Frame_Width-3.0625","v":-3.0625}]
[{"$f":"IF(OR(ModelNo=\"6404\",ModelNo=\"6412\"),6,\"\")","v":""},"6404","Fixed Panel Support",{"$f":"IF(TYPE=1,TRUNC(((Frame_Width/4)-0.375)*16+0.5)/16,IF(TYPE=2,TRUNC(((Frame_Width/4)+0.437)*32+0.5)/32,IF(TYPE=3,TRUNC(((Frame_Width/4)-9.5625)*32+0.5)/32,\"\")))","v":-0.3125}]
[{"$f":"IF(OR(ModelNo=\"6404\",ModelNo=\"6412\"),7,\"\")","v":""},"6404","Glass Width",{"$f":"IF(TYPE=2,TRUNC(((Frame_Width/4)-7.4375)*16+0.5)/16,TRUNC(((Frame_Width/4)-4.75)*16+0.5)/16)","v":-4.6875}]
[{"$f":"IF(OR(ModelNo=\"6404\",ModelNo=\"6412\"),8,\"\")","v":""},"6404","Glass Height",{"$f":"IF(TYPE=1,TRUNC((Frame_Height-8.6875)*16+0.5)/16,IF(TYPE=2,TRUNC((Frame_Height-12.1875)*32+0.5)/32,IF(TYPE=3,TRUNC((Frame_Height-14.1875)*32+0.5)/32,\"\")))","v":-8.625}]
[{"$f":"IF(OR(ModelNo=\"6404\",ModelNo=\"6412\"),9,\"\")","v":""},"6404","Screen Width",{"$f":"TRUNC(((Frame_Width/4)+0.3125)*16+0.5)/16","v":0.3125}]
[{"$f":"IF(OR(ModelNo=\"6404\",ModelNo=\"6412\"),10,\"\")","v":""},"6404","Screen Height",{"$f":"IF(TYPE=3,Frame_Height-2.9375,Frame_Height-2.5625)","v":-2.5625}]
[{"$f":"IF(OR(ModelNo=\"6404\",ModelNo=\"6412\"),11,\"\")","v":""},"6404","Egress Opening Width",{"$f":"TRUNC(((Frame_Width-(D978+4.375)*2)-2.1875)*16+0.5)/16","v":-12.125}]
[{"$f":"IF(OR(ModelNo=\"6404\",ModelNo=\"6412\"),12,\"\")","v":""},"6404","Egress Opening Height",{"$f":"Frame_Height-(2.25*2)","v":-4.5}]
[{"$f":"IF(OR(ModelNo=\"6404\",ModelNo=\"6412\"),13,\"\")","v":""},"6404","Egress Opening Area (sq.ft.)",{"$f":"(D989*D988)/144","v":0.37890625}]
[{"$f":"IF(ModelNo=B991,1,\"\")","v":""},"3001","Top Sash Width",{"$f":"Frame_Width-4.125","v":-4.125}]
[{"$f":"IF(ModelNo=B992,2,\"\")","v":""},"3001","Top Sash Height",{"$f":"DDIM3001-1.625","v":-1.625}]
[{"$f":"IF(ModelNo=B993,3,\"\")","v":""},"3001","Bottom Sash Width",{"$f":"Frame_Width-3.125","v":-3.125}]
[{"$f":"IF(ModelNo=B994,4,\"\")","v":""},"3001","Bottom Sash Height",{"$f":"CDIM3001-0.625","v":-0.625}]
[{"$f":"IF(ModelNo=B995,5,\"\")","v":""},"3001","Top Glass Width",{"$f":"CMR!$E$103","v":-5.75}]
[{"$f":"IF(ModelNo=B996,6,\"\")","v":""},"3001","Top Glass Height",{"$f":"CMR!$E$105","v":-3.21875}]
[{"$f":"IF(ModelNo=B997,7,\"\")","v":""},"3001","Bottom Glass Width",{"$f":"CMR!$E$104","v":-4.75}]
[{"$f":"IF(ModelNo=B998,8,\"\")","v":""},"3001","Bottom Glass Height",{"$f":"CMR!$E$106","v":-2.21875}]
[{"$f":"IF(ModelNo=B999,9,\"\")","v":""},"3001","Screen Width",{"$f":"IF(Screen=\"H\",Frame_Width-4.5,Frame_Width-4.5625)","v":-4.5}]
[{"$f":"IF(ModelNo=B1000,10,\"\")","v":""},"3001","Screen Height",{"$f":"IF(Screen=\"L\",TRUNC((CDIM3001-0.75)*16+0.5)/16,IF(Screen=\"F\",TRUNC((Frame_Height-3.3125)*16+0.5)/16,TRUNC((CDIM3001-0.75)*16+0.5)/16))","v":-0.6875}]
[{"$f":"IF(ModelNo=B1001,11,\"\")","v":""},"3001","Top Sash Weight",{"$f":"TOP_WGT&\" \"&\"lb\"","v":{"$error":"#N/A"}}]
[{"$f":"IF(ModelNo=B1002,12,\"\")","v":""},"3001","Top Balance Size",{"$f":"IF(TOP_TUBE=0,\"N/A\",TOP_TUBE)","v":{"$error":"#N/A"}}]
[{"$f":"IF(ModelNo=B1003,13,\"\")","v":""},"3001","Bottom Sash Weight",{"$f":"BTM_WGT&\" \"&\"lb\"","v":{"$error":"#N/A"}}]
[{"$f":"IF(ModelNo=B1004,14,\"\")","v":""},"3001","Bottom Balance Size",{"$f":"IF(BTM_TUBE=0,\"N/A\",BTM_TUBE)","v":{"$error":"#N/A"}}]
[{"$f":"IF(ModelNo=B1005,15,\"\")","v":""},"3001","Egress Opening Width",{"$f":"EW","v":{"$error":"#N/A"}}]
[{"$f":"IF(ModelNo=B1006,16,\"\")","v":""},"3001","Egress Opening Height",{"$f":"EH","v":{"$error":"#N/A"}}]
[{"$f":"IF(ModelNo=B1007,17,\"\")","v":""},"3001","Egress Opening Area (sq.ft.)",{"$f":"EO","v":{"$error":"#N/A"}}]
[{"$f":"IF(ModelNo=B1008,1,\"\")","v":""},"3002","Sash Width",{"$f":"(Frame_Width/2)-0.875","v":-0.875}]
[{"$f":"IF(ModelNo=B1009,2,\"\")","v":""},"3002","Sash Height",{"$f":"Frame_Height-3.8125","v":-3.8125}]
[{"$f":"IF(ModelNo=B1010,3,\"\")","v":""},"3002","Roller Track Length",{"$f":"Frame_Width-2.6875","v":-2.6875}]
[{"$f":"IF(ModelNo=B1011,4,\"\")","v":""},"3002","Glass Width",{"$f":"(Frame_Width/2)-2.5625","v":-2.5625}]
[{"$f":"IF(ModelNo=B1012,5,\"\")","v":""},"3002","Glass Height",{"$f":"Frame_Height-5.4375","v":-5.4375}]
[{"$f":"IF(ModelNo=B1013,6,\"\")","v":""},"3002","Screen Width",{"$f":"IF(Screen=\"F\",Frame_Width-5,IF(Screen=\"L\",\"N/A\",(Frame_Width/2)-2.4375))","v":-2.4375}]
[{"$f":"IF(ModelNo=B1014,7,\"\")","v":""},"3002","Screen Height",{"$f":"Frame_Height-4.5625","v":-4.5625}]
[{"$f":"IF(ModelNo=B1015,8,\"\")","v":""},"3002","Egress Opening Width",{"$f":"(Frame_Width/2)-4.75","v":-4.75}]
[{"$f":"IF(ModelNo=B1016,9,\"\")","v":""},"3002","Egress Opening Height",{"$f":"Frame_Height-5.25","v":-5.25}]
[{"$f":"IF(ModelNo=B1017,10,\"\")","v":""},"3002","Egress Opening Area (sq.ft.)",{"$f":"(D1015*D1016)/144","v":0.17317708333333334}]
[{"$f":"IF(ModelNo=B1018,1,\"\")","v":""},"3003","Operating Sash Width",{"$f":"TRUNC((((Frame_Width/4)+0.1875))*16+0.5)/16","v":0.1875}]
[{"$f":"IF(ModelNo=B1019,2,\"\")","v":""},"3003","Operating Sash Height",{"$f":"Frame_Height-3.8125","v":-3.8125}]
[{"$f":"IF(ModelNo=B1020,3,\"\")","v":""},"3003","Fixed Sash Width",{"$f":"(Frame_Width-(2*(TRUNC((((Frame_Width/4)+1))*16+0.5)/16)))+0.75","v":-1.25}]
[{"$f":"IF(ModelNo=B1021,4,\"\")","v":""},"3003","Fixed Sash Height",{"$f":"Frame_Height-3.8125","v":-3.8125}]
[{"$f":"IF(ModelNo=B1022,5,\"\")","v":""},"3003","Roller Track Length",{"$f":"Frame_Width-2.6875","v":-2.6875}]
[{"$f":"IF(ModelNo=B1023,6,\"\")","v":""},"3003","Operating Sash Glass Width",{"$f":"TRUNC(((TRUNC((((Frame_Width/4)+0.1875))*16+0.5)/16)-1.6875)*16+0.5)/16","v":-1.4375}]
[{"$f":"IF(ModelNo=B1024,7,\"\")","v":""},"3003","Operating Sash Glass Height",{"$f":"Frame_Height-5.4375","v":-5.4375}]
[{"$f":"IF(ModelNo=B1025,8,\"\")","v":""},"3003","Fixed Sash Glass Width",{"$f":"TRUNC((((Frame_Width-(2*(TRUNC((((Frame_Width/4)+1))*16+0.5)/16)))+0.75)-1.6875)*16+0.5)/16","v":-2.875}]
[{"$f":"IF(ModelNo=B1026,9,\"\")","v":""},"3003","Fixed Sash Glass Height",{"$f":"Frame_Height-5.4375","v":-5.4375}]
[{"$f":"IF(ModelNo=B1027,10,\"\")","v":""},"3003","Screen Width",{"$f":"IF(Screen=\"F\",Frame_Width-5,IF(Screen=\"L\",\"N/A\",TRUNC(((Frame_Width/4)-1.25)*16+0.5)/16))","v":-1.1875}]
[{"$f":"IF(ModelNo=B1028,11,\"\")","v":""},"3003","Screen Height",{"$f":"Frame_Height-4.5625","v":-4.5625}]
[{"$f":"IF(ModelNo=B1029,12,\"\")","v":""},"3003","Egress Opening Width",{"$f":"(Frame_Width/4)-2.25","v":-2.25}]
[{"$f":"IF(ModelNo=B1030,13,\"\")","v":""},"3003","Egress Opening Height",{"$f":"Frame_Height-5.25","v":-5.25}]
[{"$f":"IF(ModelNo=B1031,14,\"\")","v":""},"3003","Egress Opening Area (sq.ft.)",{"$f":"(D1029*D1030)/144","v":8.203125E-2}]
[{"$f":"IF(OR(ModelNo=\"3004\",ModelNo=\"03A4\"),1,\"\")","v":""},"3004","Glass Width",{"$f":"Frame_Width-4.1875","v":-4.1875}]
[{"$f":"IF(OR(ModelNo=\"3004\",ModelNo=\"03A4\"),2,\"\")","v":""},"3004","Glass Height",{"$f":"Frame_Height-4.1875","v":-4.1875}]
[{"$f":"IF(OR(ModelNo=\"3004\",ModelNo=\"03A4\"),3,\"\")","v":""},"3004","Glass Area (sq.ft.)",{"$f":"(D1032*D1033)/144","v":0.12177191840277778}]
[{"$f":"IF(ModelNo=B1035,1,\"\")","v":""},"3009","Operating Sash Width",{"$f":"TRUNC(((Frame_Width/3)-0.3125)*16+0.5)/16","v":-0.25}]
[{"$f":"IF(ModelNo=B1036,2,\"\")","v":""},"3009","Operating Sash Height",{"$f":"Frame_Height-3.8125","v":-3.8125}]
[{"$f":"IF(ModelNo=B1037,3,\"\")","v":""},"3009","Fixed Sash Width",{"$f":"TRUNC(((Frame_Width/3)-0.25)*16+0.5)/16","v":-0.1875}]
[{"$f":"IF(ModelNo=B1038,4,\"\")","v":""},"3009","Fixed Sash Height",{"$f":"Frame_Height-3.8125","v":-3.8125}]
[{"$f":"IF(ModelNo=B1039,5,\"\")","v":""},"3009","Roller Track Length",{"$f":"Frame_Width-2.6875","v":-2.6875}]
[{"$f":"IF(ModelNo=B1040,6,\"\")","v":""},"3009","Operating Sash Glass Width",{"$f":"D1035-1.6875","v":-1.9375}]
[{"$f":"IF(ModelNo=B1041,7,\"\")","v":""},"3009","Operating Sash Glass Height",{"$f":"Frame_Height-5.4375","v":-5.4375}]
[{"$f":"IF(ModelNo=B1042,8,\"\")","v":""},"3009","Fixed Sash Glass Width",{"$f":"D1037-1.6875","v":-1.875}]
[{"$f":"IF(ModelNo=B1043,9,\"\")","v":""},"3009","Fixed Sash Glass Height",{"$f":"Frame_Height-5.4375","v":-5.4375}]
[{"$f":"IF(ModelNo=B1044,10,\"\")","v":""},"3009","Screen Width",{"$f":"IF(Screen=\"F\",Frame_Width-5,IF(Screen=\"L\",\"N/A\",(TRUNC((Frame_Width/3+0.625)*16+0.5)/16)-2.375))","v":-1.75}]
[{"$f":"IF(ModelNo=B1045,11,\"\")","v":""},"3009","Screen Height",{"$f":"Frame_Height-4.5625","v":-4.5625}]
[{"$f":"IF(ModelNo=B1046,12,\"\")","v":""},"3009","Egress Opening Width",{"$f":"(Frame_Width/3)-4.375","v":-4.375}]
[{"$f":"IF(ModelNo=B1047,13,\"\")","v":""},"3009","Egress Opening Height",{"$f":"Frame_Height-5.25","v":-5.25}]
[{"$f":"IF(ModelNo=B1048,14,\"\")","v":""},"3009","Egress Opening Area (sq.ft.)",{"$f":"(D1046*D1047)/144","v":0.15950520833333334}]
[{"$f":"IF(ModelNo=B1049,1,\"\")","v":""},"03A0","Bottom Sash Width",{"$f":"Frame_Width-3.125","v":-3.125}]
[{"$f":"IF(ModelNo=B1050,2,\"\")","v":""},"03A0","Bottom Sash Height",{"$f":"CDIM03A0-1.125","v":-1.125}]
[{"$f":"IF(ModelNo=B1051,3,\"\")","v":""},"03A0","Bottom Glass Width",{"$f":"CMR!$E$120","v":-4.75}]
[{"$f":"IF(ModelNo=B1052,4,\"\")","v":""},"03A0","Bottom Glass Height",{"$f":"CMR!$E$122","v":-2.71875}]
[{"$f":"IF(ModelNo=B1053,5,\"\")","v":""},"03A0","Top Glass Width",{"$f":"CMR!$E$119","v":-4.6875}]
[{"$f":"IF(ModelNo=B1054,6,\"\")","v":""},"03A0","Top Glass Height",{"$f":"CMR!$E$121","v":-2.59375}]
[{"$f":"IF(ModelNo=B1055,7,\"\")","v":""},"03A0","Astragal Length",{"$f":"TRUNC((Frame_Width-4.125)*16+0.5)/16","v":-4.0625}]
[{"$f":"IF(ModelNo=B1056,8,\"\")","v":""},"03A0","Screen Width",{"$f":"Frame_Width-4.5","v":-4.5}]
[{"$f":"IF(ModelNo=B1057,9,\"\")","v":""},"03A0","Screen Height",{"$f":"IF(Screen=\"F\",Frame_Height-3.3125,IF(Screen=\"L\",CDIM03A0-1.0625,CDIM03A0-1.3125))","v":-1.3125}]
[{"$f":"IF(ModelNo=B1058,10,\"\")","v":""},"03A0","Bottom Sash Weight",{"$f":"BTM_WGT&\" \"&\"lb\"","v":{"$error":"#N/A"}}]
[{"$f":"IF(ModelNo=B1059,11,\"\")","v":""},"03A0","Balance Size",{"$f":"IF(BTM_TUBE=0,\"N/A\",BTM_TUBE)","v":{"$error":"#N/A"}}]
[{"$f":"IF(ModelNo=B1060,12,\"\")","v":""},"03A0","Egress Opening Width",{"$f":"EW","v":{"$error":"#N/A"}}]
[{"$f":"IF(ModelNo=B1061,13,\"\")","v":""},"03A0","Egress Opening Height",{"$f":"EH","v":{"$error":"#N/A"}}]
[{"$f":"IF(ModelNo=B1062,14,\"\")","v":""},"03A0","Egress Opening Area (sq.ft.)",{"$f":"EO","v":{"$error":"#N/A"}}]
[{"$f":"IF(ModelNo=B1063,1,\"\")","v":""},"03A2","Sash Width",{"$f":"TRUNC(((Frame_Width/2)-1.0625)*16+0.5)/16","v":-1}]
[{"$f":"IF(ModelNo=B1064,2,\"\")","v":""},"03A2","Sash Height",{"$f":"Frame_Height-3.0625","v":-3.0625}]
[{"$f":"IF(ModelNo=B1065,3,\"\")","v":""},"03A2","Roller Track Length",{"$f":"Frame_Width-1.9375","v":-1.9375}]
[{"$f":"IF(ModelNo=B1066,4,\"\")","v":""},"03A2","Sash Glass Width",{"$f":"TRUNC(((Frame_Width/2)-2.75)*16+0.5)/16","v":-2.6875}]
[{"$f":"IF(ModelNo=B1067,5,\"\")","v":""},"03A2","Sash Glass Height",{"$f":"Frame_Height-4.6875","v":-4.6875}]
[{"$f":"IF(ModelNo=B1068,6,\"\")","v":""},"03A2","Fixed Glass Width",{"$f":"TRUNC(((Frame_Width/2)-2.625)*16+0.5)/16","v":-2.5625}]
[{"$f":"IF(ModelNo=B1069,7,\"\")","v":""},"03A2","Fixed Glass Height",{"$f":"TRUNC((Frame_Height-4.8125)*16+0.5)/16","v":-4.75}]
[{"$f":"IF(ModelNo=B1070,8,\"\")","v":""},"03A2","Screen Width",{"$f":"IF(Screen=\"F\",Frame_Width-5,IF(Screen=\"L\",\"N/A\",TRUNC(((Frame_Width/2)-3.0625)*16+0.5)/16))","v":-3}]
[{"$f":"IF(ModelNo=B1071,9,\"\")","v":""},"03A2","Screen Height",{"$f":"Frame_Height-4.5625","v":-4.5625}]
[{"$f":"IF(ModelNo=B1072,10,\"\")","v":""},"03A2","Egress Opening Width",{"$f":"(Frame_Width/2)-4.75","v":-4.75}]
[{"$f":"IF(ModelNo=B1073,11,\"\")","v":""},"03A2","Egress Opening Height",{"$f":"Frame_Height-5.875","v":-5.875}]
[{"$f":"IF(ModelNo=B1074,12,\"\")","v":""},"03A2","Egress Opening Area (sq.ft.)",{"$f":"(D1072*D1073)/144","v":0.19379340277777779}]
[{"$f":"IF(ModelNo=B1075,1,\"\")","v":""},"03A3","Operating Sash Width",{"$f":"TRUNC((((Frame_Width/4)+0.1875))*16+0.5)/16","v":0.1875}]
[{"$f":"IF(ModelNo=B1076,2,\"\")","v":""},"03A3","Operating Sash Height",{"$f":"Frame_Height-3.0625","v":-3.0625}]
[{"$f":"IF(ModelNo=B1077,3,\"\")","v":""},"03A3","Roller Track Length",{"$f":"Frame_Width-1.9375","v":-1.9375}]
[{"$f":"IF(ModelNo=B1078,4,\"\")","v":""},"03A3","Operating Sash Glass Width",{"$f":"D1075-1.6875","v":-1.5}]
[{"$f":"IF(ModelNo=B1079,5,\"\")","v":""},"03A3","Operating Sash Glass Height",{"$f":"Frame_Height-4.6875","v":-4.6875}]
[{"$f":"IF(ModelNo=B1080,6,\"\")","v":""},"03A3","Fixed Sash Glass Width",{"$f":"(Frame_Width-2*(TRUNC((Frame_Width/4+0.6875)*16+0.5)/16))-1.625","v":-3}]
[{"$f":"IF(ModelNo=B1081,7,\"\")","v":""},"03A3","Fixed Sash Glass Height",{"$f":"Frame_Height-4.8125","v":-4.8125}]
[{"$f":"IF(ModelNo=B1082,8,\"\")","v":""},"03A3","Screen Width",{"$f":"IF(Screen=\"F\",Frame_Width-5,IF(Screen=\"L\",\"N/A\",(TRUNC((Frame_Width/4+0.6875)*16+0.5)/16)-2.5))","v":-1.8125}]
[{"$f":"IF(ModelNo=B1083,9,\"\")","v":""},"03A3","Screen Height",{"$f":"Frame_Height-4.5625","v":-4.5625}]
[{"$f":"IF(ModelNo=B1084,10,\"\")","v":""},"03A3","Egress Opening Width",{"$f":"(Frame_Width/4)-2.875","v":-2.875}]
[{"$f":"IF(ModelNo=B1085,11,\"\")","v":""},"03A3","Egress Opening Height",{"$f":"Frame_Height-5.875","v":-5.875}]
[{"$f":"IF(ModelNo=B1086,12,\"\")","v":""},"03A3","Egress Opening Area (sq.ft.)",{"$f":"(D1084*D1085)/144","v":0.11729600694444445}]
[{"$f":"IF(ModelNo=B1087,1,\"\")","v":""},"03A9","Operating Sash Width",{"$f":"TRUNC(((Frame_Width/3)-0.3125)*16+0.5)/16","v":-0.25}]
[{"$f":"IF(ModelNo=B1088,2,\"\")","v":""},"03A9","Operating Sash Height",{"$f":"Frame_Height-3.0625","v":-3.0625}]
[{"$f":"IF(ModelNo=B1089,3,\"\")","v":""},"03A9","Roller Track Length",{"$f":"Frame_Width-1.9375","v":-1.9375}]
[{"$f":"IF(ModelNo=B1090,4,\"\")","v":""},"03A9","Operating Sash Glass Width",{"$f":"TRUNC(((TRUNC(((Frame_Width/3)-0.3125)*16+0.5)/16)-1.6875)*16+0.5)/16","v":-1.875}]
[{"$f":"IF(ModelNo=B1091,5,\"\")","v":""},"03A9","Operating Sash Glass Height",{"$f":"Frame_Height-4.6875","v":-4.6875}]
[{"$f":"IF(ModelNo=B1092,6,\"\")","v":""},"03A9","Fixed Sash Glass Width",{"$f":"((Frame_Width-((TRUNC(((Frame_Width/3)+0.1875)*16+0.5)/16)*2))+1.1875)-2.8125","v":-2}]
[{"$f":"IF(ModelNo=B1093,7,\"\")","v":""},"03A9","Fixed Sash Glass Height",{"$f":"Frame_Height-4.8125","v":-4.8125}]
[{"$f":"IF(ModelNo=B1094,8,\"\")","v":""},"03A9","Screen Width",{"$f":"IF(Screen=\"F\",Frame_Width-5,IF(Screen=\"L\",\"N/A\",(TRUNC((Frame_Width/3+0.1875)*16+0.5)/16)-2.5))","v":-2.3125}]
[{"$f":"IF(ModelNo=B1095,9,\"\")","v":""},"03A9","Screen Height",{"$f":"Frame_Height-4.5625","v":-4.5625}]
[{"$f":"IF(ModelNo=B1096,10,\"\")","v":""},"03A9","Egress Opening Width",{"$f":"(Frame_Width/3)-4.375","v":-4.375}]
[{"$f":"IF(ModelNo=B1097,11,\"\")","v":""},"03A9","Egress Opening Height",{"$f":"Frame_Height-5.875","v":-5.875}]
[{"$f":"IF(ModelNo=B1098,12,\"\")","v":""},"03A9","Egress Opening Area (sq.ft.)",{"$f":"(D1096*D1097)/144","v":0.1784939236111111}]
[{"$f":"IF(ModelNo=B1099,1,\"\")","v":""},"1700","Bottom Sash Width",{"$f":"TRUNC((Frame_Width-2.188)*32+0.5)/32","v":-2.15625}]
[{"$f":"IF(ModelNo=B1100,2,\"\")","v":""},"1700","Bottom Sash Height",{"$f":"TRUNC(((CDIM_1700-0.78125)*32+0.5))/32-0.0625","v":-0.8125}]
[{"$f":"IF(ModelNo=B1101,3,\"\")","v":""},"1700","Bottom Glass Width",{"$f":"D1099-1.3125","v":-3.46875}]
[{"$f":"IF(ModelNo=B1102,4,\"\")","v":""},"1700","Bottom Glass Height",{"$f":"D1100-1.3125","v":-2.125}]
[{"$f":"IF(ModelNo=B1103,5,\"\")","v":""},"1700","Top Glass Width",{"$f":"TRUNC((Frame_Width-3.5)*32+0.5)/32","v":-3.46875}]
[{"$f":"IF(ModelNo=B1104,6,\"\")","v":""},"1700","Top Glass Height",{"$f":"TRUNC((DDIM_1700-2.15625)*32+0.5)/32","v":-2.125}]
[{"$f":"IF(ModelNo=B1105,7,\"\")","v":""},"1700","Astragal Length",{"$f":"TRUNC((Frame_Width-2.95)*16+0.5)/16","v":-2.875}]
[{"$f":"IF(ModelNo=B1106,8,\"\")","v":""},"1700","Screen Width",{"$f":"Frame_Width-3.3125","v":-3.3125}]
[{"$f":"IF(ModelNo=B1107,9,\"\")","v":""},"1700","Screen Height",{"$f":"TRUNC((CDIM_1700-1.4375)*32+0.5)/32","v":-1.40625}]
[{"$f":"IF(ModelNo=B1108,10,\"\")","v":""},"1700","Bottom Sash Weight",{"$f":"IF(ISERROR(BTM_WGT&\" \"&\"lb\"),\"N/A\",BTM_WGT&\" \"&\"lb\")","v":"N/A"}]
[{"$f":"IF(ModelNo=B1109,11,\"\")","v":""},"1700","Balance Size",{"$f":"IF(V_BOTTBALANCE=0,\"N/A\",V_BOTTBALANCE)","v":{"$error":"#N/A"}}]
[{"$f":"IF(ModelNo=B1110,12,\"\")","v":""},"1700","Egress Opening Width",{"$f":"IF(ISERROR(EW),\"N/A\",EW)","v":"N/A"}]
[{"$f":"IF(ModelNo=B1111,13,\"\")","v":""},"1700","Egress Opening Height",{"$f":"IF(ISERROR(EH),\"N/A\",EH)","v":"N/A"}]
[{"$f":"IF(ModelNo=B1112,14,\"\")","v":""},"1700","Egress Opening Area (sq.ft.)",{"$f":"IF(ISERROR(EO),\"N/A\",EO)","v":"N/A"}]
[{"$f":"IF(ModelNo=B1113,1,\"\")","v":""},"1702","Sash Width",{"$f":"CDIM_1702-0.78125","v":-0.78125}]
[{"$f":"IF(ModelNo=B1114,2,\"\")","v":""},"1702","Sash Height",{"$f":"Frame_Height-2.1875","v":-2.1875}]
[{"$f":"IF(ModelNo=B1115,3,\"\")","v":""},"1702","Sash Glass Width",{"$f":"D1113-1.375","v":-2.15625}]
[{"$f":"IF(ModelNo=B1116,4,\"\")","v":""},"1702","Sash Glass Height",{"$f":"D1114-1.3125","v":-3.5}]
[{"$f":"IF(ModelNo=B1117,5,\"\")","v":""},"1702","Fixed Glass Width",{"$f":"TRUNC((DDIM_1702-2.09375)*32+0.5)/32","v":-2.0625}]
[{"$f":"IF(ModelNo=B1118,6,\"\")","v":""},"1702","Fixed Glass Height",{"$f":"Frame_Height-3.5","v":-3.5}]
[{"$f":"IF(ModelNo=B1119,7,\"\")","v":""},"1702","Astragal Length",{"$f":"TRUNC((Frame_Height-2.875)*16+0.5)/16","v":-2.8125}]
[{"$f":"IF(ModelNo=B1120,8,\"\")","v":""},"1702","Roller Track Length",{"$f":"TRUNC((Frame_Width-1)*16+0.5)/16","v":-0.9375}]
[{"$f":"IF(ModelNo=B1121,9,\"\")","v":""},"1702","Screen Width",{"$f":"TRUNC((CDIM_1702-2.4375)*32+0.5)/32","v":-2.40625}]
[{"$f":"IF(ModelNo=B1122,10,\"\")","v":""},"1702","Screen Height",{"$f":"TRUNC((Frame_Height-3.375)*16+0.5)/16","v":-3.3125}]
[{"$f":"IF(ModelNo=B1123,11,\"\")","v":""},"1702","Egress Opening Width",{"$f":"CDIM_1702-3.625","v":-3.625}]
[{"$f":"IF(ModelNo=B1124,12,\"\")","v":""},"1702","Egress Opening Height",{"$f":"Frame_Height-4.5","v":-4.5}]
[{"$f":"IF(ModelNo=B1125,13,\"\")","v":""},"1702","Egress Opening Area (sq.ft.)",{"$f":"(D1123*D1124)/144","v":0.11328125}]
[{"$f":"IF(ModelNo=B1126,1,\"\")","v":""},"1703","Sash Width",{"$f":"(Frame_Width/4)-0.0625","v":-6.25E-2}]
[{"$f":"IF(ModelNo=B1127,2,\"\")","v":""},"1703","Sash Height",{"$f":"Frame_Height-2.1875","v":-2.1875}]
[{"$f":"IF(ModelNo=B1128,3,\"\")","v":""},"1703","Sash Glass Width",{"$f":"D1126-1.375","v":-1.4375}]
[{"$f":"IF(ModelNo=B1129,4,\"\")","v":""},"1703","Sash Glass Height",{"$f":"D1127-1.3125","v":-3.5}]
[{"$f":"IF(ModelNo=B1130,5,\"\")","v":""},"1703","Fixed Glass Width",{"$f":"(Frame_Width/2)-2.09375","v":-2.09375}]
[{"$f":"IF(ModelNo=B1131,6,\"\")","v":""},"1703","Fixed Glass Height",{"$f":"Frame_Height-3.5","v":-3.5}]
[{"$f":"IF(ModelNo=B1132,7,\"\")","v":""},"1703","Astragal Length",{"$f":"TRUNC((Frame_Height-2.875)*16+0.5)/16","v":-2.8125}]
[{"$f":"IF(ModelNo=B1133,8,\"\")","v":""},"1703","Roller Track Length",{"$f":"TRUNC((Frame_Width-1)*16+0.5)/16","v":-0.9375}]
[{"$f":"IF(ModelNo=B1134,9,\"\")","v":""},"1703","Screen Width",{"$f":"TRUNC((Frame_Width/4-1.75)*16+0.5)/16","v":-1.6875}]
[{"$f":"IF(ModelNo=B1135,10,\"\")","v":""},"1703","Screen Height",{"$f":"TRUNC((Frame_Height-3.375)*16+0.5)/16","v":-3.3125}]
[{"$f":"IF(ModelNo=B1136,11,\"\")","v":""},"1703","Egress Opening Width",{"$f":"(Frame_Width/4)-3.25","v":-3.25}]
[{"$f":"IF(ModelNo=B1137,12,\"\")","v":""},"1703","Egress Opening Height",{"$f":"Frame_Height-4.5","v":-4.5}]
[{"$f":"IF(ModelNo=B1138,13,\"\")","v":""},"1703","Egress Opening Area (sq.ft.)",{"$f":"(D1136*D1137)/144","v":0.1015625}]
[{"$f":"IF(ModelNo=B1139,1,\"\")","v":""},"1709","Sash Width",{"$f":"TRUNC((Frame_Width/3-0.375)*16+0.5)/16","v":-0.3125}]
[{"$f":"IF(ModelNo=B1140,2,\"\")","v":""},"1709","Sash Height",{"$f":"Frame_Height-2.1875","v":-2.1875}]
[{"$f":"IF(ModelNo=B1141,3,\"\")","v":""},"1709","Sash Glass Width",{"$f":"D1139-1.375","v":-1.6875}]
[{"$f":"IF(ModelNo=B1142,4,\"\")","v":""},"1709","Sash Glass Height",{"$f":"D1140-1.3125","v":-3.5}]
[{"$f":"IF(ModelNo=B1143,5,\"\")","v":""},"1709","Fixed Glass Width",{"$f":"TRUNC((Frame_Width/3-1.6875)*16+0.5)/16","v":-1.625}]
[{"$f":"IF(ModelNo=B1144,6,\"\")","v":""},"1709","Fixed Glass Height",{"$f":"TRUNC((Frame_Height-3.5)*16+0.5)/16","v":-3.4375}]
[{"$f":"IF(ModelNo=B1145,7,\"\")","v":""},"1709","Astragal Length",{"$f":"Frame_Height-2.875","v":-2.875}]
[{"$f":"IF(ModelNo=B1146,8,\"\")","v":""},"1709","Roller Track Length",{"$f":"TRUNC((Frame_Width-1)*16+0.5)/16","v":-0.9375}]
[{"$f":"IF(ModelNo=B1147,9,\"\")","v":""},"1709","Screen Width",{"$f":"TRUNC((Frame_Width/3-1.9375)*16+0.5)/16","v":-1.875}]
[{"$f":"IF(ModelNo=B1148,10,\"\")","v":""},"1709","Screen Height",{"$f":"Frame_Height-3.375","v":-3.375}]
[{"$f":"IF(ModelNo=B1149,11,\"\")","v":""},"1709","Egress Opening Width",{"$f":"(Frame_Width/3)-2.875","v":-2.875}]
[{"$f":"IF(ModelNo=B1150,12,\"\")","v":""},"1709","Egress Opening Height",{"$f":"Frame_Height-4.5","v":-4.5}]
[{"$f":"IF(ModelNo=B1151,13,\"\")","v":""},"1709","Egress Opening Area (sq.ft.)",{"$f":"(D1149*D1150)/144","v":8.984375E-2}]
[{"$f":"IF(ModelNo=B1152,1,\"\")","v":""},"1704","Glass Width",{"$f":"Frame_Width-3.5","v":-3.5}]
[{"$f":"IF(ModelNo=B1153,2,\"\")","v":""},"1704","Glass Height",{"$f":"Frame_Height-3.5","v":-3.5}]
[{"$f":"IF(ModelNo=B1154,3,\"\")","v":""},"1704","Glass Area (sq.ft.)",{"$f":"(D1152*D1153)/144","v":8.5069444444444448E-2}]
[{"$f":"IF(ModelNo=B1155,1,\"\")","v":""},"1720","Bottom Sash Width",{"$f":"TRUNC((Frame_Width/2-2.4375)*32+0.5)/32","v":-2.40625}]
[{"$f":"IF(ModelNo=B1156,2,\"\")","v":""},"1720","Bottom Sash Height",{"$f":"TRUNC(((CDIM_1720-0.84375)*32+0.5))/32","v":-0.8125}]
[{"$f":"IF(ModelNo=B1157,3,\"\")","v":""},"1720","Bottom Glass Width",{"$f":"TRUNC((D1155-1.3125)*32+0.5)/32","v":-3.6875}]
[{"$f":"IF(ModelNo=B1158,4,\"\")","v":""},"1720","Bottom Glass Height",{"$f":"TRUNC((D1156-1.312)*32+0.5)/32","v":-2.09375}]
[{"$f":"IF(ModelNo=B1159,5,\"\")","v":""},"1720","Top Glass Width",{"$f":"TRUNC((Frame_Width/2-3.75)*32+0.5)/32","v":-3.71875}]
[{"$f":"IF(ModelNo=B1160,6,\"\")","v":""},"1720","Top Glass Height",{"$f":"TRUNC((DDIM_1720-2.15625)*32+0.5)/32","v":-2.125}]
[{"$f":"IF(ModelNo=B1161,7,\"\")","v":""},"1720","Astragal Length",{"$f":"TRUNC((Frame_Width/2-3.125)*16+0.5)/16","v":-3.0625}]
[{"$f":"IF(ModelNo=B1162,8,\"\")","v":""},"1720","Screen Width",{"$f":"Frame_Width/2-3.5625","v":-3.5625}]
[{"$f":"IF(ModelNo=B1163,9,\"\")","v":""},"1720","Screen Height",{"$f":"TRUNC((CDIM_1720-1.4375)*32+0.5)/32","v":-1.40625}]
[{"$f":"IF(ModelNo=B1164,10,\"\")","v":""},"1720","Bottom Sash Weight",{"$f":"IF(ISERROR(BTM_WGT&\" \"&\"lb\"),\"N/A\",BTM_WGT&\" \"&\"lb\")","v":"N/A"}]
[{"$f":"IF(ModelNo=B1165,11,\"\")","v":""},"1720","Balance Size",{"$f":"IF(V_BOTTBALANCE=0,\"N/A\",V_BOTTBALANCE)","v":{"$error":"#N/A"}}]
[{"$f":"IF(ModelNo=B1166,12,\"\")","v":""},"1720","Egress Opening Width",{"$f":"IF(ISERROR(EW),\"N/A\",EW)","v":"N/A"}]
[{"$f":"IF(ModelNo=B1167,13,\"\")","v":""},"1720","Egress Opening Height",{"$f":"IF(ISERROR(EH),\"N/A\",EH)","v":"N/A"}]
[{"$f":"IF(ModelNo=B1168,14,\"\")","v":""},"1720","Egress Opening Area (sq.ft.)",{"$f":"IF(ISERROR(EO),\"N/A\",EO)","v":"N/A"}]
[{"$f":"IF(ModelNo=B1169,1,\"\")","v":""},"1730","Bottom Sash Width",{"$f":"TRUNC((Frame_Width/3-2.53125)*32+0.5)/32","v":-2.5}]
[{"$f":"IF(ModelNo=B1170,2,\"\")","v":""},"1730","Bottom Sash Height",{"$f":"TRUNC(((CDIM_1730-0.84375)*32+0.5))/32","v":-0.8125}]
[{"$f":"IF(ModelNo=B1171,3,\"\")","v":""},"1730","Bottom Glass Width",{"$f":"TRUNC((D1169-1.34375)*32+0.5)/32","v":-3.8125}]
[{"$f":"IF(ModelNo=B1172,4,\"\")","v":""},"1730","Bottom Glass Height",{"$f":"TRUNC((D1170-1.3125)*32+0.5)/32","v":-2.09375}]
[{"$f":"IF(ModelNo=B1173,5,\"\")","v":""},"1730","Top Glass Width",{"$f":"TRUNC((Frame_Width/3-3.84375)*32+0.5)/32","v":-3.8125}]
[{"$f":"IF(ModelNo=B1174,6,\"\")","v":""},"1730","Top Glass Height",{"$f":"TRUNC((DDIM_1730-2.15625)*32+0.5)/32","v":-2.125}]
[{"$f":"IF(ModelNo=B1175,7,\"\")","v":""},"1730","Astragal Length",{"$f":"TRUNC((Frame_Width/3-3.25)*16+0.5)/16","v":-3.1875}]
[{"$f":"IF(ModelNo=B1176,8,\"\")","v":""},"1730","Screen Width",{"$f":"TRUNC((Frame_Width/3-3.6875)*32+0.5)/32","v":-3.65625}]
[{"$f":"IF(ModelNo=B1177,9,\"\")","v":""},"1730","Screen Height",{"$f":"TRUNC((CDIM_1730-1.4375)*32+0.5)/32","v":-1.40625}]
[{"$f":"IF(ModelNo=B1178,10,\"\")","v":""},"1730","Bottom Sash Weight",{"$f":"IF(ISERROR(BTM_WGT&\" \"&\"lb\"),\"N/A\",BTM_WGT&\" \"&\"lb\")","v":"N/A"}]
[{"$f":"IF(ModelNo=B1179,11,\"\")","v":""},"1730","Balance Size",{"$f":"IF(V_BOTTBALANCE=0,\"N/A\",V_BOTTBALANCE)","v":{"$error":"#N/A"}}]
[{"$f":"IF(ModelNo=B1180,12,\"\")","v":""},"1730","Egress Opening Width",{"$f":"IF(ISERROR(EW),\"N/A\",EW)","v":"N/A"}]
[{"$f":"IF(ModelNo=B1181,13,\"\")","v":""},"1730","Egress Opening Height",{"$f":"IF(ISERROR(EH),\"N/A\",EH)","v":"N/A"}]
[{"$f":"IF(ModelNo=B1182,14,\"\")","v":""},"1730","Egress Opening Area (sq.ft.)",{"$f":"IF(ISERROR(EO),\"N/A\",EO)","v":"N/A"}]
[{"$f":"IF(ModelNo=B1183,1,\"\")","v":""},"1900","Bottom Sash Width",{"$f":"TRUNC((Frame_Width-2.1875)*32+0.5)/32","v":-2.15625}]
[{"$f":"IF(ModelNo=B1184,2,\"\")","v":""},"1900","Bottom Sash Height",{"$f":"TRUNC(((CDIM_1900-0.844)*16+0.5))/16","v":-0.8125}]
[{"$f":"IF(ModelNo=B1185,3,\"\")","v":""},"1900","Bottom Glass Width",{"$f":"TRUNC((D1183-1.3125)*32+0.5)/32","v":-3.4375}]
[{"$f":"IF(ModelNo=B1186,4,\"\")","v":""},"1900","Bottom Glass Height",{"$f":"TRUNC((D1184-1.3125)*32+0.5)/32","v":-2.09375}]
[{"$f":"IF(ModelNo=B1187,5,\"\")","v":""},"1900","Top Glass Width",{"$f":"TRUNC((Frame_Width-3.5)*32+0.5)/32","v":-3.46875}]
[{"$f":"IF(ModelNo=B1188,6,\"\")","v":""},"1900","Top Glass Height",{"$f":"TRUNC((DDIM_1900-2.157)*32+0.5)/32","v":-2.125}]
[{"$f":"IF(ModelNo=B1189,7,\"\")","v":""},"1900","Astragal Length",{"$f":"Frame_Width-2.875","v":-2.875}]
[{"$f":"IF(ModelNo=B1190,8,\"\")","v":""},"1900","Screen Width",{"$f":"Frame_Width-3.3125","v":-3.3125}]
[{"$f":"IF(ModelNo=B1191,9,\"\")","v":""},"1900","Screen Height",{"$f":"TRUNC((CDIM_1900-1.625)*16+0.5)/16","v":-1.5625}]
[{"$f":"IF(ModelNo=B1192,10,\"\")","v":""},"1900","Bottom Sash Weight",{"$f":"IF(ISERROR(BTM_WGT&\" \"&\"lb\"),\"N/A\",BTM_WGT&\" \"&\"lb\")","v":"N/A"}]
[{"$f":"IF(ModelNo=B1193,11,\"\")","v":""},"1900","Balance Size",{"$f":"IF(V_BOTTBALANCE=0,\"N/A\",V_BOTTBALANCE)","v":{"$error":"#N/A"}}]
[{"$f":"IF(ModelNo=B1194,12,\"\")","v":""},"1900","Egress Opening Width",{"$f":"IF(ISERROR(EW),\"N/A\",EW)","v":"N/A"}]
[{"$f":"IF(ModelNo=B1195,13,\"\")","v":""},"1900","Egress Opening Height",{"$f":"IF(ISERROR(EH),\"N/A\",EH)","v":"N/A"}]
[{"$f":"IF(ModelNo=B1196,14,\"\")","v":""},"1900","Egress Opening Area (sq.ft.)",{"$f":"IF(ISERROR(EO),\"N/A\",EO)","v":"N/A"}]
[{"$f":"IF(ModelNo=B1197,1,\"\")","v":""},"1902","Sash Width",{"$f":"CDIM_1902-0.6875","v":-0.6875}]
[{"$f":"IF(ModelNo=B1198,2,\"\")","v":""},"1902","Sash Height",{"$f":"Frame_Height-2.1875","v":-2.1875}]
[{"$f":"IF(ModelNo=B1199,3,\"\")","v":""},"1902","Sash Glass Width",{"$f":"D1197-1.375","v":-2.0625}]
[{"$f":"IF(ModelNo=B1200,4,\"\")","v":""},"1902","Sash Glass Height",{"$f":"D1198-1.3125","v":-3.5}]
[{"$f":"IF(ModelNo=B1201,5,\"\")","v":""},"1902","Fixed Glass Width",{"$f":"DDIM_1902-2.0625","v":-2.0625}]
[{"$f":"IF(ModelNo=B1202,6,\"\")","v":""},"1902","Fixed Glass Height",{"$f":"Frame_Height-3.5","v":-3.5}]
[{"$f":"IF(ModelNo=B1203,7,\"\")","v":""},"1902","Astragal Length",{"$f":"Frame_Height-2.875","v":-2.875}]
[{"$f":"IF(ModelNo=B1204,8,\"\")","v":""},"1902","Roller Track Length",{"$f":"Frame_Width-0.75","v":-0.75}]
[{"$f":"IF(ModelNo=B1205,9,\"\")","v":""},"1902","Screen Width",{"$f":"TRUNC((CDIM_1902-2.5625)*16+0.5)/16","v":-2.5}]
[{"$f":"IF(ModelNo=B1206,10,\"\")","v":""},"1902","Screen Height",{"$f":"TRUNC((Frame_Height-3.375)*16+0.5)/16","v":-3.3125}]
[{"$f":"IF(ModelNo=B1207,11,\"\")","v":""},"1902","Egress Opening Width",{"$f":"CDIM_1902-3.75","v":-3.75}]
[{"$f":"IF(ModelNo=B1208,12,\"\")","v":""},"1902","Egress Opening Height",{"$f":"Frame_Height-4.5","v":-4.5}]
[{"$f":"IF(ModelNo=B1209,13,\"\")","v":""},"1902","Egress Opening Area (sq.ft.)",{"$f":"(D1207*D1208)/144","v":0.1171875}]
[{"$f":"IF(ModelNo=B1210,1,\"\")","v":""},"1903","Sash Width",{"$f":"TRUNC((Frame_Width/4+0.219)*16+0.5)/16","v":0.25}]
[{"$f":"IF(ModelNo=B1211,2,\"\")","v":""},"1903","Sash Height",{"$f":"TRUNC((Frame_Height-2.1875)*16+0.5)/16","v":-2.125}]
[{"$f":"IF(ModelNo=B1212,3,\"\")","v":""},"1903","Sash Glass Width",{"$f":"TRUNC((D1210-1.3125)*16+0.5)/16","v":-1}]
[{"$f":"IF(ModelNo=B1213,4,\"\")","v":""},"1903","Sash Glass Height",{"$f":"D1211-1.3125","v":-3.4375}]
[{"$f":"IF(ModelNo=B1214,5,\"\")","v":""},"1903","Fixed Glass Width",{"$f":"TRUNC((Frame_Width/2-2.219)*16+0.5)/16","v":-2.1875}]
[{"$f":"IF(ModelNo=B1215,6,\"\")","v":""},"1903","Fixed Glass Height",{"$f":"TRUNC((Frame_Height-3.5)*16+0.5)/16","v":-3.4375}]
[{"$f":"IF(ModelNo=B1216,7,\"\")","v":""},"1903","Astragal Length",{"$f":"Frame_Height-2.875","v":-2.875}]
[{"$f":"IF(ModelNo=B1217,8,\"\")","v":""},"1903","Roller Track Length",{"$f":"Frame_Width-0.75","v":-0.75}]
[{"$f":"IF(ModelNo=B1218,9,\"\")","v":""},"1903","Screen Width",{"$f":"TRUNC((Frame_Width/4-1.6875)*16+0.5)/16","v":-1.625}]
[{"$f":"IF(ModelNo=B1219,10,\"\")","v":""},"1903","Screen Height",{"$f":"Frame_Height-3.375","v":-3.375}]
[{"$f":"IF(ModelNo=B1220,11,\"\")","v":""},"1903","Egress Opening Width",{"$f":"(Frame_Width/4)-3.25","v":-3.25}]
[{"$f":"IF(ModelNo=B1221,12,\"\")","v":""},"1903","Egress Opening Height",{"$f":"Frame_Height-4.5","v":-4.5}]
[{"$f":"IF(ModelNo=B1222,13,\"\")","v":""},"1903","Egress Opening Area (sq.ft.)",{"$f":"(D1220*D1221)/144","v":0.1015625}]
[{"$f":"IF(ModelNo=B1223,1,\"\")","v":""},"1909","Sash Width",{"$f":"TRUNC((Frame_Width/3-0.188)*16+0.5)/16","v":-0.125}]
[{"$f":"IF(ModelNo=B1224,2,\"\")","v":""},"1909","Sash Height",{"$f":"TRUNC((Frame_Height-2.1875)*16+0.5)/16","v":-2.125}]
[{"$f":"IF(ModelNo=B1225,3,\"\")","v":""},"1909","Sash Glass Width",{"$f":"TRUNC((Frame_Width/3-1.5)*16+0.5)/16","v":-1.4375}]
[{"$f":"IF(ModelNo=B1226,4,\"\")","v":""},"1909","Sash Glass Height",{"$f":"D1224-1.3125","v":-3.4375}]
[{"$f":"IF(ModelNo=B1227,5,\"\")","v":""},"1909","Fixed Glass Width",{"$f":"TRUNC((Frame_Width/3-1.5)*16+0.5)/16","v":-1.4375}]
[{"$f":"IF(ModelNo=B1228,6,\"\")","v":""},"1909","Fixed Glass Height",{"$f":"TRUNC((Frame_Height-3.5)*16+0.5)/16","v":-3.4375}]
[{"$f":"IF(ModelNo=B1229,7,\"\")","v":""},"1909","Astragal Length",{"$f":"Frame_Height-2.875","v":-2.875}]
[{"$f":"IF(ModelNo=B1230,8,\"\")","v":""},"1909","Roller Track Length",{"$f":"Frame_Width-0.75","v":-0.75}]
[{"$f":"IF(ModelNo=B1231,9,\"\")","v":""},"1909","Screen Width",{"$f":"TRUNC((Frame_Width/3-2.0625)*16+0.5)/16","v":-2}]
[{"$f":"IF(ModelNo=B1232,10,\"\")","v":""},"1909","Screen Height",{"$f":"Frame_Height-3.375","v":-3.375}]
[{"$f":"IF(ModelNo=B1233,11,\"\")","v":""},"1909","Egress Opening Width",{"$f":"(Frame_Width/3)-2.875","v":-2.875}]
[{"$f":"IF(ModelNo=B1234,12,\"\")","v":""},"1909","Egress Opening Height",{"$f":"Frame_Height-4.5","v":-4.5}]
[{"$f":"IF(ModelNo=B1235,13,\"\")","v":""},"1909","Egress Opening Area (sq.ft.)",{"$f":"(D1233*D1234)/144","v":8.984375E-2}]
[{"$f":"IF(ModelNo=B1236,1,\"\")","v":""},"1904","Glass Width",{"$f":"Frame_Width-3.5","v":-3.5}]
[{"$f":"IF(ModelNo=B1237,2,\"\")","v":""},"1904","Glass Height",{"$f":"Frame_Height-3.5","v":-3.5}]
[{"$f":"IF(ModelNo=B1238,3,\"\")","v":""},"1904","Glass Area (sq.ft.)",{"$f":"(D1236*D1237)/144","v":8.5069444444444448E-2}]
[{"$f":"IF(ModelNo=B1239,1,\"\")","v":""},"1920","Bottom Sash Width",{"$f":"TRUNC((Frame_Width/2-2.4375)*32+0.5)/32","v":-2.40625}]
[{"$f":"IF(ModelNo=B1240,2,\"\")","v":""},"1920","Bottom Sash Height",{"$f":"TRUNC(((CDIM_1920-0.8441)*16+0.5))/16","v":-0.8125}]
[{"$f":"IF(ModelNo=B1241,3,\"\")","v":""},"1920","Bottom Glass Width",{"$f":"TRUNC((D1239-1.3125)*32+0.5)/32","v":-3.6875}]
[{"$f":"IF(ModelNo=B1242,4,\"\")","v":""},"1920","Bottom Glass Height",{"$f":"TRUNC((D1240-1.3125)*32+0.5)/32","v":-2.09375}]
[{"$f":"IF(ModelNo=B1243,5,\"\")","v":""},"1920","Top Glass Width",{"$f":"TRUNC((Frame_Width/2-3.75)*32+0.5)/32","v":-3.71875}]
[{"$f":"IF(ModelNo=B1244,6,\"\")","v":""},"1920","Top Glass Height",{"$f":"TRUNC((DDIM_1920-2.156)*32+0.5)/32","v":-2.125}]
[{"$f":"IF(ModelNo=B1245,7,\"\")","v":""},"1920","Astragal Length",{"$f":"Frame_Width/2-3.125","v":-3.125}]
[{"$f":"IF(ModelNo=B1246,8,\"\")","v":""},"1920","Screen Width",{"$f":"Frame_Width/2-3.5625","v":-3.5625}]
[{"$f":"IF(ModelNo=B1247,9,\"\")","v":""},"1920","Screen Height",{"$f":"TRUNC((CDIM_1920-1.625)*16+0.5)/16","v":-1.5625}]
[{"$f":"IF(ModelNo=B1248,10,\"\")","v":""},"1920","Bottom Sash Weight",{"$f":"IF(ISERROR(BTM_WGT&\" \"&\"lb\"),\"N/A\",BTM_WGT&\" \"&\"lb\")","v":"N/A"}]
[{"$f":"IF(ModelNo=B1249,11,\"\")","v":""},"1920","Balance Size",{"$f":"IF(V_BOTTBALANCE=0,\"N/A\",V_BOTTBALANCE)","v":{"$error":"#N/A"}}]
[{"$f":"IF(ModelNo=B1250,12,\"\")","v":""},"1920","Egress Opening Width",{"$f":"IF(ISERROR(EW),\"N/A\",EW)","v":"N/A"}]
[{"$f":"IF(ModelNo=B1251,13,\"\")","v":""},"1920","Egress Opening Height",{"$f":"IF(ISERROR(EH),\"N/A\",EH)","v":"N/A"}]
[{"$f":"IF(ModelNo=B1252,14,\"\")","v":""},"1920","Egress Opening Area (sq.ft.)",{"$f":"IF(ISERROR(EO),\"N/A\",EO)","v":"N/A"}]
[{"$f":"IF(ModelNo=B1253,1,\"\")","v":""},"1930","Bottom Sash Width",{"$f":"TRUNC((Frame_Width/3-2.53125)*32+0.5)/32","v":-2.5}]
[{"$f":"IF(ModelNo=B1254,2,\"\")","v":""},"1930","Bottom Sash Height",{"$f":"TRUNC(((CDIM_1930-0.8441)*16+0.5))/16","v":-0.8125}]
[{"$f":"IF(ModelNo=B1255,3,\"\")","v":""},"1930","Bottom Glass Width",{"$f":"TRUNC((D1253-1.3125)*32+0.5)/32","v":-3.78125}]
[{"$f":"IF(ModelNo=B1256,4,\"\")","v":""},"1930","Bottom Glass Height",{"$f":"TRUNC((D1254-1.3125)*32+0.5)/32","v":-2.09375}]
[{"$f":"IF(ModelNo=B1257,5,\"\")","v":""},"1930","Top Glass Width",{"$f":"TRUNC((Frame_Width/3-3.844)*32+0.5)/32","v":-3.8125}]
[{"$f":"IF(ModelNo=B1258,6,\"\")","v":""},"1930","Top Glass Height",{"$f":"TRUNC((DDIM_1930-2.156)*32+0.5)/32","v":-2.125}]
[{"$f":"IF(ModelNo=B1259,7,\"\")","v":""},"1930","Astragal Length",{"$f":"TRUNC((Frame_Width/3-3.219)*16+0.5)/16","v":-3.1875}]
[{"$f":"IF(ModelNo=B1260,8,\"\")","v":""},"1930","Screen Width",{"$f":"TRUNC((Frame_Width/3-3.6875)*16+0.5)/16","v":-3.625}]
[{"$f":"IF(ModelNo=B1261,9,\"\")","v":""},"1930","Screen Height",{"$f":"TRUNC((CDIM_1930-1.625)*16+0.5)/16","v":-1.5625}]
[{"$f":"IF(ModelNo=B1262,10,\"\")","v":""},"1930","Bottom Sash Weight",{"$f":"IF(ISERROR(BTM_WGT&\" \"&\"lb\"),\"N/A\",BTM_WGT&\" \"&\"lb\")","v":"N/A"}]
[{"$f":"IF(ModelNo=B1263,11,\"\")","v":""},"1930","Balance Size",{"$f":"IF(V_BOTTBALANCE=0,\"N/A\",V_BOTTBALANCE)","v":{"$error":"#N/A"}}]
[{"$f":"IF(ModelNo=B1264,12,\"\")","v":""},"1930","Egress Opening Width",{"$f":"IF(ISERROR(EW),\"N/A\",EW)","v":"N/A"}]
[{"$f":"IF(ModelNo=B1265,13,\"\")","v":""},"1930","Egress Opening Height",{"$f":"IF(ISERROR(EH),\"N/A\",EH)","v":"N/A"}]
[{"$f":"IF(ModelNo=B1266,14,\"\")","v":""},"1930","Egress Opening Area (sq.ft.)",{"$f":"IF(ISERROR(EO),\"N/A\",EO)","v":"N/A"}]
[{"$f":"IF(ModelNo=B1267,1,\"\")","v":""},"1901","Top Sash Width",{"$f":"Frame_Width-3.4375","v":-3.4375}]
[{"$f":"IF(ModelNo=B1268,2,\"\")","v":""},"1901","Top Sash Height",{"$f":"DDIM_1901-0.90625","v":-0.90625}]
[{"$f":"IF(ModelNo=B1269,3,\"\")","v":""},"1901","Bottom Sash Width",{"$f":"Frame_Width-2.1875","v":-2.1875}]
[{"$f":"IF(ModelNo=B1270,4,\"\")","v":""},"1901","Bottom Sash Height",{"$f":"CDIM_1901-0.90625","v":-0.90625}]
[{"$f":"IF(ModelNo=B1271,5,\"\")","v":""},"1901","Top Glass Width",{"$f":"D1267-1.3125","v":-4.75}]
[{"$f":"IF(ModelNo=B1272,6,\"\")","v":""},"1901","Top Glass Height",{"$f":"D1268-1.3125","v":-2.21875}]
[{"$f":"IF(ModelNo=B1273,7,\"\")","v":""},"1901","Bottom Glass Width",{"$f":"D1269-1.3125","v":-3.5}]
[{"$f":"IF(ModelNo=B1274,8,\"\")","v":""},"1901","Bottom Glass Height",{"$f":"D1270-1.3125","v":-2.21875}]
[{"$f":"IF(ModelNo=B1275,9,\"\")","v":""},"1901","Screen Width",{"$f":"Frame_Width-3.875","v":-3.875}]
[{"$f":"IF(ModelNo=B1276,10,\"\")","v":""},"1901","Screen Height",{"$f":"IF(Screen=\"F\",Frame_Height-3,CDIM_1901-1.0625)","v":-1.0625}]
[{"$f":"IF(ModelNo=B1277,11,\"\")","v":""},"1901","Top Sash Weight (Plus 3 lb)",{"$f":"IF(ISERROR(TOP_WGT&\" \"&\"lb\"),\"N/A\",TOP_WGT&\" \"&\"lb\")","v":"N/A"}]
[{"$f":"IF(ModelNo=B1278,12,\"\")","v":""},"1901","Top Balance Size",{"$f":"IF(V_TOPBALANCE=0,\"N/A\",V_TOPBALANCE)","v":{"$error":"#N/A"}}]
[{"$f":"IF(ModelNo=B1279,13,\"\")","v":""},"1901","Bottom Sash Weight",{"$f":"IF(ISERROR(BTM_WGT&\" \"&\"lb\"),\"N/A\",BTM_WGT&\" \"&\"lb\")","v":"N/A"}]
[{"$f":"IF(ModelNo=B1280,14,\"\")","v":""},"1901","Bottom Balance Size",{"$f":"IF(V_BOTTBALANCE=0,\"N/A\",V_BOTTBALANCE)","v":{"$error":"#N/A"}}]
[{"$f":"IF(ModelNo=B1281,15,\"\")","v":""},"1901","Egress Opening Width",{"$f":"IF(ISERROR(EW),\"N/A\",EW)","v":"N/A"}]
[{"$f":"IF(ModelNo=B1282,16,\"\")","v":""},"1901","Egress Opening Height",{"$f":"IF(ISERROR(EH),\"N/A\",EH)","v":"N/A"}]
[{"$f":"IF(ModelNo=B1283,17,\"\")","v":""},"1901","Egress Opening Area (sq.ft.)",{"$f":"IF(ISERROR(EO),\"N/A\",EO)","v":"N/A"}]
[{"$f":"IF(ModelNo=B1284,1,\"\")","v":""},"1921","Top Sash Width",{"$f":"Frame_Width/2-3.6875","v":-3.6875}]
[{"$f":"IF(ModelNo=B1285,2,\"\")","v":""},"1921","Top Sash Height",{"$f":"DDIM_1921-0.90625","v":-0.90625}]
[{"$f":"IF(ModelNo=B1286,3,\"\")","v":""},"1921","Bottom Sash Width",{"$f":"Frame_Width/2-2.4375","v":-2.4375}]
[{"$f":"IF(ModelNo=B1287,4,\"\")","v":""},"1921","Bottom Sash Height",{"$f":"CDIM_1921-0.90625","v":-0.90625}]
[{"$f":"IF(ModelNo=B1288,5,\"\")","v":""},"1921","Top Glass Width",{"$f":"D1284-1.3125","v":-5}]
[{"$f":"IF(ModelNo=B1289,6,\"\")","v":""},"1921","Top Glass Height",{"$f":"D1285-1.3125","v":-2.21875}]
[{"$f":"IF(ModelNo=B1290,7,\"\")","v":""},"1921","Bottom Glass Width",{"$f":"D1286-1.3125","v":-3.75}]
[{"$f":"IF(ModelNo=B1291,8,\"\")","v":""},"1921","Bottom Glass Height",{"$f":"D1287-1.3125","v":-2.21875}]
[{"$f":"IF(ModelNo=B1292,9,\"\")","v":""},"1921","Screen Width",{"$f":"Frame_Width/2-4.125","v":-4.125}]
[{"$f":"IF(ModelNo=B1293,10,\"\")","v":""},"1921","Screen Height",{"$f":"IF(Screen=\"F\",Frame_Height-3,CDIM_1901-1.0625)","v":-1.0625}]
[{"$f":"IF(ModelNo=B1294,11,\"\")","v":""},"1921","Top Sash Weight (Plus 3 lb)",{"$f":"IF(ISERROR(TOP_WGT&\" \"&\"lb\"),\"N/A\",TOP_WGT&\" \"&\"lb\")","v":"N/A"}]
[{"$f":"IF(ModelNo=B1295,12,\"\")","v":""},"1921","Top Balance Size",{"$f":"IF(V_TOPBALANCE=0,\"N/A\",V_TOPBALANCE)","v":{"$error":"#N/A"}}]
[{"$f":"IF(ModelNo=B1296,13,\"\")","v":""},"1921","Bottom Sash Weight",{"$f":"IF(ISERROR(BTM_WGT&\" \"&\"lb\"),\"N/A\",BTM_WGT&\" \"&\"lb\")","v":"N/A"}]
[{"$f":"IF(ModelNo=B1297,14,\"\")","v":""},"1921","Bottom Balance Size",{"$f":"IF(V_BOTTBALANCE=0,\"N/A\",V_BOTTBALANCE)","v":{"$error":"#N/A"}}]
[{"$f":"IF(ModelNo=B1298,15,\"\")","v":""},"1921","Egress Opening Width",{"$f":"IF(ISERROR(EW),\"N/A\",EW)","v":"N/A"}]
[{"$f":"IF(ModelNo=B1299,16,\"\")","v":""},"1921","Egress Opening Height",{"$f":"IF(ISERROR(EH),\"N/A\",EH)","v":"N/A"}]
[{"$f":"IF(ModelNo=B1300,17,\"\")","v":""},"1921","Egress Opening Area (sq.ft.)",{"$f":"IF(ISERROR(EO),\"N/A\",EO)","v":"N/A"}]
[{"$f":"IF(ModelNo=B1301,1,\"\")","v":""},"1931","Top Sash Width",{"$f":"Frame_Width/3-3.75","v":-3.75}]
[{"$f":"IF(ModelNo=B1302,2,\"\")","v":""},"1931","Top Sash Height",{"$f":"DDIM_1901-0.90625","v":-0.90625}]
[{"$f":"IF(ModelNo=B1303,3,\"\")","v":""},"1931","Bottom Sash Width",{"$f":"Frame_Width/3-2.5","v":-2.5}]
[{"$f":"IF(ModelNo=B1304,4,\"\")","v":""},"1931","Bottom Sash Height",{"$f":"CDIM_1901-0.90625","v":-0.90625}]
[{"$f":"IF(ModelNo=B1305,5,\"\")","v":""},"1931","Top Glass Width",{"$f":"D1301-1.3125","v":-5.0625}]
[{"$f":"IF(ModelNo=B1306,6,\"\")","v":""},"1931","Top Glass Height",{"$f":"D1302-1.3125","v":-2.21875}]
[{"$f":"IF(ModelNo=B1307,7,\"\")","v":""},"1931","Bottom Glass Width",{"$f":"D1303-1.3125","v":-3.8125}]
[{"$f":"IF(ModelNo=B1308,8,\"\")","v":""},"1931","Bottom Glass Height",{"$f":"D1304-1.3125","v":-2.21875}]
[{"$f":"IF(ModelNo=B1309,9,\"\")","v":""},"1931","Screen Width",{"$f":"Frame_Width/3-4.1875","v":-4.1875}]
[{"$f":"IF(ModelNo=B1310,10,\"\")","v":""},"1931","Screen Height",{"$f":"IF(Screen=\"F\",Frame_Height-3,CDIM_1901-1.0625)","v":-1.0625}]
[{"$f":"IF(ModelNo=B1311,11,\"\")","v":""},"1931","Top Sash Weight (Plus 3 lb)",{"$f":"IF(ISERROR(TOP_WGT&\" \"&\"lb\"),\"N/A\",TOP_WGT&\" \"&\"lb\")","v":"N/A"}]
[{"$f":"IF(ModelNo=B1312,12,\"\")","v":""},"1931","Top Balance Size",{"$f":"IF(V_TOPBALANCE=0,\"N/A\",V_TOPBALANCE)","v":{"$error":"#N/A"}}]
[{"$f":"IF(ModelNo=B1313,13,\"\")","v":""},"1931","Bottom Sash Weight",{"$f":"IF(ISERROR(BTM_WGT&\" \"&\"lb\"),\"N/A\",BTM_WGT&\" \"&\"lb\")","v":"N/A"}]
[{"$f":"IF(ModelNo=B1314,14,\"\")","v":""},"1931","Bottom Balance Size",{"$f":"IF(V_BOTTBALANCE=0,\"N/A\",V_BOTTBALANCE)","v":{"$error":"#N/A"}}]
[{"$f":"IF(ModelNo=B1315,15,\"\")","v":""},"1931","Egress Opening Width",{"$f":"IF(ISERROR(EW),\"N/A\",EW)","v":"N/A"}]
[{"$f":"IF(ModelNo=B1316,16,\"\")","v":""},"1931","Egress Opening Height",{"$f":"IF(ISERROR(EH),\"N/A\",EH)","v":"N/A"}]
[{"$f":"IF(ModelNo=B1317,17,\"\")","v":""},"1931","Egress Opening Area (sq.ft.)",{"$f":"IF(ISERROR(EO),\"N/A\",EO)","v":"N/A"}]
[{"$f":"IF(ModelNo=B1318,1,\"\")","v":""},"1914","Glass Width",{"$f":"Frame_Width-3.5","v":-3.5}]
[{"$f":"IF(ModelNo=B1319,2,\"\")","v":""},"1914","Glass Height",{"$f":"Frame_Height-3.5","v":-3.5}]
[{"$f":"IF(ModelNo=B1320,3,\"\")","v":""},"1914","Glass Area (sq.ft.)",{"$f":"(D1318*D1319)/144","v":8.5069444444444448E-2}]