{"text_format":"1","workbook":"xlsx","n_sheets":4,"sheets":["Form","Balance","CMR","Data"],"not_rendered":{"charts":0,"images":1,"macros":1,"external_links":0,"defined_names":218,"comments":0,"pivot_tables":0},"unopened":[],"bounds":{"document_bytes":16777216,"sheet_cells":100000,"rows_first":2000,"rows_last":500,"rows_between":2000,"halvings":0,"cell_chars":16384,"cell_head_chars":4096},"cells_cut":0,"cells_raw":0,"read":"whole","date_system":"1900"}

{"sheet":"Form","index":0,"n_rows":24,"n_cols":16,"rows_kept":24,"cut":false,"hidden":false,"merged":[[17,9,17,10],[3,1,3,7],[2,9,2,12],[2,13,2,14],[3,9,3,12],[3,13,3,14],[2,6,2,7],[2,1,2,5],[17,13,18,15]]}
[null,{"$f":"IF(AND(TIGMODEL>\"\",TIG=\"\"),\"TIG with 4mm glass ONLY (Special order, contact CS)\",IF(AND(TIGMODEL>\"\",TIGBAL=1),\"TIG is NOT Available\",IF(TIG_NOTE>\"\",TIG_NOTE,\"\")))","v":""}]
[null,{"$f":"IF(AND(WSIZE>0,HSIZE>0),\"Only Available At\"&\"  \"&WSIZE&\" x \"&HSIZE&IF(HCONTROL=1,\" or \"&HSIZE2,\"\"),\"\")","v":""},null,null,null,null,null,"Select a Model",null,{"$f":"IF(SHATERROR=1,\"Adjust CMR to Increase Egress Height\",IF(SHAT_MIN_R=1,SHAT_MESSAGE,\"\"))","v":{"$error":"#N/A"}}]
[null,{"$f":"IF(Model_Select=\"Select Model\",\"\",\"(Model\"&\" \"&ModelNo&\")\")","v":""},null,null,null,null,"Select Model",null,null,{"$f":"\"Min. W:\"&\" \"&MINW","v":"Min. W: 0"},null,null,null,{"$f":"\"Max W:\"&\" \"&MAXW","v":"Max W: 0"}]
[null,{"$f":"Description","v":0},null,null,null,null,null,null,null,{"$f":"\"Min. H:\"&\" \"&MINH","v":"Min. H: 0"},null,null,null,{"$f":"\"Max H:\"&\" \"&MAXH","v":"Max H: 0"},null,{"$f":"\"Max UI:\"&\" \"&MAXUI","v":"Max UI: 0"}]
[null,{"$f":"IF(AND(W>0,H>0),(IF(ISERROR(VLOOKUP(1,Data!$A:$D,3,FALSE)),\"\",VLOOKUP(1,Data!$A:$D,3,FALSE))),\"\")","v":""},null,null,null,null,null,{"$f":"IF(AND(W>0,H>0),(IF(ISERROR(VLOOKUP(1,Data!$A:$D,4,FALSE)),\"\",VLOOKUP(1,Data!$A:$D,4,FALSE))),\"\")","v":""},null,null,null,null,null,"Exact Size"]
[null,{"$f":"IF(AND(W>0,H>0),(IF(ISERROR(VLOOKUP(2,Data!$A:$D,3,FALSE)),\"\",VLOOKUP(2,Data!$A:$D,3,FALSE))),\"\")","v":""},null,null,null,null,null,{"$f":"IF(AND(W>0,H>0),(IF(ISERROR(VLOOKUP(2,Data!$A:$D,4,FALSE)),\"\",VLOOKUP(2,Data!$A:$D,4,FALSE))),\"\")","v":""},null,"Width:",null,null,null,{"$f":"IF(AND(RO=2,W>0),W-WCUTBACK,W)","v":0},{"$f":"IF(AND(W>0,WSIZE>0,W<>WSIZE),\"<< Width Not Available\",\"\")","v":""}]
[null,{"$f":"IF(AND(W>0,H>0),(IF(ISERROR(VLOOKUP(3,Data!$A:$D,3,FALSE)),\"\",VLOOKUP(3,Data!$A:$D,3,FALSE))),\"\")","v":""},null,null,null,null,null,{"$f":"IF(AND(W>0,H>0),(IF(ISERROR(VLOOKUP(3,Data!$A:$D,4,FALSE)),\"\",VLOOKUP(3,Data!$A:$D,4,FALSE))),\"\")","v":""},null,"Height:",null,null,null,{"$f":"IF(AND(RO=2,H>0),H-HCUTBACK,H)","v":0},{"$f":"IF(AND(H>0,HSIZE>0,H<>HSIZE),\"<< Height Not Available\",\"\")","v":""}]
[null,{"$f":"IF(AND(W>0,H>0),(IF(ISERROR(VLOOKUP(4,Data!$A:$D,3,FALSE)),\"\",VLOOKUP(4,Data!$A:$D,3,FALSE))),\"\")","v":""},null,null,null,null,null,{"$f":"IF(AND(W>0,H>0),(IF(ISERROR(VLOOKUP(4,Data!$A:$D,4,FALSE)),\"\",VLOOKUP(4,Data!$A:$D,4,FALSE))),\"\")","v":""},null,{"$f":"IF(OR(ModelNo=\"S140\",ModelNo=\"S144\",ModelNo=\"S146\",ModelNo=\"S140 (HP)\",ModelNo=\"S144 (HP)\",ModelNo=\"S146 (HP)\"),\"Leg:\",\"\")","v":""},null,null,null,{"$f":"LEG_MESSAGE","v":""}]
{"$rows_left_out":17}
{"sheet":"Balance","index":1,"n_rows":199,"n_cols":80,"rows_kept":199,"cut":false,"hidden":true,"merged":[[21,50,21,52],[0,41,0,45],[1,39,1,42],[1,44,1,47],[1,5,1,7],[1,1,1,3],[1,14,1,21],[1,24,1,25],[0,55,0,63],[1,55,1,58],[1,60,1,63]]}
[null,null,null,null,null,null,null,null,null,null,null,null,null,null,null,null,null,null,null,null,null,null,null,null,null,null,null,null,null,null,null,null,null,null,null,null,null,null,null,null,null,"BLOCK & TACKLE BALANCE CHART",null,null,null,null,null,null,null,null,null,null,null,null,null,"V-Series BLOCK & TACKLE BALANCE CHART"]
[null,"CFB",null,null,null,"Curve CFB",null,null,null,null,null,null,"Glass Strength",null,"Weight Calculation",null,null,null,null,null,null,null,null,null,"Egress Calculation",null,null,null,"* = Deduct 2.25 from 36 x 60 (RO) Frame to adjust for Egress",null,null,null,null,null,null,null,null,null,null,"TOP SASH",null,null,null,null,"BOTTOM SASH",null,null,null,null,null,null,null,null,null,null,"TOP SASH",null,null,null,null,"BOTTOM SASH"]
[null,4,3,"BN",null,4,3,"RD",null,1,{"$f":"IF(M3>\"\",VLOOKUP(M3,GLASSLOOKUP,2,FALSE),\"\")","v":""},{"$f":"IF(M3>\"\",VLOOKUP(K3,WEIGHTCHART,2,FALSE),\"\")","v":""},{"$f":"GLASS1","v":""},null,"Model","CDIM","Bott. Sash Height","Bottom Sash Weight","Top Sash Weight","Bal. Loc.","Head + Sill","Sill","EW",null,"# of Coils",{"$f":"IF(OR(ModelNo=\"3100\",ModelNo=\"i201\"),VLOOKUP(BTM_WGT,CURVE_W,3,FALSE),VLOOKUP(BTM_WGT,CFB_W,3,FALSE))","v":{"$error":"#N/A"}},null,null,"0100, 0700, 01HP, 07HP","Length","Weight/ft","Weight",null,"0901","Length","Weight/ft","Weight",null,null,"Sash Weight","Tube Length","Balance","Weight",null,"Sash Weight","Tube Length","Balance","Weight",null,null,null,null,null,null,null,"Sash Weight","Tube Length","Balance","Weight",null,"Sash Weight","Tube Length","Balance","Weight",null,null,null,null,null,"Caldwell Balance Chart"]
[null,{"$f":"B3+1","v":5},3,"BN",null,5,3,"RD",null,2,"","",{"$f":"GLASS2","v":""},null,{"$f":"ModelNo","v":"Select Model"},{"$f":"VLOOKUP(ModelNo,WEIGHTCALC,2,FALSE)","v":{"$error":"#N/A"}},{"$f":"VLOOKUP(ModelNo,WEIGHTCALC,3,FALSE)","v":{"$error":"#N/A"}},{"$f":"TRUNC(VLOOKUP(ModelNo,WEIGHTCALC,4,FALSE)+GRID)","v":{"$error":"#N/A"}},{"$f":"TRUNC(VLOOKUP(ModelNo,WEIGHTCALC,5,FALSE)+GRID)","v":{"$error":"#N/A"}},{"$f":"VLOOKUP(ModelNo,WEIGHTCALC,6,FALSE)","v":{"$error":"#N/A"}},{"$f":"VLOOKUP(ModelNo,WEIGHTCALC,7,FALSE)","v":{"$error":"#N/A"}},{"$f":"VLOOKUP(ModelNo,WEIGHTCALC,8,FALSE)","v":{"$error":"#N/A"}},{"$f":"VLOOKUP(ModelNo,WEIGHTCALC,9,FALSE)","v":{"$error":"#N/A"}},null,"Displacement",{"$f":"IF($Q$4>45,$Q$4-44,0)","v":{"$error":"#N/A"}},null,null,"Top Top Rail",0,0,{"$f":"AD4*AE4","v":0},null,"Top Top Rail",{"$f":"(Frame_Width-3.4375)/12","v":-0.28645833333333331},0.35199999999999998,{"$f":"AI4*AJ4","v":-0.10083333333333332},null,null,{"$f":"TRUNC(TOP_WGT)","v":{"$error":"#N/A"}},{"$f":"R59","v":{"$error":"#N/A"}},"Number","Range",null,{"$f":"TRUNC(BTM_WGT)","v":{"$error":"#N/A"}},{"$f":"Q59","v":{"$error":"#N/A"}},"Number","Range",null,null,null,null,null,null,null,{"$f":"TRUNC(TOP_WGT)","v":{"$error":"#N/A"}},{"$f":"TOPTUBELENGTH","v":{"$error":"#N/A"}},"Number","Range",null,{"$f":"TRUNC(BTM_WGT)","v":{"$error":"#N/A"}},{"$f":"BOTTUBELENGTH","v":{"$error":"#N/A"}},"Number","Range",null,null,null,null,null,{"$f":"IF(OR(ModelNo=\"1700\",ModelNo=\"1720\",ModelNo=\"1730\"),1,IF(OR(ModelNo=\"1900\",ModelNo=\"1920\",ModelNo=\"1930\"),2,3))","v":3},{"$f":"IF(OR(ModelNo=\"1700\",ModelNo=\"1720\",ModelNo=\"1730\"),4,IF(OR(ModelNo=\"1900\",ModelNo=\"1920\",ModelNo=\"1930\"),5,6))","v":6},"Bott.","Top",null,1,4,2,5,3,6]
[null,6,3,"BN",null,6,3,"RD",null,3,"","",{"$f":"GLASS3","v":""},null,"0100",{"$f":"CMR!$E$11","v":0},{"$f":"CMR!$E$11+0.125","v":0.125},{"$f":"$AF$23","v":0},{"$f":"$AF$22","v":0},1.03125,3.0739999999999998,1.5369999999999999,3.0625,null,"Coil Loc. From CMR",{"$f":"$Z$4+$T$4+1.75","v":{"$error":"#N/A"}},null,null,"Top Bottom Rail",0,0,{"$f":"AD5*AE5","v":0},null,"Top Bottom Rail",{"$f":"(Frame_Width-3.4375)/12","v":-0.28645833333333331},0.34399999999999997,-9.8541666666666652E-2,null,null,"Balance Size",{"$f":"IF(AND(AP5>0,AQ5>0),AP5,0)","v":{"$error":"#N/A"}},{"$f":"IF($AO$4<=6,6,0)","v":{"$error":"#N/A"}},{"$f":"IF(AND(AP5=6,$AN$4>=2,$AN$4<=5),AP5&\"A\",0)","v":{"$error":"#N/A"}},null,"Balance Size",{"$f":"IF(AND(AU5>0,AV5>0),AU5,0)","v":{"$error":"#N/A"}},{"$f":"IF($AT$4<=6,6,0)","v":{"$error":"#N/A"}},{"$f":"IF(AND(AU5=6,$AS$4>=2,$AS$4<=5),AU5&\"A\",0)","v":{"$error":"#N/A"}},null,null,null,null,null,null,null,"Balance Size",{"$f":"IF(AND(BF5>0,BG5>0),BF5,0)","v":{"$error":"#N/A"}},{"$f":"IF($BE$4<=8,8,0)","v":{"$error":"#N/A"}},{"$f":"IF(AND(BF5=8,$BD$4>=2,$BD$4<=6),BF5&\"A\",0)","v":{"$error":"#N/A"}},null,"Balance Size",{"$f":"IF(AND(BK5>0,BL5>0),BK5,0)","v":{"$error":"#N/A"}},{"$f":"IF($BJ$4<=8,8,0)","v":{"$error":"#N/A"}},{"$f":"IF(AND(BK5=8,$BI$4>=2,$BI$4<=6),BK5&\"A\",0)","v":{"$error":"#N/A"}},null,null,null,null,null,{"$f":"HLOOKUP($BR$4,CALDWELL_LOOKUP,2,FALSE)","v":9},{"$f":"HLOOKUP($BS$4,CALDWELL_LOOKUP,2,FALSE)","v":9.9994999999999994},8,7,null,9.7665000000000006,10.766,9.2185000000000006,10.218,9,9.9994999999999994]
[null,7,4,"RD",null,7,4,"GR",null,4,"","",{"$f":"GLASS4","v":""},null,"01HP",{"$f":"CMR!$L$11","v":0},{"$f":"CMR!$L$11+0.125","v":0.125},{"$f":"$AF$23","v":0},{"$f":"$AF$22","v":0},1.03125,3.1680000000000001,1.631,3.0625,null,"Sash H < 37.5",{"$f":"IF(OR(ModelNo=\"S140\",ModelNo=\"S144\",ModelNo=\"S146\",ModelNo=\"S140 (HP)\",ModelNo=\"S144 (HP)\",ModelNo=\"S146 (HP)\"),TRUNC((LEG-$Q$4-$U$4)*16+0.5)/16,TRUNC((Frame_Height-$Q$4-$U$4)*16+0.5)/16)","v":{"$error":"#N/A"}},null,null,"Top Stile",0,0,{"$f":"(AD6*AE6)/12","v":0},null,"Top Stile",{"$f":"(2*(CMR!$E$58-0.8125))/12","v":-0.13541666666666666},0.218,-2.9520833333333333E-2,null,null,{"$f":"VLOOKUP((MAX(AO5:AO168)),AO5:AQ168,3,FALSE)","v":{"$error":"#N/A"}},{"$f":"IF(AND(AP6>0,AQ6>0),AP6,0)","v":{"$error":"#N/A"}},{"$f":"IF($AO$4<=6,6,0)","v":{"$error":"#N/A"}},{"$f":"IF(AND(AP6=6,$AN$4>=6,$AN$4<=9),AP6&\"B\",0)","v":{"$error":"#N/A"}},null,{"$f":"VLOOKUP((MAX(AT5:AT168)),AT5:AV168,3,FALSE)","v":{"$error":"#N/A"}},{"$f":"IF(AND(AU6>0,AV6>0),AU6,0)","v":{"$error":"#N/A"}},{"$f":"IF($AT$4<=6,6,0)","v":{"$error":"#N/A"}},{"$f":"IF(AND(AU6=6,$AS$4>=6,$AS$4<=9),AU6&\"B\",0)","v":{"$error":"#N/A"}},null,null,null,null,null,null,null,{"$f":"VLOOKUP((MAX(BE5:BE229)),BE5:BG229,3,FALSE)","v":{"$error":"#N/A"}},{"$error":"#N/A"},{"$f":"IF($BE$4<=8,8,0)","v":{"$error":"#N/A"}},{"$f":"IF(AND(BF6=8,$BD$4>=7,$BD$4<=10),BF6&\"B\",0)","v":{"$error":"#N/A"}},null,{"$f":"VLOOKUP((MAX(BJ5:BJ149)),BJ5:BL149,3,FALSE)","v":{"$error":"#N/A"}},{"$error":"#N/A"},{"$f":"IF($BJ$4<=8,8,0)","v":{"$error":"#N/A"}},{"$f":"IF(AND(BK6=8,$BI$4>=7,$BI$4<=10),BK6&\"B\",0)","v":{"$error":"#N/A"}},null,null,null,null,null,{"$f":"HLOOKUP($BR$4,CALDWELL_LOOKUP,3,FALSE)","v":10},{"$f":"HLOOKUP($BS$4,CALDWELL_LOOKUP,3,FALSE)","v":10.999499999999999},9,8,null,10.766500000000001,11.766,10.218500000000001,11.218,10,10.999499999999999]
[null,8,4,"RD",null,8,4,"GR",null,5,"","",{"$f":"GLASS5","v":""},null,"0201",{"$f":"CMR!$E$27","v":0},{"$f":"CMR!$E$27-0.5625","v":-0.5625},{"$f":"$AF$45","v":0},{"$f":"$AF$44","v":0},1.3125,7.4375,1.75,4.4059999999999997,null,"Egress Height",{"$f":"IF(TYPE=1,TRUNC((Frame_Height-$P$4-$U$4)*16+0.5)/16,IF(CMR>(Frame_Height/2),TRUNC((Frame_Height-CMR-$U$4)*16+0.5)/16,IF(CMR<(Frame_Height/2),TRUNC((Frame_Height-$Q$4-$V$4)*16+0.5)/16)))","v":{"$error":"#N/A"}},null,null,"Top Rail Reinf.",0,0,0,null,"Top Rail Reinf.",{"$f":"(FLOOR(Frame_Width-13,2))/12","v":-1.1666666666666667},0.14599999999999999,-0.17033333333333334,null,null,null,{"$error":"#N/A"},{"$f":"IF($AO$4<=6,6,0)","v":{"$error":"#N/A"}},{"$f":"IF(AND(AP7=6,$AN$4>=10,$AN$4<=12),AP7&\"C\",0)","v":{"$error":"#N/A"}},null,null,{"$error":"#N/A"},{"$f":"IF($AT$4<=6,6,0)","v":{"$error":"#N/A"}},{"$f":"IF(AND(AU7=6,$AS$4>=10,$AS$4<=12),AU7&\"C\",0)","v":{"$error":"#N/A"}},null,null,null,null,null,null,null,null,{"$error":"#N/A"},{"$f":"IF($BE$4<=8,8,0)","v":{"$error":"#N/A"}},{"$f":"IF(AND(BF7=8,$BD$4>=11,$BD$4<=13),BF7&\"C\",0)","v":{"$error":"#N/A"}},null,null,{"$error":"#N/A"},{"$f":"IF($BJ$4<=8,8,0)","v":{"$error":"#N/A"}},{"$f":"IF(AND(BK7=8,$BI$4>=11,$BI$4<=13),BK7&\"C\",0)","v":{"$error":"#N/A"}},null,null,null,null,null,{"$f":"HLOOKUP($BR$4,CALDWELL_LOOKUP,4,FALSE)","v":11},{"$f":"HLOOKUP($BS$4,CALDWELL_LOOKUP,4,FALSE)","v":12.999499999999999},10,9,null,11.766500000000001,13.766,11.218500000000001,13.218,11,12.999499999999999]
[null,9,5,"BU",null,9,5,"BR",null,6,"","",{"$f":"GLASS6","v":""},null,"L201",{"$f":"CMR!$E$27","v":0},{"$f":"CMR!$E$27-0.5625","v":-0.5625},{"$f":"$AF$45","v":0},{"$f":"$AF$44","v":0},1.3125,4.0625,5.0625,4.4059999999999997,null,"Egress Width",{"$f":"Frame_Width-W4","v":{"$error":"#N/A"}},null,null,"Top Stile Reinf",0,0,0,null,"Top Stile Reinf",null,0.14599999999999999,0,null,null,null,{"$error":"#N/A"},{"$f":"IF($AO$4<=6,6,0)","v":{"$error":"#N/A"}},{"$f":"IF(AND(AP8=6,$AN$4>=13,$AN$4<=15),AP8&\"D\",0)","v":{"$error":"#N/A"}},null,null,{"$error":"#N/A"},{"$f":"IF($AT$4<=6,6,0)","v":{"$error":"#N/A"}},{"$f":"IF(AND(AU8=6,$AS$4>=13,$AS$4<=15),AU8&\"D\",0)","v":{"$error":"#N/A"}},null,null,null,null,null,null,null,null,{"$error":"#N/A"},{"$f":"IF(AND($BE$4<=10,$BE$4>8),10,0)","v":{"$error":"#N/A"}},{"$f":"IF(AND(BF8=10,$BD$4>=2,$BD$4<=6),BF8&\"A\",0)","v":{"$error":"#N/A"}},null,null,{"$error":"#N/A"},{"$f":"IF(AND($BJ$4<=10,$BJ$4>8),10,0)","v":{"$error":"#N/A"}},{"$f":"IF(AND(BK8=10,$BI$4>=2,$BI$4<=6),BK8&\"A\",0)","v":{"$error":"#N/A"}},null,null,null,null,null,{"$f":"HLOOKUP($BR$4,CALDWELL_LOOKUP,5,FALSE)","v":13},{"$f":"HLOOKUP($BS$4,CALDWELL_LOOKUP,5,FALSE)","v":14.999499999999999},12,10,null,13.766500000000002,15.766000000000002,13.218500000000002,15.218000000000002,13,14.999499999999999]
{"$rows_left_out":192}
{"sheet":"CMR","index":2,"n_rows":189,"n_cols":50,"rows_kept":189,"cut":false,"hidden":true,"merged":[[120,1,120,3],[121,1,121,3],[105,1,105,3],[107,4,107,5],[115,1,115,2],[116,1,116,2],[118,1,118,3],[119,1,119,3],[91,4,91,5],[99,1,99,2],[100,1,100,2],[102,1,102,3],[103,1,103,3],[104,1,104,3],[103,8,103,10],[104,8,104,10],[106,11,106,12],[107,8,107,9],[113,8,113,10],[108,8,108,9],[110,8,110,10],[111,8,111,10],[112,8,112,10],[74,8,74,9],[76,8,76,10],[90,11,90,12],[98,8,98,9],[99,8,99,9],[101,8,101,10],[102,8,102,10],[81,11,81,12],[82,8,82,9],[83,8,83,9],[85,8,85,10],[86,8,86,10],[87,8,87,10],[76,1,76,3],[88,1,88,3],[89,1,89,3],[81,3,81,4],[86,1,86,3],[87,1,87,3],[83,1,83,2],[84,1,84,2],[77,8,77,10],[78,8,78,10],[79,8,79,10],[77,1,77,3],[78,1,78,3],[79,1,79,3],[88,8,88,10],[47,8,47,10],[46,8,46,10],[73,8,73,9],[42,1,42,2],[44,1,44,3],[45,1,45,3],[46,1,46,3],[42,8,42,9],[65,11,65,12],[44,8,44,10],[45,8,45,10],[47,1,47,3],[33,11,33,12],[41,8,41,9],[41,1,41,2],[30,8,30,10],[31,8,31,10],[33,4,33,5],[1,11,1,12],[9,8,9,9],[10,8,10,9],[12,8,12,10],[1,4,1,5],[17,4,17,5],[13,8,13,10],[14,8,14,10],[15,8,15,10],[25,8,25,9],[26,8,26,9],[28,8,28,10],[29,8,29,10],[9,15,9,16],[10,15,10,16],[25,15,25,16],[26,15,26,16],[30,15,30,17],[28,15,28,17],[29,15,29,17],[30,1,30,3],[31,1,31,3],[25,1,25,2],[26,1,26,2],[12,1,12,3],[13,1,13,3],[14,1,14,3],[15,1,15,3],[17,11,17,12],[9,1,9,2],[10,1,10,2],[28,1,28,3],[29,1,29,3],[17,18,17,19],[57,15,57,16],[58,15,58,16],[60,15,60,17],[61,15,61,17],[49,18,49,19],[31,15,31,17],[45,15,45,17],[46,15,46,17],[47,15,47,17],[62,15,62,17],[63,15,63,17],[79,15,79,17],[73,15,73,16],[81,18,81,19],[94,15,94,17],[33,18,33,19],[41,15,41,16],[42,15,42,16],[44,15,44,17],[65,18,65,19],[95,15,95,17],[89,15,89,16],[90,15,90,16],[92,15,92,17],[93,15,93,17],[74,15,74,16],[76,15,76,17],[77,15,77,17],[78,15,78,17]]}
[]
[null,null,"W",null,"0100 / 0700",null,null,null,null,"W",null,"S140, S144, S146",null,null,null,null,null,null,null,"SashW","SashH","GlassW","GlassH","Radius","Weight",null,null,null,null,null,null,null,null,null,null,null,null,null,null,null,null,"1700","1720","1730","1900","1920","1930","1901","1921","1931"]
[null,null,{"$f":"IF(TYPE=1,$C$2,IF(TYPE= \"\",$C$2,\" \"))","v":"W"},1,{"$f":"Frame_Height/2","v":0},{"$f":"TRUNC($E$3*16+0.5)/16","v":0},null,null,null,{"$f":"IF(TYPE=1,$J$2,IF(TYPE= \"\",$J$2,\" \"))","v":"W"},1,{"$f":"Frame_Height/2-CMRD","v":6},{"$f":"TRUNC($L$3*16+0.5)/16","v":6},null,null,"Frame Cut Leg",{"$f":"LEG+6","v":6},null,2,{"$f":"Frame_Width-3.125","v":-3.125},{"$f":"CDIMS140-1.125","v":-1.125},{"$f":"T3-1.6875","v":-4.8125},{"$f":"U3-1.625","v":-2.75},12.5,{"$f":"BSW03A0","v":0},null,null,null,null,null,null,null,null,null,null,null,null,null,null,null,"TGW",{"$f":"IF(AD20>40.5,1,0)","v":0},{"$f":"IF(AD21>40.25,1,0)","v":0},{"$f":"IF(AD22>25.5,1,0)","v":0},{"$f":"IF(AD23>40.5,1,0)","v":0},{"$f":"IF(AD24>40.25,1,0)","v":0},{"$f":"IF(AD25>25.5,1,0)","v":0},{"$f":"IF(AD26>39.25,1,0)","v":0},{"$f":"IF(AD27>39,1,0)","v":0},{"$f":"IF(AD28>30.9375,1,0)","v":0}]
[null,null,{"$f":"IF(TYPE=5,$C$2,IF(TYPE=2,IF(Frame_Height>=54.5,IF(Frame_Height<72.5,$C$2,\"\"),\"\"),\"\"))","v":""},2,{"$f":"CEILING(((Frame_Height/5-0.093)*3-0.03125),0.0625)","v":-0.25},{"$f":"TRUNC($E4*16+0.5)/16","v":-0.1875},5,null,null,{"$f":"IF(TYPE=5,$J$2,IF(TYPE=2,IF(Frame_Height>=54.5,IF(Frame_Height<72.5,$J$2,\"\"),\"\"),\"\"))","v":""},2,{"$f":"CEILING(((Frame_Height/3-0.22)*2-0.03125),0.0625)-CMRD","v":5.5625},{"$f":"TRUNC($L$4*16+0.5)/16","v":5.5625},5,null,"CMRD",{"$f":"Frame_Height-Q3","v":-6},null,3,{"$f":"Frame_Width-3.125","v":-3.125},{"$f":"CDIMS140-1.125","v":-1.125},{"$f":"T4-1.6875","v":-4.8125},{"$f":"U4-1.625","v":-2.75},13,{"$f":"BSW03A0","v":0},null,null,null,null,null,null,null,null,null,null,null,null,null,null,null,"TGH",{"$f":"IF(AE20>35.34375,1,0)","v":0},{"$f":"IF(AE21>35.34375,1,0)","v":0},{"$f":"IF(AE22>35.34375,1,0)","v":0},{"$f":"IF(AE23>35.34375,1,0)","v":0},{"$f":"IF(AE24>35.34375,1,0)","v":0},{"$f":"IF(AE25>35.34375,1,0)","v":0},{"$f":"IF(AE26>35.1875,1,0)","v":0},{"$f":"IF(AE27>35.1875,1,0)","v":0},{"$f":"IF(AE28>35.1875,1,0)","v":0}]
[null,null,{"$f":"IF(TYPE=6,$C$2,IF(AND(TYPE=2,OR(Frame_Height<54.5,Frame_Height>=72.5)),$C$2,\"\"))","v":""},null,{"$f":"TRUNC((Frame_Height/3-0.22)*32+0.5)/16","v":-0.375},{"$f":"TRUNC($E$5*16+0.5)/16","v":-0.3125},6,null,null,{"$f":"IF(TYPE=6,$J$2,IF(AND(TYPE=2,OR(Frame_Height<54.5,Frame_Height>=72.5)),$J$2,\"\"))","v":""},null,{"$f":"TRUNC((Frame_Height/5-0.093)*32+0.5)/16-CMRD","v":5.875},{"$f":"TRUNC($L$5*16+0.5)/16","v":5.875},6,null,"Sash Cut back",{"$f":"IF(OR(EXTSELECT=2,EXTSELECT=3),3.125,IF(OR(EXTSELECT=4,EXTSELECT=5),2.3125,IF(EXTSELECT=6,2.25,0)))","v":0},null,4,{"$f":"Frame_Width-2.3125","v":-2.3125},{"$f":"CDIMS140+0.125","v":0.125},{"$f":"Frame_Width-4","v":-4},{"$f":"CDIMS140-1.5625","v":-1.5625},10,{"$f":"Balance!AF23","v":0},null,"Model","TSW","TSH","TGW","TGH","TGSF","BSW","BSH","BGW","BGH","BGSF",null,null,null,"BGW",{"$f":"IF(AI20>40.5,1,0)","v":0},{"$f":"IF(AI21>40.25,1,0)","v":0},{"$f":"IF(AI22>25.46875,1,0)","v":0},{"$f":"IF(AI23>40.5,1,0)","v":0},{"$f":"IF(AI24>40.25,1,0)","v":0},{"$f":"IF(AI25>25.5,1,0)","v":0},{"$f":"IF(AG26>40.5,1,0)","v":0},{"$f":"IF(AI27>40.25,1,0)","v":0},{"$f":"IF(AI28>32.1875,1,0)","v":0}]
[null,null,{"$f":"IF(TYPE=7,$C$2,IF(TYPE=3,IF(Frame_Height>=54.5,IF(Frame_Height<72.5,$C$2,\"\"),\"\"),\"\"))","v":""},3,{"$f":"TRUNC((Frame_Height/5+0.156)*32+0.5)/16","v":0.3125},{"$f":"TRUNC($E$6*16+0.5)/16","v":0.3125},7,null,null,{"$f":"IF(TYPE=7,$J$2,IF(TYPE=3,IF(Frame_Height>=54.5,IF(Frame_Height<72.5,$J$2,\"\"),\"\"),\"\"))","v":""},3,{"$f":"TRUNC((Frame_Height/3+0.44)*32+0.5)/16","v":0.875},{"$f":"TRUNC($L$6*16+0.5)/16","v":0.875},7,null,null,null,null,5,{"$f":"Frame_Width-2.3125","v":-2.3125},{"$f":"CDIMS140+0.125","v":0.125},{"$f":"Frame_Width-4","v":-4},{"$f":"CDIMS140-1.5625","v":-1.5625},10,{"$f":"Balance!AF23","v":0},null,"0100",null,null,null,null,{"$f":"(AD6*AE6)/144","v":0},{"$f":"Data!D2","v":-2.3125},{"$f":"Data!D3","v":0.125},{"$f":"Data!D4","v":-3.9375},{"$f":"Data!D5","v":-1.5},{"$f":"(AI6*AJ6)/144","v":4.1015625E-2},null,null,null,"BGH",{"$f":"IF(AJ20>35.34375,1,0)","v":0},{"$f":"IF(AJ21>35.34375,1,0)","v":0},{"$f":"IF(AJ22>35.34375,1,0)","v":0},{"$f":"IF(AJ23>35.3125,1,0)","v":0},{"$f":"IF(AJ24>35.34375,1,0)","v":0},{"$f":"IF(AJ25>35.3125,1,0)","v":0},{"$f":"IF(AJ26>35.1875,1,0)","v":0},{"$f":"IF(AJ27>35.1875,1,0)","v":0},{"$f":"IF(AJ28>35.1875,1,0)","v":0}]
[null,null,{"$f":"IF(TYPE=8,$C$2,IF(AND(TYPE=3,OR(Frame_Height<54.5,Frame_Height>=72.5)),$C$2,\"\"))","v":""},null,{"$f":"TRUNC((Frame_Height/3+0.44)*16+0.5)/16","v":0.4375},{"$f":"TRUNC($E$7*16+0.5)/16","v":0.4375},8,null,null,{"$f":"IF(TYPE=8,$J$2,IF(AND(TYPE=3,OR(Frame_Height<54.5,Frame_Height>=72.5)),$J$2,\"\"))","v":""},null,{"$f":"TRUNC((Frame_Height/5+0.156)*16+0.5)/16-CMRD","v":6.125},{"$f":"TRUNC($L$7*16+0.5)/16","v":6.125},8,null,null,null,null,6,{"$f":"Frame_Width-2.25","v":-2.25},{"$f":"CDIMS140-0.75","v":-0.75},{"$f":"Frame_Width-3.9375","v":-3.9375},{"$f":"CDIMS140-2.4375","v":-2.4375},11.75,{"$f":"Balance!AF67","v":0},null,"01HP",null,null,null,null,{"$f":"(AD7*AE7)/144","v":0},{"$f":"Data!D16","v":-2.3125},{"$f":"Data!D17","v":0.125},{"$f":"Data!D18","v":-3.9375},{"$f":"Data!D19","v":-1.5},{"$f":"(AI7*AJ7)/144","v":4.1015625E-2},null,null,null,null,{"$f":"MAX(AP3:AP6)","v":0},0,0,0,0,0,0,0,0]
[null,null,{"$f":"IF(TYPE=4,$C$2,\"\")","v":""},4,{"$f":"CMR","v":0},{"$f":"TRUNC($E$8*16+0.5)/16","v":0},null,null,null,{"$f":"IF(TYPE=4,$J$2,\"\")","v":""},4,{"$f":"CMR-CMRD","v":6},{"$f":"TRUNC($L$8*16+0.5)/16","v":6},null,null,null,null,null,7,{"$f":"Frame_Width-2.1875","v":-2.1875},{"$f":"CDIMS140-0.84375","v":-0.84375},{"$f":"T8-1.3125","v":-3.5},{"$f":"U8-1.3125","v":-2.15625},12,{"$f":"Balance!AK153","v":0},null,"0301",{"$f":"Data!D321","v":-3.25},{"$f":"Data!D322","v":-1.625},{"$f":"Data!D325","v":-4.875},{"$f":"Data!D326","v":-3.25},0.11002604166666667,{"$f":"Data!D323","v":-2.25},{"$f":"Data!D324","v":-0.625},{"$f":"Data!D327","v":-3.875},{"$f":"Data!D328","v":-2.25},6.0546875E-2,null,null,"Stile Reinf. Driver >>",{"$f":"MAX(AP8:AX8,AO9,AO10)","v":0},{"$f":"IF(ModelNo=\"1700\",HLOOKUP(Model_Select,REINF_CHART,6,FALSE),0)","v":0},{"$f":"IF(ModelNo=\"1720\",HLOOKUP(Model_Select,REINF_CHART,6,FALSE),0)","v":0},{"$f":"IF(ModelNo=\"1730\",HLOOKUP(Model_Select,REINF_CHART,6,FALSE),0)","v":0},{"$f":"IF(ModelNo=\"1900\",HLOOKUP(Model_Select,REINF_CHART,6,FALSE),0)","v":0},{"$f":"IF(ModelNo=\"1920\",HLOOKUP(Model_Select,REINF_CHART,6,FALSE),0)","v":0},{"$f":"IF(ModelNo=\"1930\",HLOOKUP(Model_Select,REINF_CHART,6,FALSE),0)","v":0},{"$f":"IF(ModelNo=\"1901\",HLOOKUP(Model_Select,REINF_CHART,6,FALSE),0)","v":0},{"$f":"IF(ModelNo=\"1921\",HLOOKUP(Model_Select,REINF_CHART,6,FALSE),0)","v":0},{"$f":"IF(ModelNo=\"1931\",HLOOKUP(Model_Select,REINF_CHART,6,FALSE),0)","v":0}]
{"$rows_left_out":182}
{"sheet":"Data","index":3,"n_rows":1320,"n_cols":60,"rows_kept":1320,"cut":false,"hidden":true,"merged":[]}
[null,"Model","Description","Value"]
[{"$f":"IF(ModelNo=B2,1,\"\")","v":""},"0100","Bottom Sash Width",{"$f":"Frame_Width-2.3125","v":-2.3125},null,{"$f":"G192","v":"Select Model"},"Models","Description","W cut-back","H-cut-back","Width","Height","Min W","Min H","Max W","Max H","Max UI","Type1","Type2","Type3","Type4","Screen1","Screen2","Screen3","Ext./Reinf.","Ext./Reinf.","Ext./Reinf.","Ext./Reinf.","Ext./Reinf.","Ext./Reinf.","Ext./Reinf.","Ext./Reinf.","Glass1","Glass2","Glass3","Glass4","Glass5","Glass6","Glass7","Glass8","Opening"]
[{"$f":"IF(ModelNo=B3,2,\"\")","v":""},"0100","Bottom Sash Height",{"$f":"CMR!$E$11+0.125","v":0.125},null,1,"Select Model"]
[{"$f":"IF(ModelNo=B4,3,\"\")","v":""},"0100","Bottom Glass Width",{"$f":"CMR!$E$14","v":-3.9375},null,2,"0100","New Const. Single Hung",0.5,0.5,null,null,14.375,23.75,52,77,129,"Standard","Oriel (2/3 - 1/3)","Cottage (1/3 - 2/3)","Custom","Half",null,null,null,null,null,null,null,null,null,null,"Single Strength (2.5 mm)","Double Strength (3 mm)","Triple Strength (5 mm)",null,null,"Laminated",null,null,"<< Select Opening",null,1,"Single Strength (2.5 mm)",null,null,null,"SS (2.2)","DS (3.2)","4 mm","TS (5.0)",null,null,null,null,"Min. W","Min. H","Max. W","Max. H","Max. UI"]
[{"$f":"IF(ModelNo=B5,4,\"\")","v":""},"0100","Bottom Glass Height",{"$f":"CMR!$E$16","v":-1.5},null,3,"01HP","New Const. Single Hung High Performance",0.5,0.5,null,null,14.375,23.75,52,84,129,"Standard","Oriel (2/3 - 1/3)","Cottage (1/3 - 2/3)","Custom","Half",null,null,null,null,null,null,null,null,null,null,null,"Double Strength (3 mm)","Triple Strength (5 mm)",null,null,"Laminated",null,null,"<< Select Opening",null,2,"Double Strength (3 mm)",null,null,"Max. Short",{"$f":"IF(TG2W>41,0,41)","v":41},{"$f":"IF(TG2W>56,0,56)","v":56},{"$f":"IF(TG2W>67,0,67)","v":67},{"$f":"IF(TG2W>70,0,70)","v":70},"Annealed",null,null,"Mezzo",25,40]
[{"$f":"IF(ModelNo=B6,5,\"\")","v":""},"0100","Top Glass Width",{"$f":"CMR!$E$13","v":-1.9375},null,4,"0102","New Const. Single Slider",0.5,0.5,null,null,23.5,14.25,72,60,132,"Standard",null,null,null,"Half",null,null,null,null,null,null,null,null,null,null,"Single Strength (2.5 mm)","Double Strength (3 mm)","Triple Strength (5 mm)",null,null,"Laminated",null,null,"<< Select Opening",null,3,"Triple Strength (5 mm)",null,null,"Max. Long",{"$f":"IF(TG2H>62,0,62)","v":62},{"$f":"IF(TG2H>76,0,76)","v":76},{"$f":"IF(TG2H>90,0,90)","v":90},{"$f":"IF(TG2H>102,0,102)","v":102},"Annealed",null,null,"Mezzo/N.F",26,41]
[{"$f":"IF(ModelNo=B7,6,\"\")","v":""},"0100","Top Glass Height",{"$f":"CMR!$E$15","v":-1.875},null,5,"0103","New Const. Three Lite Slider (1/4-1/2-1/4)",0.5,0.5,null,null,48,14.25,108,60,168,"Standard (1/4-1/2-1/4)",null,null,null,"Half",null,null,null,null,null,null,null,null,null,null,"Single Strength (2.5 mm)","Double Strength (3 mm)","Triple Strength (5 mm)",null,null,"Laminated",null,null,"<< Select Opening",null,4,"Triple IG Single Strrength",null,null,"Max Sq.Ft.",{"$f":"IF(TG2A>12,0,12)","v":12},{"$f":"IF(TG2A>22,0,22)","v":22},{"$f":"IF(TG2A>32,0,32)","v":32},{"$f":"IF(TG2A>35,0,35)","v":35},"Annealed",null,null,"New Construction",20,36]
[{"$f":"IF(ModelNo=B8,7,\"\")","v":""},"0100","Astragal Length",{"$f":"TRUNC((Frame_Width-1.218)*32+0.5)/32","v":-1.1875},null,6,"0104","New Const. Picture Window",0.5,0.5,null,null,11.5,11.5,95,95,154,"Standard",null,null,null,null,null,null,null,null,null,null,null,null,null,null,null,"Double Strength (3 mm)","Triple Strength (5 mm)",null,null,"Laminated",null,null,"<< Select Opening",null,5,"Triple IG Double Strength",null,null,"Max. Short",0,{"$f":"IF(TG2W>42,0,42)","v":42},{"$f":"IF(TG2W>70,0,70)","v":70},{"$f":"IF(TG2W>70,0,70)","v":70},"Tempered",null,null,"0700 Series",20,36]
{"$rows_left_out":1312}