{"text_format":"1","workbook":"xlsx","n_sheets":4,"sheets":["Form","Balance","Tables","Data"],"not_rendered":{"charts":0,"images":2,"macros":1,"external_links":0,"defined_names":191,"comments":1,"pivot_tables":0},"unopened":[],"bounds":{"document_bytes":16777216,"sheet_cells":100000,"rows_first":2000,"rows_last":500,"rows_between":2000,"halvings":0,"cell_chars":16384,"cell_head_chars":4096},"cells_cut":0,"cells_raw":0,"read":"whole","date_system":"1900"}

{"sheet":"Form","index":0,"n_rows":25,"n_cols":16,"rows_kept":25,"cut":false,"hidden":false,"merged":[[3,1,3,7],[3,9,3,12],[2,6,2,7],[2,1,2,5],[28,12,28,13],[27,12,27,13],[2,13,2,14],[3,13,3,14],[13,14,13,15],[2,9,2,12],[6,14,6,15],[5,14,5,15]]}
[]
[null,{"$f":"IF(AND(WSIZE>0,HSIZE>0),\"Only Available At\"&\"  \"&WSIZE&\" x \"&HSIZE&IF(HCONTROL=1,\" or \"&HSIZE2,\"\"),\"\")","v":""},null,null,null,null,null,"Select Model",null,{"$f":"IF(ISERROR(SHATERROR),\"\",IF(SHATERROR=1,\"Adjust CMR to Increase Egress Height\",\"\"))","v":""}]
[null,{"$f":"IF(Model_Select=\"Select Model\",\"\",\"(Model\"&\" \"&ModelNo&\")\")","v":""},null,null,null,null,"Select Model",null,null,{"$f":"\"Min. W:\"&\" \"&MINW","v":"Min. W: 0"},null,null,null,{"$f":"\"Max W:\"&\" \"&MAXW","v":"Max W: 0"}]
[null,{"$f":"Description","v":0},null,null,null,null,null,null,null,{"$f":"\"Min. H:\"&\" \"&MINH","v":"Min. H: 0"},null,null,null,{"$f":"\"Max H:\"&\" \"&MAXH","v":"Max H: 0"},null,{"$f":"\"Max UI:\"&\" \"&MAXUI","v":"Max UI: 0"}]
[null,{"$f":"IF(AND(W>0,H>0),(IF(ISERROR(VLOOKUP(1,Data!$A:$D,3,FALSE)),\"\",VLOOKUP(1,Data!$A:$D,3,FALSE))),\"\")","v":""},null,null,null,null,null,{"$f":"IF(AND(W>0,H>0),(IF(ISERROR(VLOOKUP(1,Data!$A:$D,4,FALSE)),\"\",VLOOKUP(1,Data!$A:$D,4,FALSE))),\"\")","v":""},null,null,null,null,null,"Exact Size"]
[null,{"$f":"IF(AND(W>0,H>0),(IF(ISERROR(VLOOKUP(2,Data!$A:$D,3,FALSE)),\"\",VLOOKUP(2,Data!$A:$D,3,FALSE))),\"\")","v":""},null,null,null,null,null,{"$f":"IF(AND(W>0,H>0),(IF(ISERROR(VLOOKUP(2,Data!$A:$D,4,FALSE)),\"\",VLOOKUP(2,Data!$A:$D,4,FALSE))),\"\")","v":""},null,"Width:",null,null,null,{"$f":"IF(AND(RO=2,W>0),W-WCUTBACK,W)","v":0},{"$f":"IF(AND(W>0,WSIZE>0,W<>WSIZE),\"<< Width Not Available\",\"\")","v":""}]
[null,{"$f":"IF(AND(W>0,H>0),(IF(ISERROR(VLOOKUP(3,Data!$A:$D,3,FALSE)),\"\",VLOOKUP(3,Data!$A:$D,3,FALSE))),\"\")","v":""},null,null,null,null,null,{"$f":"IF(AND(W>0,H>0),(IF(ISERROR(VLOOKUP(3,Data!$A:$D,4,FALSE)),\"\",VLOOKUP(3,Data!$A:$D,4,FALSE))),\"\")","v":""},null,"Height:",null,null,null,{"$f":"IF(AND(RO=2,H>0),H-HCUTBACK,H)","v":0},{"$f":"IF(AND(H>0,HSIZE>0,HSIZE2>0,H<>HSIZE,H<>HSIZE2),\"<< Height Not Available\",\"\")","v":""}]
[null,{"$f":"IF(AND(W>0,H>0),(IF(ISERROR(VLOOKUP(4,Data!$A:$D,3,FALSE)),\"\",VLOOKUP(4,Data!$A:$D,3,FALSE))),\"\")","v":""},null,null,null,null,null,{"$f":"IF(AND(W>0,H>0),(IF(ISERROR(VLOOKUP(4,Data!$A:$D,4,FALSE)),\"\",VLOOKUP(4,Data!$A:$D,4,FALSE))),\"\")","v":""},null,{"$f":"IF(OR(ModelNo=\"S140\",ModelNo=\"S144\",ModelNo=\"S146\",ModelNo=\"S140 (HP)\",ModelNo=\"S144 (HP)\",ModelNo=\"S146 (HP)\"),\"Leg:\",\"\")","v":""}]
[null,{"$f":"IF(AND(W>0,H>0),(IF(ISERROR(VLOOKUP(5,Data!$A:$D,3,FALSE)),\"\",VLOOKUP(5,Data!$A:$D,3,FALSE))),\"\")","v":""},null,null,null,null,null,{"$f":"IF(AND(W>0,H>0),(IF(ISERROR(VLOOKUP(5,Data!$A:$D,4,FALSE)),\"\",VLOOKUP(5,Data!$A:$D,4,FALSE))),\"\")","v":""},null,{"$f":"IF(BTYPE=\"Custom\",\"CMR:\",\"\")","v":""},null,null,null,{"$f":"CMR_MESSAGE","v":0}]
[null,{"$f":"IF(AND(W>0,H>0),(IF(ISERROR(VLOOKUP(6,Data!$A:$D,3,FALSE)),\"\",VLOOKUP(6,Data!$A:$D,3,FALSE))),\"\")","v":""},null,null,null,null,null,{"$f":"IF(AND(W>0,H>0),(IF(ISERROR(VLOOKUP(6,Data!$A:$D,4,FALSE)),\"\",VLOOKUP(6,Data!$A:$D,4,FALSE))),\"\")","v":""},null,{"$f":"IF(SELECTEXT=\"Select Extrusion\",\"Ext.\",IF(SELECTEXT=\"Select Reinforcement\",\"Reinforce\",IF(SELECTEXT=\"Standard\",\"HP >>\",\"\")))","v":""},null,null,null,{"$f":"REINF_MESSAGE","v":""}]
[null,{"$f":"IF(AND(W>0,H>0),(IF(ISERROR(VLOOKUP(7,Data!$A:$D,3,FALSE)),\"\",VLOOKUP(7,Data!$A:$D,3,FALSE))),\"\")","v":""},null,null,null,null,null,{"$f":"IF(AND(W>0,H>0),(IF(ISERROR(VLOOKUP(7,Data!$A:$D,4,FALSE)),\"\",VLOOKUP(7,Data!$A:$D,4,FALSE))),\"\")","v":""},null,"Opening:",null,null,null,{"$f":"RO_OPTION","v":0}]
[null,{"$f":"IF(AND(W>0,H>0),(IF(ISERROR(VLOOKUP(8,Data!$A:$D,3,FALSE)),\"\",VLOOKUP(8,Data!$A:$D,3,FALSE))),\"\")","v":""},null,null,null,null,null,{"$f":"IF(AND(W>0,H>0),(IF(ISERROR(VLOOKUP(8,Data!$A:$D,4,FALSE)),\"\",VLOOKUP(8,Data!$A:$D,4,FALSE))),\"\")","v":""},null,"Type:"]
[null,{"$f":"IF(AND(W>0,H>0),(IF(ISERROR(VLOOKUP(9,Data!$A:$D,3,FALSE)),\"\",VLOOKUP(9,Data!$A:$D,3,FALSE))),\"\")","v":""},null,null,null,null,null,{"$f":"IF(AND(W>0,H>0),(IF(ISERROR(VLOOKUP(9,Data!$A:$D,4,FALSE)),\"\",VLOOKUP(9,Data!$A:$D,4,FALSE))),\"\")","v":""},null,"Screen:"]
[null,{"$f":"IF(AND(W>0,H>0),(IF(ISERROR(VLOOKUP(10,Data!$A:$D,3,FALSE)),\"\",VLOOKUP(10,Data!$A:$D,3,FALSE))),\"\")","v":""},null,null,null,null,null,{"$f":"IF(AND(W>0,H>0),(IF(ISERROR(VLOOKUP(10,Data!$A:$D,4,FALSE)),\"\",VLOOKUP(10,Data!$A:$D,4,FALSE))),\"\")","v":""},null,"Glass:"]
[]
[null,{"$f":"IF(AND(W>0,H>0),(IF(ISERROR(VLOOKUP(11,Data!$A:$D,3,FALSE)),\"\",VLOOKUP(11,Data!$A:$D,3,FALSE))),\"\")","v":""},null,null,null,null,null,{"$f":"IF(AND(W>0,H>0),(IF(ISERROR(VLOOKUP(11,Data!$A:$D,4,FALSE)),\"\",VLOOKUP(11,Data!$A:$D,4,FALSE))),\"\")","v":""}]
[null,{"$f":"IF(AND(W>0,H>0),(IF(ISERROR(VLOOKUP(12,Data!$A:$D,3,FALSE)),\"\",VLOOKUP(12,Data!$A:$D,3,FALSE))),\"\")","v":""},null,null,null,null,null,{"$f":"IF(AND(W>0,H>0),(IF(ISERROR(VLOOKUP(12,Data!$A:$D,4,FALSE)),\"\",VLOOKUP(12,Data!$A:$D,4,FALSE))),\"\")","v":""}]
[null,{"$f":"IF(AND(W>0,H>0),(IF(ISERROR(VLOOKUP(13,Data!$A:$D,3,FALSE)),\"\",VLOOKUP(13,Data!$A:$D,3,FALSE))),\"\")","v":""},null,null,null,null,null,{"$f":"IF(AND(W>0,H>0),(IF(ISERROR(VLOOKUP(13,Data!$A:$D,4,FALSE)),\"\",VLOOKUP(13,Data!$A:$D,4,FALSE))),\"\")","v":""}]
[null,{"$f":"IF(AND(W>0,H>0),(IF(ISERROR(VLOOKUP(14,Data!$A:$D,3,FALSE)),\"\",VLOOKUP(14,Data!$A:$D,3,FALSE))),\"\")","v":""},null,null,null,null,null,{"$f":"IF(AND(W>0,H>0),(IF(ISERROR(VLOOKUP(14,Data!$A:$D,4,FALSE)),\"\",VLOOKUP(14,Data!$A:$D,4,FALSE))),\"\")","v":""}]
[null,{"$f":"IF(AND(W>0,H>0),(IF(ISERROR(VLOOKUP(15,Data!$A:$D,3,FALSE)),\"\",VLOOKUP(15,Data!$A:$D,3,FALSE))),\"\")","v":""},null,null,null,null,null,{"$f":"IF(AND(W>0,H>0),(IF(ISERROR(VLOOKUP(15,Data!$A:$D,4,FALSE)),\"\",VLOOKUP(15,Data!$A:$D,4,FALSE))),\"\")","v":""}]
[null,{"$f":"IF(AND(W>0,H>0),(IF(ISERROR(VLOOKUP(16,Data!$A:$D,3,FALSE)),\"\",VLOOKUP(16,Data!$A:$D,3,FALSE))),\"\")","v":""},null,null,null,null,null,{"$f":"IF(AND(W>0,H>0),(IF(ISERROR(VLOOKUP(16,Data!$A:$D,4,FALSE)),\"\",VLOOKUP(16,Data!$A:$D,4,FALSE))),\"\")","v":""}]
[null,{"$f":"IF(AND(W>0,H>0),(IF(ISERROR(VLOOKUP(17,Data!$A:$D,3,FALSE)),\"\",VLOOKUP(17,Data!$A:$D,3,FALSE))),\"\")","v":""},null,null,null,null,null,{"$f":"IF(AND(W>0,H>0),(IF(ISERROR(VLOOKUP(17,Data!$A:$D,4,FALSE)),\"\",VLOOKUP(17,Data!$A:$D,4,FALSE))),\"\")","v":""}]
[null,{"$f":"IF(AND(W>0,H>0),(IF(ISERROR(VLOOKUP(18,Data!$A:$D,3,FALSE)),\"\",VLOOKUP(18,Data!$A:$D,3,FALSE))),\"\")","v":""},null,null,null,null,null,{"$f":"IF(AND(W>0,H>0),(IF(ISERROR(VLOOKUP(18,Data!$A:$D,4,FALSE)),\"\",VLOOKUP(18,Data!$A:$D,4,FALSE))),\"\")","v":""}]
[null,{"$f":"IF(AND(W>0,H>0),(IF(ISERROR(VLOOKUP(19,Data!$A:$D,3,FALSE)),\"\",VLOOKUP(19,Data!$A:$D,3,FALSE))),\"\")","v":""},null,null,null,null,null,{"$f":"IF(AND(W>0,H>0),(IF(ISERROR(VLOOKUP(19,Data!$A:$D,4,FALSE)),\"\",VLOOKUP(19,Data!$A:$D,4,FALSE))),\"\")","v":""}]
[null,{"$f":"IF(AND(W>0,H>0),(IF(ISERROR(VLOOKUP(20,Data!$A:$D,3,FALSE)),\"\",VLOOKUP(20,Data!$A:$D,3,FALSE))),\"\")","v":""},null,null,null,null,null,{"$f":"IF(AND(W>0,H>0),(IF(ISERROR(VLOOKUP(20,Data!$A:$D,4,FALSE)),\"\",VLOOKUP(20,Data!$A:$D,4,FALSE))),\"\")","v":""}]

{"sheet":"Balance","index":1,"n_rows":271,"n_cols":44,"rows_kept":271,"cut":false,"hidden":true,"merged":[[1,2,1,4],[31,38,31,39],[31,41,31,42],[0,19,0,23],[1,17,1,20],[1,22,1,25]]}
[null,null,null,null,null,null,null,null,null,null,null,null,null,null,null,null,null,null,null,"BLOCK & TACKLE BALANCE CHART"]
[null,null,"CFB",null,null,null,null,null,null,null,null,null,null,null,null,null,null,"TOP SASH",null,null,null,null,"BOTTOM SASH"]
[null,{"$f":"VLOOKUP(BTM_WGT,CFB_W,3,FALSE)","v":{"$error":"#N/A"}},4,"3/","BN",null,"3M40A","Length","Weight/ft","Weight",null,"8M40A","Length","Weight/ft","Weight",null,null,"Sash Weight","Tube Length","Balance","Weight",null,"Sash Weight","Tube Length","Balance","Weight",null,null,null,null,null,null,null,"Caldwell Balance Chart"]
[null,null,{"$f":"C3+1","v":5},"3/","BN",null,"Bottom Top Rail",{"$f":"BSW_3M40A/12","v":-0.22395833333333334},0.31,{"$f":"H4*I4","v":-6.9427083333333334E-2},null,"Top Top Rail",{"$f":"TSW_8M40A/12","v":-0.31770833333333331},0.28999999999999998,{"$f":"M4*N4","v":-9.213541666666665E-2},null,null,{"$f":"TRUNC(TOP_WGT+GRID)","v":0},{"$f":"$R$9","v":0},"Number","Range",null,{"$f":"TRUNC(BTM_WGT+GRID)","v":0},{"$f":"$W$9","v":0},"Number","Range",null,null,null,null,null,null,null,{"$f":"IF(OR(ModelNo=\"1700\",ModelNo=\"1720\",ModelNo=\"1730\"),1,IF(OR(ModelNo=\"1900\",ModelNo=\"1920\",ModelNo=\"1930\"),2,3))","v":3},{"$f":"IF(OR(ModelNo=\"1700\",ModelNo=\"1720\",ModelNo=\"1730\"),4,IF(OR(ModelNo=\"1900\",ModelNo=\"1920\",ModelNo=\"1930\"),5,6))","v":6},"Bott.","Top",null,1,4,2,5,3,6]
[null,null,6,"3/","BN",null,"Bottom Bottom Rail",{"$f":"BSW_3M40A/12","v":-0.22395833333333334},0.28499999999999998,-6.3828124999999999E-2,null,"Top Bottom Rail",{"$f":"TSW_8M40A/12","v":-0.31770833333333331},0.28499999999999998,-9.0546874999999985E-2,null,null,"Balance Size",{"$f":"IF(AND(T5>0,U5>0),T5,0)","v":0},{"$f":"IF($S$4<=6,6,0)","v":6},{"$f":"IF(AND(T5=6,$R$4>=2,$R$4<=5),T5&\"A\",0)","v":0},null,"Balance Size",{"$f":"IF(AND(Y5>0,Z5>0),Y5,0)","v":0},{"$f":"IF($X$4<=6,6,0)","v":6},{"$f":"IF(AND(Y5=6,$W$4>=2,$W$4<=5),Y5&\"A\",0)","v":0},null,null,null,null,null,null,null,{"$f":"HLOOKUP($AH$4,CALDWELL_LOOKUP,2,FALSE)","v":9},{"$f":"HLOOKUP($AI$4,CALDWELL_LOOKUP,2,FALSE)","v":9.9994999999999994},8,7,null,9.7665000000000006,10.766,9.2185000000000006,10.218,9,9.9994999999999994]
[null,null,7,"4/","RD",null,"Bottom Stile",{"$f":"((BSH_3M40A)*2)/12","v":-9.375E-2},0.25600000000000001,-2.4E-2,null,"Top Stile",{"$f":"IF(AND(TSH_8M40A>33,TSH_8M40A<=44),TSH_8M40A-9,IF(TSH_8M40A>44,TSH_8M40A-12,0))","v":0},0.25600000000000001,0,null,null,{"$f":"VLOOKUP((MAX(S5:S271)),S5:U271,3,FALSE)","v":0},0,6,{"$f":"IF(AND(T6=6,$R$4>=6,$R$4<=9),T6&\"B\",0)","v":0},null,{"$f":"VLOOKUP((MAX(X5:X271)),X5:Z271,3,FALSE)","v":0},0,6,{"$f":"IF(AND(Y6=6,$W$4>=6,$W$4<=9),Y6&\"B\",0)","v":0},null,null,null,null,null,null,null,{"$f":"HLOOKUP($AH$4,CALDWELL_LOOKUP,3,FALSE)","v":10},{"$f":"HLOOKUP($AI$4,CALDWELL_LOOKUP,3,FALSE)","v":10.999499999999999},9,8,null,10.766500000000001,11.766,10.218500000000001,11.218,10,10.999499999999999]
[null,null,8,"4/","RD",null,"Bottom Rail Reinf.",{"$f":"IF(BSW_3M40A>35.25,(BSW_3M40A-8.25)/12,0)","v":0},0.43,0,null,"Top Rail Reinf.",{"$f":"IF(TSW_8M40A>34.125,(TSW_8M40A-7.125)/12,0)","v":0},0.26,0,null,null,null,0,6,{"$f":"IF(AND(T7=6,$R$4>=10,$R$4<=12),T7&\"C\",0)","v":0},null,null,0,6,{"$f":"IF(AND(Y7=6,$W$4>=10,$W$4<=12),Y7&\"C\",0)","v":0},null,null,null,null,null,null,null,{"$f":"HLOOKUP($AH$4,CALDWELL_LOOKUP,4,FALSE)","v":11},{"$f":"HLOOKUP($AI$4,CALDWELL_LOOKUP,4,FALSE)","v":12.999499999999999},10,9,null,11.766500000000001,13.766,11.218500000000001,13.218,11,12.999499999999999]
[null,null,9,"5/","BU",null,"Bottom Stile Reinf.",{"$f":"IF(BSH_3M40A>29.625,BSH_3M40A-10.125,0)","v":0},0.43,0,null,"Keeper Bead",{"$f":"(TGW_8M40A+0.53)/12","v":-0.42979166666666663},5.6000000000000001E-2,{"$f":"M8*N8","v":-2.406833333333333E-2},null,null,"Top Tube length",0,6,{"$f":"IF(AND(T8=6,$R$4>=13,$R$4<=15),T8&\"D\",0)","v":0},null,"Bott. Tube Length",0,6,{"$f":"IF(AND(Y8=6,$W$4>=13,$W$4<=15),Y8&\"D\",0)","v":0},null,null,null,null,null,null,null,{"$f":"HLOOKUP($AH$4,CALDWELL_LOOKUP,5,FALSE)","v":13},{"$f":"HLOOKUP($AI$4,CALDWELL_LOOKUP,5,FALSE)","v":14.999499999999999},12,10,null,13.766500000000002,15.766000000000002,13.218500000000002,15.218000000000002,13,14.999499999999999]
[null,null,10,"5/","BU",null,"Bottom Glass",{"$f":"(BGW_3M40A*BGH_3M40A)/144","v":7.7229817708333329E-2},{"$f":"GLASS_WGT","v":""},{"$f":"IF(AND(Frame_Width=35.5,Frame_Height=59.5),($H$9*$I$9)-2.25,$H$9*$I$9)","v":{"$error":"#VALUE!"}},null,"Top Glass",{"$f":"(TGW_8M40A*TGH_8M40A)/144","v":0.15058051215277779},{"$f":"GLASS_WGT","v":""},{"$error":"#VALUE!"},null,null,{"$f":"IF(OR(ModelNo=\"8001\",ModelNo=\"R601\"),TOPTUBELENGTH,0)","v":0},0,6,{"$f":"IF(AND(T9=6,$R$4>=16,$R$4<=20),T9&\"E\",0)","v":0},null,{"$f":"IF(OR(ModelNo=\"8001\",ModelNo=\"R601\"),BOTTUBELENGTH,0)","v":0},0,6,{"$f":"IF(AND(Y9=6,$W$4>=16,$W$4<=20),Y9&\"E\",0)","v":0},null,null,null,null,null,null,null,{"$f":"HLOOKUP($AH$4,CALDWELL_LOOKUP,6,FALSE)","v":15.000000000000002},{"$f":"HLOOKUP($AI$4,CALDWELL_LOOKUP,6,FALSE)","v":16.999500000000001},14,12,null,15.766500000000001,17.766000000000002,15.218500000000001,17.218,15.000000000000002,16.999500000000001]
[null,null,11,"6/","YW",null,"Bottom Spacer",{"$f":"((BGW_3M40A*2)+(BGH_3M40A*2))/12","v":-1.1666666666666667},0.106,-0.12366666666666667,null,"Top Spacer",{"$f":"((BGW_8M40A*2)+(BGH_8M40A*2))/12","v":-1.2083333333333333},0.106,-0.12808333333333333,null,null,null,0,6,{"$f":"IF(AND(T10=6,$R$4>=21,$R$4<=24),\"Dbl.\"&T10&\"C\",0)","v":0},null,null,0,6,{"$f":"IF(AND(Y10=6,$W$4>=21,$W$4<=24),\"Dbl.\"&Y10&\"C\",0)","v":0},null,null,null,null,null,null,null,{"$f":"HLOOKUP($AH$4,CALDWELL_LOOKUP,7,FALSE)","v":17},{"$f":"HLOOKUP($AI$4,CALDWELL_LOOKUP,7,FALSE)","v":18.999500000000001},16,14,null,17.766500000000001,19.766000000000002,17.218499999999999,19.218,17,18.999500000000001]
[null,null,12,"6/","YW",null,"Bottom Hardware",1,0.36,0.36,null,"Top Hardware",1,0.2,0.2,null,null,null,0,6,{"$f":"IF(AND(T11=6,$R$4>=25,$R$4<=30),\"Dbl.\"&T11&\"D\",0)","v":0},null,null,0,6,{"$f":"IF(AND(Y11=6,$W$4>=25,$W$4<=30),\"Dbl.\"&Y11&\"D\",0)","v":0},null,null,null,null,null,null,null,{"$f":"HLOOKUP($AH$4,CALDWELL_LOOKUP,8,FALSE)","v":19},{"$f":"HLOOKUP($AI$4,CALDWELL_LOOKUP,8,FALSE)","v":20.999500000000001},18,16,null,19.766500000000001,21.766000000000002,19.218499999999999,21.218,19,20.999500000000001]
[null,null,13,"7/","GN",null,"Bottom Bead",{"$f":"((2*(BGW_3M40A+0.532))/12)+((2*(BGH_3M40A-0.985))/12)","v":-1.2421666666666666},5.6000000000000001E-2,-6.9561333333333336E-2,null,"Top Handle Bead",{"$f":"(TGW_8M40A+0.53)/12","v":-0.42979166666666663},5.6000000000000001E-2,-2.406833333333333E-2,null,null,null,0,6,{"$f":"IF(AND(T12=6,$R$4>=31,$R$4<=40),\"Dbl.\"&T12&\"E\",0)","v":0},null,null,0,6,{"$f":"IF(AND(Y12=6,$W$4>=31,$W$4<=40),\"Dbl.\"&Y12&\"E\",0)","v":0},null,null,null,null,null,null,null,{"$f":"HLOOKUP($AH$4,CALDWELL_LOOKUP,9,FALSE)","v":21},{"$f":"HLOOKUP($AI$4,CALDWELL_LOOKUP,9,FALSE)","v":22.999500000000001},20,18,null,21.766500000000001,23.766000000000002,21.218499999999999,23.218,21,22.999500000000001]
[null,null,14,"7/","GN",null,null,null,"Bottom Sash",{"$f":"TRUNC(SUM(J4:J12)+GRID)","v":{"$error":"#VALUE!"}},null,"Top Vert. Bead",{"$f":"((BGH_8M40A-0.875)*2)/12","v":-0.59375},5.6000000000000001E-2,-3.3250000000000002E-2,null,null,null,0,{"$f":"IF(AND($S$4<=8,$S$4>6),8,0)","v":0},{"$f":"IF(AND(T13=8,$R$4>=2,$R$4<=6),T13&\"A\",0)","v":0},null,null,0,{"$f":"IF(AND($X$4<=8,$X$4>6),8,0)","v":0},{"$f":"IF(AND(Y13=8,$W$4>=2,$W$4<=6),Y13&\"A\",0)","v":0},null,null,null,null,null,null,null,{"$f":"HLOOKUP($AH$4,CALDWELL_LOOKUP,10,FALSE)","v":23},{"$f":"HLOOKUP($AI$4,CALDWELL_LOOKUP,10,FALSE)","v":24.999500000000001},22,20,null,23.766500000000001,25.766000000000002,23.218499999999999,25.218,23,24.999500000000001]
[null,null,15,"8/","LG",null,null,null,null,null,null,"Bottom Top Rail",{"$f":"(BSW_8M40A)/12","v":-0.22395833333333334},0.31,-6.9427083333333334E-2,null,null,null,0,0,{"$f":"IF(AND(T14=8,$R$4>=7,$R$4<=10),T14&\"B\",0)","v":0},null,null,0,0,{"$f":"IF(AND(Y14=8,$W$4>=7,$W$4<=10),Y14&\"B\",0)","v":0},null,null,null,null,null,null,null,{"$f":"HLOOKUP($AH$4,CALDWELL_LOOKUP,11,FALSE)","v":25},{"$f":"HLOOKUP($AI$4,CALDWELL_LOOKUP,11,FALSE)","v":26.999500000000001},24,22,null,25.766500000000001,27.766000000000002,25.218499999999999,27.218,25,26.999500000000001]
[null,null,16,"8/","LG",null,"3P40A","Length","Weight/ft","Weight",null,"Bottom Bottom Rail",{"$f":"(BSW_8M40A)/12","v":-0.22395833333333334},0.28499999999999998,-6.3828124999999999E-2,null,null,null,0,0,{"$f":"IF(AND(T15=8,$R$4>=11,$R$4<=13),T15&\"C\",0)","v":0},null,null,0,0,{"$f":"IF(AND(Y15=8,$W$4>=11,$W$4<=13),Y15&\"C\",0)","v":0},null,null,null,null,null,null,null,{"$f":"HLOOKUP($AH$4,CALDWELL_LOOKUP,12,FALSE)","v":27},{"$f":"HLOOKUP($AI$4,CALDWELL_LOOKUP,12,FALSE)","v":28.999500000000001},26,24,null,27.766500000000001,29.766000000000002,27.218499999999999,29.218,27,28.999500000000001]
[null,null,17,"9/","NAT",null,"Bottom Top Rail",{"$f":"BSW_3P40A/12","v":-0.3125},0.31,{"$f":"H16*I16","v":-9.6875000000000003E-2},null,"Bottom Stile",{"$f":"(2*(BSH_8M40A))/12","v":-0.13541666666666666},0.25600000000000001,-3.4666666666666665E-2,null,null,null,0,0,{"$f":"IF(AND(T16=8,$R$4>=14,$R$4<=15),T16&\"D\",0)","v":0},null,null,0,0,{"$f":"IF(AND(Y16=8,$W$4>=14,$W$4<=15),Y16&\"D\",0)","v":0},null,null,null,null,null,null,null,{"$f":"HLOOKUP($AH$4,CALDWELL_LOOKUP,13,FALSE)","v":29},{"$f":"HLOOKUP($AI$4,CALDWELL_LOOKUP,13,FALSE)","v":30.999500000000001},28,26,null,29.766499999999997,31.765999999999998,29.218499999999995,31.217999999999996,29,30.999500000000001]
[null,null,18,"9/","NAT",null,"Bottom Bottom Rail",{"$f":"BSW_3P40A/12","v":-0.3125},0.28499999999999998,-8.9062499999999989E-2,null,"Lock Rail Reinf.",{"$f":"IF(BSW_8M40A>35.25,(BSW_8M40A-8.25)/12,0)","v":0},0.43,0,null,null,null,0,0,{"$f":"IF(AND(T17=8,$R$4>=16,$R$4<=18),T17&\"E\",0)","v":0},null,null,0,0,{"$f":"IF(AND(Y17=8,$W$4>=16,$W$4<=18),Y17&\"E\",0)","v":0},null,null,null,null,null,null,null,{"$f":"HLOOKUP($AH$4,CALDWELL_LOOKUP,14,FALSE)","v":30.999999999999996},{"$f":"HLOOKUP($AI$4,CALDWELL_LOOKUP,14,FALSE)","v":32.999499999999998},30,28,null,31.766500000000001,33.765999999999998,31.218499999999999,33.217999999999996,30.999999999999996,32.999499999999998]
[null,null,19,"10/","PK",null,"Bottom Stile",{"$f":"((BSH_3P40A)*2)/12","v":-0.1875},0.25600000000000001,-4.8000000000000001E-2,null,"Bottom Stile Reinf.",{"$f":"IF(BSH_8M40A>29.625,BSH_8M40A-10.125,0)","v":0},0,0,null,null,null,0,0,{"$f":"IF(AND(T18=8,$R$4>=19,$R$4<=20),\"Dbl.\"&T18&\"B\",0)","v":0},null,null,0,0,{"$f":"IF(AND(Y18=8,$W$4>=19,$W$4<=20),\"Dbl.\"&Y18&\"B\",0)","v":0},null,null,null,null,null,null,null,{"$f":"HLOOKUP($AH$4,CALDWELL_LOOKUP,15,FALSE)","v":33},{"$f":"HLOOKUP($AI$4,CALDWELL_LOOKUP,15,FALSE)","v":34.999499999999998},32,30,null,33.766500000000001,35.765999999999998,33.218499999999999,35.217999999999996,33,34.999499999999998]
[null,null,20,"10/","PK",null,"Bottom Rail Reinf.",{"$f":"IF(BSW_3P40A>35.25,(BSW_3P40A-8.25)/12,0)","v":0},0.43,0,null,"Bottom Glass",{"$f":"(BGW_8M40A*BGH_8M40A)/144","v":8.5150824652777776E-2},{"$f":"GLASS_WGT","v":""},{"$error":"#VALUE!"},null,null,null,0,0,{"$f":"IF(AND(T19=8,$R$4>=21,$R$4<=26),\"Dbl.\"&T19&\"C\",0)","v":0},null,null,0,0,{"$f":"IF(AND(Y19=8,$W$4>=21,$W$4<=26),\"Dbl.\"&Y19&\"C\",0)","v":0},null,null,null,null,null,null,null,{"$f":"HLOOKUP($AH$4,CALDWELL_LOOKUP,16,FALSE)","v":35},{"$f":"HLOOKUP($AI$4,CALDWELL_LOOKUP,16,FALSE)","v":36.999499999999998},34,32,null,35.766500000000001,37.765999999999998,35.218499999999999,37.217999999999996,35,36.999499999999998]
[null,null,21,"11/","BU",null,"Bottom Stile Reinf.",{"$f":"IF(BSH_3P40A>29.625,BSH_3P40A-10.125,0)","v":0},0.43,0,null,"Bottom Spacer",{"$f":"((BGW_8M40A*2)+(BGH_8M40A*2))/12","v":-1.2083333333333333},0.106,-0.12808333333333333,null,null,null,0,0,{"$f":"IF(AND(T20=8,$R$4>=27,$R$4<=32),\"Dbl.\"&T20&\"D\",0)","v":0},null,null,0,0,{"$f":"IF(AND(Y20=8,$W$4>=27,$W$4<=32),\"Dbl.\"&Y20&\"D\",0)","v":0},null,null,null,null,null,null,null,{"$f":"HLOOKUP($AH$4,CALDWELL_LOOKUP,17,FALSE)","v":37},{"$f":"HLOOKUP($AI$4,CALDWELL_LOOKUP,17,FALSE)","v":38.999499999999998},36,34,null,37.766500000000001,39.765999999999998,37.218499999999999,39.217999999999996,37,38.999499999999998]
[null,null,22,"11/","BU",null,"Bottom Glass",{"$f":"(BGW_3P40A*BGH_3P40A)/144","v":0.1171875},{"$f":"GLASS_WGT","v":""},{"$f":"IF(AND(Frame_Width=35.5,Frame_Height=59.5),($H$9*$I$9)-2.25,$H$9*$I$9)","v":{"$error":"#VALUE!"}},null,"Bottom Hardware",1,0.36,0.36,null,null,null,0,0,{"$f":"IF(AND(T21=8,$R$4>=33,$R$4<=36),\"Dbl.\"&T21&\"E\",0)","v":0},null,null,0,0,{"$f":"IF(AND(Y21=8,$W$4>=33,$W$4<=36),\"Dbl.\"&Y21&\"E\",0)","v":0},null,null,null,null,null,null,null,{"$f":"HLOOKUP($AH$4,CALDWELL_LOOKUP,18,FALSE)","v":39},{"$f":"HLOOKUP($AI$4,CALDWELL_LOOKUP,18,FALSE)","v":40.999499999999998},38,36,null,39.766500000000001,41.765999999999998,39.218499999999999,41.217999999999996,39,40.999499999999998]
[null,null,23,"6/6","YW",null,"Bottom Spacer",{"$f":"((BGW_3P40A*2)+(BGH_3P40A*2))/12","v":-1.4375},0.106,{"$f":"H22*I22","v":-0.15237499999999998},null,"Bott. Hor. Bead",{"$f":"(2*(BGW_8M40A+0.532))/12","v":-0.67174999999999996},5.6000000000000001E-2,-3.7617999999999999E-2,null,null,null,0,{"$f":"IF(AND($S$4<=10,$S$4>8),10,0)","v":0},{"$f":"IF(AND(T22=10,$R$4>=1,$R$4<=6),T22&\"A\",0)","v":0},null,null,0,{"$f":"IF(AND($X$4<=10,$X$4>8),10,0)","v":0},{"$f":"IF(AND(Y22=10,$W$4>=1,$W$4<=6),Y22&\"A\",0)","v":0},null,null,null,null,null,null,null,{"$f":"HLOOKUP($AH$4,CALDWELL_LOOKUP,19,FALSE)","v":41},{"$f":"HLOOKUP($AI$4,CALDWELL_LOOKUP,19,FALSE)","v":42.999499999999998},40,38,null,41.766500000000001,43.765999999999998,41.218499999999999,43.217999999999996,41,42.999499999999998]
[null,null,24,"6/6","YW",null,"Bottom Hardware",1,0.36,0.36,null,"Bottom Vert. Bead",{"$f":"(2*(BGH_8M40A-0.985))/12","v":-0.61208333333333331},5.6000000000000001E-2,-3.4276666666666664E-2,null,null,null,0,0,{"$f":"IF(AND(T23=10,$R$4>=7,$R$4<=10),T23&\"B\",0)","v":0},null,null,0,0,{"$f":"IF(AND(Y23=10,$W$4>=7,$W$4<=10),Y23&\"B\",0)","v":0},null,null,null,null,null,null,null,{"$f":"HLOOKUP($AH$4,CALDWELL_LOOKUP,20,FALSE)","v":43},{"$f":"HLOOKUP($AI$4,CALDWELL_LOOKUP,20,FALSE)","v":44.999499999999998},42,40,null,43.766500000000001,45.765999999999998,43.218499999999999,45.217999999999996,43,44.999499999999998]
[null,null,25,"6/7","GN",null,"Bottom Bead",{"$f":"((2*(BGW_3P40A+0.532))/12)+((2*(BGH_3P40A-0.985))/12)","v":-1.5129999999999999},5.6000000000000001E-2,-8.4727999999999998E-2,null,null,null,"Top Sash",{"$f":"TRUNC((SUM(O4:O13))+GRID)","v":{"$error":"#VALUE!"}},null,null,null,0,0,{"$f":"IF(AND(T24=10,$R$4>=11,$R$4<=13),T24&\"C\",0)","v":0},null,null,0,0,{"$f":"IF(AND(Y24=10,$W$4>=11,$W$4<=13),Y24&\"C\",0)","v":0},null,null,null,null,null,null,null,{"$f":"HLOOKUP($AH$4,CALDWELL_LOOKUP,21,FALSE)","v":45},{"$f":"HLOOKUP($AI$4,CALDWELL_LOOKUP,21,FALSE)","v":46.999499999999998},44,42,null,45.766500000000001,47.765999999999998,45.218499999999999,47.217999999999996,45,46.999499999999998]
[null,null,26,"6/7","GN",null,null,null,"Bottom Sash",{"$f":"TRUNC(SUM(J16:J24)+GRID)","v":{"$error":"#VALUE!"}},null,null,null,"Bottom Sash",{"$f":"TRUNC(SUM(O14:O23)+GRID)","v":{"$error":"#VALUE!"}},null,null,null,0,0,{"$f":"IF(AND(T25=10,$R$4>=14,$R$4<=16),T25&\"D\",0)","v":0},null,null,0,0,{"$f":"IF(AND(Y25=10,$W$4>=14,$W$4<=16),Y25&\"D\",0)","v":0},null,null,null,null,null,null,null,{"$f":"HLOOKUP($AH$4,CALDWELL_LOOKUP,22,FALSE)","v":47},{"$f":"HLOOKUP($AI$4,CALDWELL_LOOKUP,22,FALSE)","v":48.999499999999998},46,44,null,47.766500000000001,49.765999999999998,47.218499999999999,49.217999999999996,47,48.999499999999998]
[null,null,27,"7/7","LG",null,null,null,null,null,null,null,null,null,null,null,null,null,0,0,{"$f":"IF(AND(T26=10,$R$4>=17,$R$4<=19),T26&\"E\",0)","v":0},null,null,0,0,{"$f":"IF(AND(Y26=10,$W$4>=17,$W$4<=19),Y26&\"E\",0)","v":0}]
[null,null,28,"7/7","LG",null,"L201",null,null,null,null,"8P40A","Length","Weight/ft","Weight",null,null,null,0,0,{"$f":"IF(AND(T27=10,$R$4=20),\"Dbl.\"&T27&\"B\",0)","v":0},null,null,0,0,{"$f":"IF(AND(Y27=10,$W$4=20),\"Dbl.\"&Y27&\"B\",0)","v":0}]
[null,null,29,"7/8","OR",null,"Top Top Rail",{"$f":"TSW/12","v":0},0.25700000000000001,{"$f":"H28*I28","v":0},null,"Top Top Rail",{"$f":"TSW_8P40A/12","v":-0.40625},0.28999999999999998,{"$f":"M28*N28","v":-0.11781249999999999},null,null,null,0,0,{"$f":"IF(AND(T28=10,$R$4>=21,$R$4<=26),\"Dbl.\"&T28&\"C\",0)","v":0},null,null,0,0,{"$f":"IF(AND(Y28=10,$W$4>=21,$W$4<=26),\"Dbl.\"&Y28&\"C\",0)","v":0}]
[null,null,30,"7/8","OR",null,"Top Bottom Rail",{"$f":"TSW/12","v":0},0.27300000000000002,{"$f":"H29*I29","v":0},null,"Top Bottom Rail",{"$f":"TSW_8P40A/12","v":-0.40625},0.28499999999999998,-0.11578124999999999,null,null,null,0,0,{"$f":"IF(AND(T29=10,$R$4>=27,$R$4<=32),\"Dbl.\"&T29&\"D\",0)","v":0},null,null,0,0,{"$f":"IF(AND(Y29=10,$W$4>=27,$W$4<=32),\"Dbl.\"&Y29&\"D\",0)","v":0}]
[null,null,31,"8/8","WT",null,"Top Stile",{"$f":"2*TSH/12","v":0},0.23300000000000001,0,null,"Top Stile",{"$f":"(TSH_8P40A*2)/12","v":-0.39583333333333331},0.25600000000000001,-0.10133333333333333,null,null,null,0,0,{"$f":"IF(AND(T30=10,$R$4>=33,$R$4<=38),\"Dbl.\"&T30&\"E\",0)","v":0},null,null,0,0,{"$f":"IF(AND(Y30=10,$W$4>=33,$W$4<=38),\"Dbl.\"&Y30&\"E\",0)","v":0}]
[null,null,32,"8/8","WT",null,"Top Rail Reinf.",{"$f":"(((TSW-6)/2)*2)/12","v":-0.5},5.1999999999999998E-2,-2.5999999999999999E-2,null,"Top Rail Reinf.",{"$f":"IF(AND(TSH_8P40A>33,TSH_8P40A<=44),TSH_8P40A-9,IF(TSH_8P40A>44,TSH_8P40A-12,0))","v":0},0.26,0,null,null,null,0,{"$f":"IF(AND($S$4<=12,$S$4>10),12,0)","v":0},{"$f":"IF(AND(T31=12,$R$4>=3,$R$4<=7),T31&\"A\",0)","v":0},null,null,0,{"$f":"IF(AND($X$4<=12,$X$4>10),12,0)","v":0},{"$f":"IF(AND(Y31=12,$W$4>=3,$W$4<=7),Y31&\"A\",0)","v":0}]
[null,null,33,"8/9","NAT",null,"Top Stile Reinf",{"$f":"IF(TGH>26.75,(((DDIM_L201-9.5)/2)*2)/12,0)","v":0},5.1999999999999998E-2,0,null,"Keeper Bead",{"$f":"(TGW_8P40A+0.53)/12","v":-0.51833333333333331},5.6000000000000001E-2,-2.9026666666666666E-2,null,null,null,0,0,{"$f":"IF(AND(T32=12,$R$4>=8,$R$4<=10),T32&\"B\",0)","v":0},null,null,0,0,{"$f":"IF(AND(Y32=12,$W$4>=8,$W$4<=10),Y32&\"B\",0)","v":0},null,null,null,null,null,null,null,null,null,null,null,null,"Sash Height",null,"Balance ","Window Height 50/50 Split",null,"Oriel LBML"]
[null,null,34,"8/9","NAT",null,"Top Glass",{"$f":"(TGW*TGH)/144","v":0},{"$f":"GLASS_WGT","v":""},{"$error":"#VALUE!"},null,"Top Glass",{"$f":"(TGW_8P40A*TGH_8P40A)/144","v":0.19921875},{"$f":"GLASS_WGT","v":""},{"$error":"#VALUE!"},null,null,null,0,0,{"$f":"IF(AND(T33=12,$R$4>=11,$R$4<=16),T33&\"C\",0)","v":0},null,null,0,0,{"$f":"IF(AND(Y33=12,$W$4>=11,$W$4<=16),Y33&\"C\",0)","v":0},null,null,null,null,null,null,null,null,null,null,null,null,"Min Height"," Max Height","Size","Min Height"," Max Height","from Bot of Sill"]
[null,null,35,"9/9","PU",null,"Top Spacer",{"$f":"((TGW*2)+(TGH*2))/12","v":0},5.3600000000000002E-2,0,null,"Top Spacer",{"$f":"((BGW_8P40A*2)+(BGH_8P40A*2))/12","v":-1.4583333333333333},0.106,-0.15458333333333332,null,null,null,0,0,{"$f":"IF(AND(T34=12,$R$4>=17,$R$4<=18),T34&\"D\",0)","v":0},null,null,0,0,{"$f":"IF(AND(Y34=12,$W$4>=17,$W$4<=18),Y34&\"D\",0)","v":0}]
[null,null,36,"9/9","PU",null,"Top Hardware",1,0.2,0.2,null,"Top Hardware",1,0.2,0.2,null,null,null,0,0,{"$f":"IF(AND(T35=12,$R$4>=19,$R$4<=21),T35&\"E\",0)","v":0},null,null,0,0,{"$f":"IF(AND(Y35=12,$W$4>=19,$W$4<=21),Y35&\"E\",0)","v":0},null,null,null,null,null,null,null,null,null,null,null,null,9.7665000000000006,10.766,8,21.125,23.123999999999999,20.283000000000001]
[null,null,37,"9/10","BU",null,"Top Bead",{"$f":"(((Frame_Width-4.3125)*2)+((DDIM_L201-2.625)*2))/12","v":-1.15625},2.8000000000000001E-2,-3.2375000000000001E-2,null,"Top Handle Bead",{"$f":"(TGW_8P40A+0.53)/12","v":-0.51833333333333331},5.6000000000000001E-2,-2.9026666666666666E-2,null,null,null,0,0,{"$f":"IF(AND(T36=12,$R$4>=22,$R$4<=32),\"Dbl.\"&T36&\"C\",0)","v":0},null,null,0,0,{"$f":"IF(AND(Y36=12,$W$4>=22,$W$4<=32),\"Dbl.\"&Y36&\"C\",0)","v":0},null,null,null,null,null,null,null,null,null,null,null,null,10.766500000000001,11.766,9,23.125,25.123999999999999,22.283000000000001]
[null,null,38,"9/10","BU",null,"Bottom Top Rail",{"$f":"BSW/12","v":0},0.246,0,null,"Top Vert. Bead",{"$f":"((BGH_8P40A-0.875)*2)/12","v":-0.66666666666666663},5.6000000000000001E-2,-3.7333333333333329E-2,null,null,null,{"$f":"IF(AND(T37>0,U37>0),T37,0)","v":0},0,{"$f":"IF(AND(T37=12,$R$4>=33,$R$4<=36),\"Dbl.\"&T37&\"D\",0)","v":0},null,null,0,0,{"$f":"IF(AND(Y37=12,$W$4>=33,$W$4<=36),\"Dbl.\"&Y37&\"D\",0)","v":0},null,null,null,null,null,null,null,null,null,null,null,null,11.766500000000001,13.766,10,25.125,29.123999999999999,26.283000000000001]
[null,null,39,"10/10","YW",null,"Bottom Bottom Rail",{"$f":"BSW/12","v":0},0.25700000000000001,0,null,"Bottom Top Rail",{"$f":"(BSW_8P40A)/12","v":-0.3125},0.31,-9.6875000000000003E-2,null,null,null,0,0,{"$f":"IF(AND(T38=12,$R$4>=37,$R$4<=42),\"Dbl.\"&T38&\"E\",0)","v":0},null,null,0,0,{"$f":"IF(AND(Y38=12,$W$4>=37,$W$4<=42),\"Dbl.\"&Y38&\"E\",0)","v":0},null,null,null,null,null,null,null,null,null,null,null,null,13.766500000000002,15.766000000000002,12,29.125000000000004,33.124000000000002,30.283000000000001]
[null,null,40,"10/10","YW",null,"Bottom Stile",{"$f":"2*BSH/12","v":0},0.23300000000000001,0,null,"Bottom Bottom Rail",{"$f":"(BSW_8P40A)/12","v":-0.3125},0.28499999999999998,-8.9062499999999989E-2,null,null,null,0,{"$f":"IF(AND($S$4<=14,$S$4>12),14,0)","v":0},{"$f":"IF(AND(T39=14,$R$4>=3,$R$4<=7),T39&\"A\",0)","v":0},null,null,0,{"$f":"IF(AND($X$4<=14,$X$4>12),14,0)","v":0},{"$f":"IF(AND(Y39=14,$W$4>=3,$W$4<=7),Y39&\"A\",0)","v":0},null,null,null,null,null,null,null,null,null,null,null,null,15.766500000000001,17.766000000000002,14,33.125,37.124000000000002,34.283000000000001]
[null,null,41,"10/11","GN",null,"Bottom Rail Reinf.",{"$f":"(((BSW-6)/2)*2)/12","v":-0.5},5.1999999999999998E-2,-2.5999999999999999E-2,null,"Bottom Stile",{"$f":"(2*(BSH_8P40A))/12","v":-0.20833333333333334},0.25600000000000001,-5.3333333333333337E-2,null,null,null,0,0,{"$f":"IF(AND(T40=14,$R$4>=8,$R$4<=10),T40&\"B\",0)","v":0},null,null,0,0,{"$f":"IF(AND(Y40=14,$W$4>=8,$W$4<=10),Y40&\"B\",0)","v":0},null,null,null,null,null,null,null,null,null,null,null,null,17.766500000000001,19.766000000000002,16,37.125,41.124000000000002,38.282999999999994]
[null,null,42,"10/11","GN",null,"Bottom Stile Reinf.",{"$f":"IF(BGH>27.75,((CDIM_L201-4.5)/2)*2,0)","v":0},5.1999999999999998E-2,0,null,"Lock Rail Reinf.",{"$f":"IF(BSW_8P40A>35.25,(BSW_8P40A-8.25)/12,0)","v":0},0.43,0,null,null,null,0,0,{"$f":"IF(AND(T41=14,$R$4>=11,$R$4<=16),T41&\"C\",0)","v":0},null,null,0,0,{"$f":"IF(AND(Y41=14,$W$4>=11,$W$4<=16),Y41&\"C\",0)","v":0},null,null,null,null,null,null,null,null,null,null,null,null,19.766500000000001,21.766000000000002,18,41.125,45.124000000000002,42.282999999999994]
[null,null,43,"11/11","LG",null,"Bottom Glass",{"$f":"(BGW*BGH)/144","v":0},{"$f":"GLASS_WGT","v":""},{"$error":"#VALUE!"},null,"Bottom Stile Reinf.",{"$f":"IF(BSH_8P40A>29.625,BSH_8P40A-10.125,0)","v":0},0,0,null,null,null,0,0,{"$f":"IF(AND(T42=14,$R$4>=17,$R$4<=19),T42&\"D\",0)","v":0},null,null,0,0,{"$f":"IF(AND(Y42=14,$W$4>=17,$W$4<=19),Y42&\"D\",0)","v":0},null,null,null,null,null,null,null,null,null,null,null,null,21.766500000000001,23.766000000000002,20,45.125,49.124000000000002,46.282999999999994]
[null,null,44,"11/11","LG",null,"Bottom Spacer",{"$f":"((BGW*2)+(BGH*2))/12","v":0},5.3600000000000002E-2,0,null,"Bottom Glass",{"$f":"(BGW_8P40A*BGH_8P40A)/144","v":0.1220703125},{"$f":"GLASS_WGT","v":""},{"$error":"#VALUE!"},null,null,null,0,0,{"$f":"IF(AND(T43=14,$R$4>=20,$R$4<=22),T43&\"E\",0)","v":0},null,null,0,0,{"$f":"IF(AND(Y43=14,$W$4>=20,$W$4<=22),Y43&\"E\",0)","v":0},null,null,null,null,null,null,null,null,null,null,null,null,23.766500000000001,25.766000000000002,22,49.125,53.124000000000002,50.282999999999994]
[null,null,45,"7/8/8","OR",null,"Bottom Hardware",1,0.36,0.36,null,"Bottom Spacer",{"$f":"((BGW_8P40A*2)+(BGH_8P40A*2))/12","v":-1.4583333333333333},0.106,-0.15458333333333332,null,null,null,0,0,{"$f":"IF(AND(T44=14,$R$4>=23,$R$4<=25),T44&\"F\",0)","v":0},null,null,0,0,{"$f":"IF(AND(Y44=14,$W$4>=23,$W$4<=25),Y44&\"F\",0)","v":0},null,null,null,null,null,null,null,null,null,null,null,null,25.766500000000001,27.766000000000002,24,53.125,57.124000000000002,54.282999999999994]
[null,null,46,"7/8/8","OR",null,"Bottom Bead",{"$f":"(((Frame_Width-3.3125)*2)/12)+(((CDIM_L201-1.625)*2)/12)","v":-0.82291666666666674},2.8000000000000001E-2,-2.3041666666666669E-2,null,"Bottom Hardware",1,0.36,0.36,null,null,null,0,0,{"$f":"IF(AND(T45=14,$R$4>=26,$R$4<=28),T45&\"G\",0)","v":0},null,null,0,0,{"$f":"IF(AND(Y45=14,$W$4>=26,$W$4<=28),Y45&\"G\",0)","v":0},null,null,null,null,null,null,null,null,null,null,null,null,27.766500000000001,29.766000000000002,26,57.125,61.124000000000002,58.282999999999994]
[null,null,47,"8/8/8","WT",null,null,null,"Top Sash",{"$f":"TRUNC(SUM(J28:J36)+1+GRID)","v":{"$error":"#VALUE!"}},null,"Bott. Hor. Bead",{"$f":"(2*(BGW_8P40A+0.532))/12","v":-0.84883333333333333},5.6000000000000001E-2,-4.753466666666667E-2,null,null,null,0,0,{"$f":"IF(AND(T46=14,$R$4>=29,$R$4<=31),T46&\"H\",0)","v":0},null,null,0,0,{"$f":"IF(AND(Y46=14,$W$4>=29,$W$4<=31),Y46&\"H\",0)","v":0},null,null,null,null,null,null,null,null,null,null,null,null,29.766499999999997,31.765999999999998,28,61.124999999999993,65.123999999999995,62.282999999999994]
[null,null,48,"8/8/8","WT",null,null,null,"Bott. Sash",{"$f":"TRUNC(SUM(J37:J45)+GRID)","v":{"$error":"#VALUE!"}},null,"Bottom Vert. Bead",{"$f":"(2*(BGH_8P40A-0.985))/12","v":-0.68500000000000005},5.6000000000000001E-2,-3.8360000000000005E-2,null,null,null,0,0,{"$f":"IF(AND(T47=14,$R$4>=32,$R$4<=34),T47&\"I\",0)","v":0},null,null,0,0,{"$f":"IF(AND(Y47=14,$W$4>=32,$W$4<=34),Y47&\"I\",0)","v":0},null,null,null,null,null,null,null,null,null,null,null,null,31.766500000000001,33.765999999999998,30,65.125,69.123999999999995,66.282999999999987]
[null,null,49,"8/8/9","BN",null,null,null,null,null,null,null,null,"Top Sash",{"$f":"TRUNC((SUM(O28:O37))+6.5+GRID)","v":{"$error":"#VALUE!"}},null,null,null,0,0,{"$f":"IF(AND(T48=14,$R$4>=35,$R$4<=38),\"Dbl.\"&T48&\"D\",0)","v":0},null,null,0,0,{"$f":"IF(AND(Y48=14,$W$4>=35,$W$4<=38),\"Dbl.\"&Y48&\"D\",0)","v":0},null,null,null,null,null,null,null,null,null,null,null,null,33.766500000000001,35.765999999999998,32,69.125,73.123999999999995,70.283000000000001]
[null,null,50,"8/8/9","BN",null,null,null,null,null,null,null,null,"Bottom Sash",{"$f":"TRUNC(SUM(O38:O47)+GRID)","v":{"$error":"#VALUE!"}},null,null,null,0,0,{"$f":"IF(AND(T49=14,$R$4>=39,$R$4<=44),\"Dbl.\"&T49&\"E\",0)","v":0},null,null,0,0,{"$f":"IF(AND(Y49=14,$W$4>=39,$W$4<=44),\"Dbl.\"&Y49&\"E\",0)","v":0},null,null,null,null,null,null,null,null,null,null,null,null,35.766500000000001,37.765999999999998,34,73.125,77.123999999999995,74.283000000000001]
[null,null,51,"8/9/9","RD",null,"03A0",null,null,null,null,null,null,null,null,null,null,null,0,0,{"$f":"IF(AND(T50=14,$R$4>=45,$R$4<=50),\"Dbl.\"&T50&\"F\",0)","v":0},null,null,0,0,{"$f":"IF(AND(Y50=14,$W$4>=45,$W$4<=50),\"Dbl.\"&Y50&\"F\",0)","v":0},null,null,null,null,null,null,null,null,null,null,null,null,37.766500000000001,39.765999999999998,36,77.125,81.123999999999995,78.283000000000001]
[null,null,52,"8/9/9","RD",null,"Bottom Top Rail",{"$f":"BSW/12","v":0},0.29699999999999999,{"$f":"H51*I51","v":0},null,null,null,null,null,null,null,null,0,0,{"$f":"IF(AND(T51=14,$R$4>=51,$R$4<=56),\"Dbl.\"&T51&\"G\",0)","v":0},null,null,0,0,{"$f":"IF(AND(Y51=14,$W$4>=51,$W$4<=56),\"Dbl.\"&Y51&\"G\",0)","v":0},null,null,null,null,null,null,null,null,null,null,null,null,39.766500000000001,41.765999999999998,38,81.125,85.123999999999995,82.283000000000001]
[null,null,53,"9/9/9","NAT",null,"Bottom Bottom Rail",{"$f":"BSW/12","v":0},0.23200000000000001,{"$f":"H52*I52","v":0},null,null,null,null,null,null,null,null,0,0,{"$f":"IF(AND(T52=14,$R$4>=57,$R$4<=62),\"Dbl.\"&T52&\"H\",0)","v":0},null,null,0,0,{"$f":"IF(AND(Y52=14,$W$4>=57,$W$4<=62),\"Dbl.\"&Y52&\"H\",0)","v":0},null,null,null,null,null,null,null,null,null,null,null,null,41.766500000000001,43.765999999999998,40,85.125,89.123999999999995,86.283000000000001]
[null,null,54,"9/9/9","NAT",null,"Bottom Stile",{"$f":"(BSH*2)/12","v":0},0.219,0,null,null,null,null,null,null,null,null,0,0,{"$f":"IF(AND(T53=14,$R$4>=63,$R$4<=68),\"Dbl.\"&T53&\"I\",0)","v":0},null,null,0,0,{"$f":"IF(AND(Y53=14,$W$4>=63,$W$4<=68),\"Dbl.\"&Y53&\"I\",0)","v":0},null,null,null,null,null,null,null,null,null,null,null,null,43.766500000000001,45.765999999999998,42,89.125,93.123999999999995,90.283000000000001]
[null,null,55,"9/9/10","BU",null,"Bottom Rail Reinf.",{"$f":"(2*(CDIM_03A0-1.125))/12","v":-0.1875},5.16E-2,-9.6749999999999996E-3,null,null,null,null,null,null,null,null,0,{"$f":"IF(AND($S$4<=16,$S$4>14),16,0)","v":0},{"$f":"IF(AND(T54=16,$R$4>=3,$R$4<=7),T54&\"A\",0)","v":0},null,null,0,{"$f":"IF(AND($X$4<=16,$X$4>14),16,0)","v":0},{"$f":"IF(AND(Y54=16,$W$4>=3,$W$4<=7),Y54&\"A\",0)","v":0},null,null,null,null,null,null,null,null,null,null,null,null,45.766500000000001,47.765999999999998,44,93.125,97.123999999999995,94.283000000000001]
[null,null,56,"9/9/10","BU",null,"Bottom Stile Reinf.",{"$f":"IF(OR(Frame_Height>84,Frame_Width>48,REINF_MESSAGE=\"Steel\"),((TRUNC((CDIM_03A0-4)/2)*2)/12)*2,0)","v":0},0.45600000000000002,0,null,null,null,null,null,null,null,null,0,0,{"$f":"IF(AND(T55=16,$R$4>=8,$R$4<=10),T55&\"B\",0)","v":0},null,null,0,0,{"$f":"IF(AND(Y55=16,$W$4>=8,$W$4<=10),Y55&\"B\",0)","v":0},null,null,null,null,null,null,null,null,null,null,null,null,47.766500000000001,49.765999999999998,46,97.125,101.124,98.283000000000001]
[null,null,57,"9/10/10","LG",null,"Bottom Glass",{"$f":"(BGW*BGH)/144","v":0},{"$f":"GLASS_WGT","v":""},{"$error":"#VALUE!"},null,null,null,null,null,null,null,null,0,0,{"$f":"IF(AND(T56=16,$R$4>=11,$R$4<=16),T56&\"C\",0)","v":0},null,null,0,0,{"$f":"IF(AND(Y56=16,$W$4>=11,$W$4<=16),Y56&\"C\",0)","v":0},null,null,null,null,null,null,null,null,null,null,null,null,null,null,null,null,null,{"$f":"IF(TYPE=2,Frame_Height-(VLOOKUP(BSH,AM35:AR55,6)),2.625)","v":2.625}]
[null,null,58,"9/10/10","LG",null,"Bottom Spacer",{"$f":"((BGW*2)+(BGH*2))/12","v":0},5.3600000000000002E-2,0,null,null,null,null,null,null,null,null,0,0,{"$f":"IF(AND(T57=16,$R$4>=17,$R$4<=19),T57&\"D\",0)","v":0},null,null,0,0,{"$f":"IF(AND(Y57=16,$W$4>=17,$W$4<=19),Y57&\"D\",0)","v":0}]
[null,null,59,"10/10/10","WT",null,"Bottom Hardware",1,0.36,0.36,null,null,null,null,null,null,null,null,0,0,{"$f":"IF(AND(T58=16,$R$4>=20,$R$4<=22),T58&\"E\",0)","v":0},null,null,0,0,{"$f":"IF(AND(Y58=16,$W$4>=20,$W$4<=22),Y58&\"E\",0)","v":0}]
[null,null,60,"10/10/10","WT",null,"Bottom Bead",{"$f":"(((BGW_03A0)*2)+((BGH_03A0)*2))/12","v":-1.2447916666666667},7.1999999999999995E-2,-8.9624999999999996E-2,null,null,null,null,null,null,null,null,0,0,{"$f":"IF(AND(T59=16,$R$4>=23,$R$4<=24),T59&\"F\",0)","v":0},null,null,0,0,{"$f":"IF(AND(Y59=16,$W$4>=23,$W$4<=24),Y59&\"F\",0)","v":0}]
[null,null,61,"10/10/11","OR",null,null,null,"Bott. Sash",{"$f":"TRUNC(SUM(J51:J59)+GRID)","v":{"$error":"#VALUE!"}},null,null,null,null,null,null,null,null,0,0,{"$f":"IF(AND(T60=16,$R$4>=25,$R$4<=28),T60&\"G\",0)","v":0},null,null,0,0,{"$f":"IF(AND(Y60=16,$W$4>=25,$W$4<=28),Y60&\"G\",0)","v":0}]
[null,null,62,"10/10/11","OR",null,null,null,null,null,null,null,null,null,null,null,null,null,0,0,{"$f":"IF(AND(T61=16,$R$4>=29,$R$4<=31),T61&\"H\",0)","v":0},null,null,0,0,{"$f":"IF(AND(Y61=16,$W$4>=29,$W$4<=31),Y61&\"H\",0)","v":0}]
[null,null,63,"10/11/11","BN",null,null,null,null,null,null,null,null,null,null,null,null,null,0,0,{"$f":"IF(AND(T62=16,$R$4>=32,$R$4<=34),T62&\"I\",0)","v":0},null,null,0,0,{"$f":"IF(AND(Y62=16,$W$4>=32,$W$4<=34),Y62&\"I\",0)","v":0}]
[null,null,64,"10/11/11","BN",null,null,null,null,null,null,null,null,null,null,null,null,null,0,0,{"$f":"IF(AND(T63=16,$R$4>=35,$R$4<=36),\"Dbl.\"&T63&\"D\",0)","v":0},null,null,0,0,{"$f":"IF(AND(Y63=16,$W$4>=35,$W$4<=36),\"Dbl.\"&Y63&\"D\",0)","v":0}]
[null,null,65,"11/11/11","GN",null,null,null,null,null,null,null,null,null,null,null,null,null,0,0,{"$f":"IF(AND(T64=16,$R$4>=37,$R$4<=44),\"Dbl.\"&T64&\"E\",0)","v":0},null,null,0,0,{"$f":"IF(AND(Y64=16,$W$4>=37,$W$4<=44),\"Dbl.\"&Y64&\"E\",0)","v":0}]
[null,null,66,"11/11/11","GN",null,null,null,null,null,null,null,null,null,null,null,null,null,0,0,{"$f":"IF(AND(T65=16,$R$4>=45,$R$4<=48),\"Dbl.\"&T65&\"F\",0)","v":0},null,null,0,0,{"$f":"IF(AND(Y65=16,$W$4>=45,$W$4<=48),\"Dbl.\"&Y65&\"F\",0)","v":0}]
[null,null,67,"8/8/9/9","RD",null,null,null,null,null,null,null,null,null,null,null,null,null,0,0,{"$f":"IF(AND(T66=16,$R$4>=49,$R$4<=56),\"Dbl.\"&T66&\"G\",0)","v":0},null,null,0,0,{"$f":"IF(AND(Y66=16,$W$4>=49,$W$4<=56),\"Dbl.\"&Y66&\"G\",0)","v":0}]
[null,null,68,"8/8/9/9","RD",null,null,null,null,null,null,null,null,null,null,null,null,null,0,0,{"$f":"IF(AND(T67=16,$R$4>=57,$R$4<=62),\"Dbl.\"&T67&\"H\",0)","v":0},null,null,0,0,{"$f":"IF(AND(Y67=16,$W$4>=57,$W$4<=62),\"Dbl.\"&Y67&\"H\",0)","v":0}]
[null,null,69,"8/9/9/9","YW",null,null,null,null,null,null,null,null,null,null,null,null,null,0,0,{"$f":"IF(AND(T68=16,$R$4>=63,$R$4<=68),\"Dbl.\"&T68&\"I\",0)","v":0},null,null,0,0,{"$f":"IF(AND(Y68=16,$W$4>=63,$W$4<=68),\"Dbl.\"&Y68&\"I\",0)","v":0}]
[null,null,70,"8/9/9/9","YW",null,null,null,null,null,null,null,null,null,null,null,null,null,{"$f":"IF(AND(T69>0,U69>0),T69,0)","v":0},{"$f":"IF(AND($S$4<=18,$S$4>16),18,0)","v":0},{"$f":"IF(AND(T69=18,$R$4>=4,$R$4<=9),T69&\"A\",0)","v":0},null,null,{"$f":"IF(AND(Y69>0,Z69>0),Y69,0)","v":0},{"$f":"IF(AND($X$4<=18,$X$4>16),18,0)","v":0},{"$f":"IF(AND(Y69=18,$W$4>=4,$W$4<=9),Y69&\"A\",0)","v":0}]
[null,null,71,"9/9/9/9","PU",null,null,null,null,null,null,null,null,null,null,null,null,null,0,0,{"$f":"IF(AND(T70=18,$R$4>=10,$R$4<=13),T70&\"B\",0)","v":0},null,null,0,0,{"$f":"IF(AND(Y70=18,$W$4>=10,$W$4<=13),Y70&\"B\",0)","v":0}]
[null,null,72,"9/9/9/9","PU",null,null,null,null,null,null,null,null,null,null,null,null,null,0,0,{"$f":"IF(AND(T71=18,$R$4>=14,$R$4<=18),T71&\"C\",0)","v":0},null,null,0,0,{"$f":"IF(AND(Y71=18,$W$4>=14,$W$4<=18),Y71&\"C\",0)","v":0}]
[null,null,null,null,null,null,null,null,null,null,null,null,null,null,null,null,null,null,0,0,{"$f":"IF(AND(T72=18,$R$4>=19,$R$4<=21),T72&\"D\",0)","v":0},null,null,0,0,{"$f":"IF(AND(Y72=18,$W$4>=19,$W$4<=21),Y72&\"D\",0)","v":0}]
[null,null,null,null,null,null,null,null,null,null,null,null,null,null,null,null,null,null,0,0,{"$f":"IF(AND(T73=18,$R$4>=22,$R$4<=24),T73&\"E\",0)","v":0},null,null,0,0,{"$f":"IF(AND(Y73=18,$W$4>=22,$W$4<=24),Y73&\"E\",0)","v":0}]
[null,null,4,3,1,null,null,null,null,null,null,null,null,null,null,null,null,null,0,0,{"$f":"IF(AND(T74=18,$R$4>=25,$R$4<=26),T74&\"F\",0)","v":0},null,null,0,0,{"$f":"IF(AND(Y74=18,$W$4>=25,$W$4<=26),Y74&\"F\",0)","v":0}]
[null,null,{"$f":"C74+1","v":5},3,1,null,null,null,null,null,null,null,null,null,null,null,null,null,0,0,{"$f":"IF(AND(T75=18,$R$4>=27,$R$4<=29),T75&\"G\",0)","v":0},null,null,0,0,{"$f":"IF(AND(Y75=18,$W$4>=27,$W$4<=29),Y75&\"G\",0)","v":0}]
[null,null,6,3,1,null,null,null,null,null,null,null,null,null,null,null,null,null,0,0,{"$f":"IF(AND(T76=18,$R$4>=30,$R$4<=32),T76&\"H\",0)","v":0},null,null,0,0,{"$f":"IF(AND(Y76=18,$W$4>=30,$W$4<=32),Y76&\"H\",0)","v":0}]
[null,null,7,4,1,null,null,null,null,null,null,null,null,null,null,null,null,null,0,0,{"$f":"IF(AND(T77=18,$R$4>=33,$R$4<=34),T77&\"I\",0)","v":0},null,null,0,0,{"$f":"IF(AND(Y77=18,$W$4>=33,$W$4<=34),Y77&\"I\",0)","v":0}]
[null,null,8,4,1,null,null,null,null,null,null,null,null,null,null,null,null,null,0,0,{"$f":"IF(AND(T78=18,$R$4>=35,$R$4<=36),\"Dbl.\"&T78&\"C\",0)","v":0},null,null,0,0,{"$f":"IF(AND(Y78=18,$W$4>=35,$W$4<=36),\"Dbl.\"&Y78&\"C\",0)","v":0}]
[null,null,9,5,1,null,null,null,null,null,null,null,null,null,null,null,null,null,0,0,{"$f":"IF(AND(T79=18,$R$4>=37,$R$4<=42),\"Dbl.\"&T79&\"D\",0)","v":0},null,null,0,0,{"$f":"IF(AND(Y79=18,$W$4>=37,$W$4<=42),\"Dbl.\"&Y79&\"D\",0)","v":0}]
[null,null,10,5,1,null,null,null,null,null,null,null,null,null,null,null,null,null,0,0,{"$f":"IF(AND(T80=18,$R$4>=43,$R$4<=48),\"Dbl.\"&T80&\"E\",0)","v":0},null,null,0,0,{"$f":"IF(AND(Y80=18,$W$4>=43,$W$4<=48),\"Dbl.\"&Y80&\"E\",0)","v":0}]
[null,null,11,6,1,null,null,null,null,null,null,null,null,null,null,null,null,null,0,0,{"$f":"IF(AND(T81=18,$R$4>=49,$R$4<=52),\"Dbl.\"&T81&\"F\",0)","v":0},null,null,0,0,{"$f":"IF(AND(Y81=18,$W$4>=49,$W$4<=52),\"Dbl.\"&Y81&\"F\",0)","v":0}]
[null,null,12,6,1,null,null,null,null,null,null,null,null,null,null,null,null,null,0,0,{"$f":"IF(AND(T82=18,$R$4>=53,$R$4<=58),\"Dbl.\"&T82&\"G\",0)","v":0},null,null,0,0,{"$f":"IF(AND(Y82=18,$W$4>=53,$W$4<=58),\"Dbl.\"&Y82&\"G\",0)","v":0}]
[null,null,13,7,1,null,null,null,null,null,null,null,null,null,null,null,null,null,0,0,{"$f":"IF(AND(T83=18,$R$4>=59,$R$4<=64),\"Dbl.\"&T83&\"H\",0)","v":0},null,null,0,0,{"$f":"IF(AND(Y83=18,$W$4>=59,$W$4<=64),\"Dbl.\"&Y83&\"H\",0)","v":0}]
[null,null,14,7,1,null,null,null,null,null,null,null,null,null,null,null,null,null,0,0,{"$f":"IF(AND(T84=18,$R$4>=65,$R$4<=68),\"Dbl.\"&T84&\"I\",0)","v":0},null,null,0,0,{"$f":"IF(AND(Y84=18,$W$4>=65,$W$4<=68),\"Dbl.\"&Y84&\"I\",0)","v":0}]
[null,null,15,8,1,null,null,null,null,null,null,null,null,null,null,null,null,null,0,{"$f":"IF(AND($S$4<=20,$S$4>18),20,0)","v":0},{"$f":"IF(AND(T85=20,$R$4>=5,$R$4<=10),T85&\"A\",0)","v":0},null,null,0,{"$f":"IF(AND($X$4<=20,$X$4>18),20,0)","v":0},{"$f":"IF(AND(Y85=20,$W$4>=5,$W$4<=10),Y85&\"A\",0)","v":0}]
[null,null,16,8,1,null,null,null,null,null,null,null,null,null,null,null,null,null,0,0,{"$f":"IF(AND(T86=20,$R$4>=11,$R$4<=14),T86&\"B\",0)","v":0},null,null,0,0,{"$f":"IF(AND(Y86=20,$W$4>=11,$W$4<=14),Y86&\"B\",0)","v":0}]
[null,null,17,9,1,null,null,null,null,null,null,null,null,null,null,null,null,null,0,0,{"$f":"IF(AND(T87=20,$R$4>=15,$R$4<=18),T87&\"C\",0)","v":0},null,null,0,0,{"$f":"IF(AND(Y87=20,$W$4>=15,$W$4<=18),Y87&\"C\",0)","v":0}]
[null,null,18,9,1,null,null,null,null,null,null,null,null,null,null,null,null,null,0,0,{"$f":"IF(AND(T88=20,$R$4>=19,$R$4<=22),T88&\"D\",0)","v":0},null,null,0,0,{"$f":"IF(AND(Y88=20,$W$4>=19,$W$4<=22),Y88&\"D\",0)","v":0}]
[null,null,19,10,1,null,null,null,null,null,null,null,null,null,null,null,null,null,0,0,{"$f":"IF(AND(T89=20,$R$4>=23,$R$4<=26),T89&\"E\",0)","v":0},null,null,0,0,{"$f":"IF(AND(Y89=20,$W$4>=23,$W$4<=26),Y89&\"E\",0)","v":0}]
[null,null,20,10,1,null,null,null,null,null,null,null,null,null,null,null,null,null,0,0,{"$f":"IF(AND(T90=20,$R$4>=27,$R$4<=30),T90&\"F\",0)","v":0},null,null,0,0,{"$f":"IF(AND(Y90=20,$W$4>=27,$W$4<=30),Y90&\"F\",0)","v":0}]
[null,null,21,"11",1,null,null,null,null,null,null,null,null,null,null,null,null,null,0,0,{"$f":"IF(AND(T91=20,$R$4>=31,$R$4<=34),T91&\"G\",0)","v":0},null,null,0,0,{"$f":"IF(AND(Y91=20,$W$4>=31,$W$4<=34),Y91&\"G\",0)","v":0}]
[null,null,22,"11",1,null,null,null,null,null,null,null,null,null,null,null,null,null,0,0,{"$f":"IF(AND(T92=20,$R$4>=35,$R$4<=37),T92&\"H\",0)","v":0},null,null,0,0,{"$f":"IF(AND(Y92=20,$W$4>=35,$W$4<=37),Y92&\"H\",0)","v":0}]
[null,null,23,"6/6",2,null,null,null,null,null,null,null,null,null,null,null,null,null,0,0,{"$f":"IF(AND(T93=20,$R$4>=38,$R$4<=40),T93&\"I\",0)","v":0},null,null,0,0,{"$f":"IF(AND(Y93=20,$W$4>=38,$W$4<=40),Y93&\"I\",0)","v":0}]
[null,null,24,"6/6",2,null,null,null,null,null,null,null,null,null,null,null,null,null,0,0,{"$f":"IF(AND(T94=20,$R$4>=41,$R$4<=44),\"Dbl.\"&T94&\"D\",0)","v":0},null,null,0,0,{"$f":"IF(AND(Y94=20,$W$4>=41,$W$4<=44),\"Dbl.\"&Y94&\"D\",0)","v":0}]
[null,null,25,"6/7",2,null,null,null,null,null,null,null,null,null,null,null,null,null,0,0,{"$f":"IF(AND(T95=20,$R$4>=45,$R$4<=52),\"Dbl.\"&T95&\"E\",0)","v":0},null,null,0,0,{"$f":"IF(AND(Y95=20,$W$4>=45,$W$4<=52),\"Dbl.\"&Y95&\"E\",0)","v":0}]
[null,null,26,"6/7",2,null,null,null,null,null,null,null,null,null,null,null,null,null,0,0,{"$f":"IF(AND(T96=20,$R$4>=53,$R$4<=60),\"Dbl.\"&T96&\"F\",0)","v":0},null,null,0,0,{"$f":"IF(AND(Y96=20,$W$4>=53,$W$4<=60),\"Dbl.\"&Y96&\"F\",0)","v":0}]
[null,null,27,"7/7",2,null,null,null,null,null,null,null,null,null,null,null,null,null,0,0,{"$f":"IF(AND(T97=20,$R$4>=61,$R$4<=68),\"Dbl.\"&T97&\"G\",0)","v":0},null,null,0,0,{"$f":"IF(AND(Y97=20,$W$4>=61,$W$4<=68),\"Dbl.\"&Y97&\"G\",0)","v":0}]
[null,null,28,"7/7",2,null,null,null,null,null,null,null,null,null,null,null,null,null,0,0,{"$f":"IF(AND(T98=20,$R$4>=69,$R$4<=74),\"Dbl.\"&T98&\"H\",0)","v":0},null,null,0,0,{"$f":"IF(AND(Y98=20,$W$4>=69,$W$4<=74),\"Dbl.\"&Y98&\"H\",0)","v":0}]
[null,null,29,"7/8",2,null,null,null,null,null,null,null,null,null,null,null,null,null,0,0,{"$f":"IF(AND(T99=20,$R$4>=75,$R$4<=80),\"Dbl.\"&T99&\"I\",0)","v":0},null,null,0,0,{"$f":"IF(AND(Y99=20,$W$4>=75,$W$4<=80),\"Dbl.\"&Y99&\"I\",0)","v":0}]
[null,null,30,"7/8",2,null,null,null,null,null,null,null,null,null,null,null,null,null,0,{"$f":"IF(AND($S$4<=22,$S$4>20),22,0)","v":0},{"$f":"IF(AND(T100=22,$R$4>=5,$R$4<=10),T100&\"A\",0)","v":0},null,null,0,{"$f":"IF(AND($X$4<=22,$X$4>20),22,0)","v":0},{"$f":"IF(AND(Y100=22,$W$4>=5,$W$4<=10),Y100&\"A\",0)","v":0}]
[null,null,31,"8/8",2,null,null,null,null,null,null,null,null,null,null,null,null,null,{"$f":"IF(AND(T101>0,U101>0),T101,0)","v":0},0,{"$f":"IF(AND(T101=22,$R$4>=11,$R$4<=16),T101&\"B\",0)","v":0},null,null,0,0,{"$f":"IF(AND(Y101=22,$W$4>=11,$W$4<=16),Y101&\"B\",0)","v":0}]
[null,null,32,"8/8",2,null,null,null,null,null,null,null,null,null,null,null,null,null,0,0,{"$f":"IF(AND(T102=22,$R$4>=17,$R$4<=21),T102&\"C\",0)","v":0},null,null,0,0,{"$f":"IF(AND(Y102=22,$W$4>=17,$W$4<=21),Y102&\"C\",0)","v":0}]
[null,null,33,"8/9",2,null,null,null,null,null,null,null,null,null,null,null,null,null,0,0,{"$f":"IF(AND(T103=22,$R$4>=22,$R$4<=24),T103&\"D\",0)","v":0},null,null,0,0,{"$f":"IF(AND(Y103=22,$W$4>=22,$W$4<=24),Y103&\"D\",0)","v":0}]
[null,null,34,"8/9",2,null,null,null,null,null,null,null,null,null,null,null,null,null,0,0,{"$f":"IF(AND(T104=22,$R$4>=25,$R$4<=27),T104&\"E\",0)","v":0},null,null,0,0,{"$f":"IF(AND(Y104=22,$W$4>=25,$W$4<=27),Y104&\"E\",0)","v":0}]
[null,null,35,"9/9",2,null,null,null,null,null,null,null,null,null,null,null,null,null,0,0,{"$f":"IF(AND(T105=22,$R$4>=28,$R$4<=30),T105&\"F\",0)","v":0},null,null,0,0,{"$f":"IF(AND(Y105=22,$W$4>=28,$W$4<=30),Y105&\"F\",0)","v":0}]
[null,null,36,"9/9",2,null,null,null,null,null,null,null,null,null,null,null,null,null,0,0,{"$f":"IF(AND(T106=22,$R$4>=31,$R$4<=34),T106&\"G\",0)","v":0},null,null,0,0,{"$f":"IF(AND(Y106=22,$W$4>=31,$W$4<=34),Y106&\"G\",0)","v":0}]
[null,null,37,"9/10",2,null,null,null,null,null,null,null,null,null,null,null,null,null,0,0,{"$f":"IF(AND(T107=22,$R$4>=35,$R$4<=37),T107&\"H\",0)","v":0},null,null,0,0,{"$f":"IF(AND(Y107=22,$W$4>=35,$W$4<=37),Y107&\"H\",0)","v":0}]
[null,null,38,"9/10",2,null,null,null,null,null,null,null,null,null,null,null,null,null,0,0,{"$f":"IF(AND(T108=22,$R$4>=38,$R$4<=40),T108&\"I\",0)","v":0},null,null,0,0,{"$f":"IF(AND(Y108=22,$W$4>=38,$W$4<=40),Y108&\"I\",0)","v":0}]
[null,null,39,"10/10",2,null,null,null,null,null,null,null,null,null,null,null,null,null,0,0,{"$f":"IF(AND(T109=22,$R$4>=41,$R$4<=42),\"Dbl.\"&T109&\"C\",0)","v":0},null,null,0,0,{"$f":"IF(AND(Y109=22,$W$4>=41,$W$4<=42),\"Dbl.\"&Y109&\"C\",0)","v":0}]
[null,null,40,"10/10",2,null,null,null,null,null,null,null,null,null,null,null,null,null,0,0,{"$f":"IF(AND(T110=22,$R$4>=43,$R$4<=48),\"Dbl.\"&T110&\"D\",0)","v":0},null,null,0,0,{"$f":"IF(AND(Y110=22,$W$4>=43,$W$4<=48),\"Dbl.\"&Y110&\"D\",0)","v":0}]
[null,null,41,"10/11",2,null,null,null,null,null,null,null,null,null,null,null,null,null,0,0,{"$f":"IF(AND(T111=22,$R$4>=49,$R$4<=54),\"Dbl.\"&T111&\"E\",0)","v":0},null,null,0,0,{"$f":"IF(AND(Y111=22,$W$4>=49,$W$4<=54),\"Dbl.\"&Y111&\"E\",0)","v":0}]
[null,null,42,"10/11",2,null,null,null,null,null,null,null,null,null,null,null,null,null,0,0,{"$f":"IF(AND(T112=22,$R$4>=55,$R$4<=60),\"Dbl.\"&T112&\"F\",0)","v":0},null,null,0,0,{"$f":"IF(AND(Y112=22,$W$4>=55,$W$4<=60),\"Dbl.\"&Y112&\"F\",0)","v":0}]
[null,null,43,"11/11",2,null,null,null,null,null,null,null,null,null,null,null,null,null,0,0,{"$f":"IF(AND(T113=22,$R$4>=61,$R$4<=68),\"Dbl.\"&T113&\"G\",0)","v":0},null,null,0,0,{"$f":"IF(AND(Y113=22,$W$4>=61,$W$4<=68),\"Dbl.\"&Y113&\"G\",0)","v":0}]
[null,null,44,"11/11",2,null,null,null,null,null,null,null,null,null,null,null,null,null,0,0,{"$f":"IF(AND(T114=22,$R$4>=69,$R$4<=74),\"Dbl.\"&T114&\"H\",0)","v":0},null,null,0,0,{"$f":"IF(AND(Y114=22,$W$4>=69,$W$4<=74),\"Dbl.\"&Y114&\"H\",0)","v":0}]
[null,null,45,"8/7/8",3,null,null,null,null,null,null,null,null,null,null,null,null,null,0,0,{"$f":"IF(AND(T115=22,$R$4>=75,$R$4<=80),\"Dbl.\"&T115&\"I\",0)","v":0},null,null,0,0,{"$f":"IF(AND(Y115=22,$W$4>=75,$W$4<=80),\"Dbl.\"&Y115&\"I\",0)","v":0}]
[null,null,46,"8/7/8",3,null,null,null,null,null,null,null,null,null,null,null,null,null,0,{"$f":"IF(AND($S$4<=24,$S$4>22),24,0)","v":0},{"$f":"IF(AND(T116=24,$R$4>=6,$R$4<=10),T116&\"A\",0)","v":0},null,null,0,{"$f":"IF(AND($X$4<=24,$X$4>22),24,0)","v":0},{"$f":"IF(AND(Y116=24,$W$4>=6,$W$4<=10),Y116&\"A\",0)","v":0}]
[null,null,47,"8/8/8",3,null,null,null,null,null,null,null,null,null,null,null,null,null,0,0,{"$f":"IF(AND(T117=24,$R$4>=11,$R$4<=17),T117&\"B\",0)","v":0},null,null,0,0,{"$f":"IF(AND(Y117=24,$W$4>=11,$W$4<=17),Y117&\"B\",0)","v":0}]
[null,null,48,"8/8/8",3,null,null,null,null,null,null,null,null,null,null,null,null,null,0,0,{"$f":"IF(AND(T118=24,$R$4>=18,$R$4<=22),T118&\"C\",0)","v":0},null,null,0,0,{"$f":"IF(AND(Y118=24,$W$4>=18,$W$4<=22),Y118&\"C\",0)","v":0}]
[null,null,49,"8/8/9",3,null,null,null,null,null,null,null,null,null,null,null,null,null,0,0,{"$f":"IF(AND(T119=24,$R$4>=23,$R$4<=25),T119&\"D\",0)","v":0},null,null,0,0,{"$f":"IF(AND(Y119=24,$W$4>=23,$W$4<=25),Y119&\"D\",0)","v":0}]
[null,null,50,"8/8/9",3,null,null,null,null,null,null,null,null,null,null,null,null,null,0,0,{"$f":"IF(AND(T120=24,$R$4>=26,$R$4<=28),T120&\"E\",0)","v":0},null,null,0,0,{"$f":"IF(AND(Y120=24,$W$4>=26,$W$4<=28),Y120&\"E\",0)","v":0}]
[null,null,51,"8/9/9",3,null,null,null,null,null,null,null,null,null,null,null,null,null,0,0,{"$f":"IF(AND(T121=24,$R$4>=29,$R$4<=30),T121&\"F\",0)","v":0},null,null,0,0,{"$f":"IF(AND(Y121=24,$W$4>=29,$W$4<=30),Y121&\"F\",0)","v":0}]
[null,null,52,"8/9/9",3,null,null,null,null,null,null,null,null,null,null,null,null,null,0,0,{"$f":"IF(AND(T122=24,$R$4>=31,$R$4<=34),T122&\"G\",0)","v":0},null,null,0,0,{"$f":"IF(AND(Y122=24,$W$4>=31,$W$4<=34),Y122&\"G\",0)","v":0}]
[null,null,53,"9/9/9",3,null,null,null,null,null,null,null,null,null,null,null,null,null,0,0,{"$f":"IF(AND(T123=24,$R$4>=35,$R$4<=37),T123&\"H\",0)","v":0},null,null,0,0,{"$f":"IF(AND(Y123=24,$W$4>=35,$W$4<=37),Y123&\"H\",0)","v":0}]
[null,null,54,"9/9/9",3,null,null,null,null,null,null,null,null,null,null,null,null,null,0,0,{"$f":"IF(AND(T124=24,$R$4>=38,$R$4<=40),T124&\"I\",0)","v":0},null,null,0,0,{"$f":"IF(AND(Y124=24,$W$4>=38,$W$4<=40),Y124&\"I\",0)","v":0}]
[null,null,55,"9/9/10",3,null,null,null,null,null,null,null,null,null,null,null,null,null,{"$f":"IF(AND(T125>0,U125>0),T125,0)","v":0},0,{"$f":"IF(AND(T125=24,$R$4>=41,$R$4<=44),\"Dbl.\"&T125&\"C\",0)","v":0},null,null,0,0,{"$f":"IF(AND(Y125=24,$W$4>=41,$W$4<=44),\"Dbl.\"&Y125&\"C\",0)","v":0}]
[null,null,56,"9/9/10",3,null,null,null,null,null,null,null,null,null,null,null,null,null,0,0,{"$f":"IF(AND(T126=24,$R$4>=45,$R$4<=50),\"Dbl.\"&T126&\"D\",0)","v":0},null,null,0,0,{"$f":"IF(AND(Y126=24,$W$4>=45,$W$4<=50),\"Dbl.\"&Y126&\"D\",0)","v":0}]
[null,null,57,"9/10/10",3,null,null,null,null,null,null,null,null,null,null,null,null,null,0,0,{"$f":"IF(AND(T127=24,$R$4>=51,$R$4<=56),\"Dbl.\"&T127&\"E\",0)","v":0},null,null,0,0,{"$f":"IF(AND(Y127=24,$W$4>=51,$W$4<=56),\"Dbl.\"&Y127&\"E\",0)","v":0}]
[null,null,58,"9/10/10",3,null,null,null,null,null,null,null,null,null,null,null,null,null,0,0,{"$f":"IF(AND(T128=24,$R$4>=57,$R$4<=60),\"Dbl.\"&T128&\"F\",0)","v":0},null,null,0,0,{"$f":"IF(AND(Y128=24,$W$4>=57,$W$4<=60),\"Dbl.\"&Y128&\"F\",0)","v":0}]
[null,null,59,"10/10/10",3,null,null,null,null,null,null,null,null,null,null,null,null,null,0,0,{"$f":"IF(AND(T129=24,$R$4>=61,$R$4<=68),\"Dbl.\"&T129&\"G\",0)","v":0},null,null,0,0,{"$f":"IF(AND(Y129=24,$W$4>=61,$W$4<=68),\"Dbl.\"&Y129&\"G\",0)","v":0}]
[null,null,60,"10/10/10",3,null,null,null,null,null,null,null,null,null,null,null,null,null,0,0,{"$f":"IF(AND(T130=24,$R$4>=69,$R$4<=74),\"Dbl.\"&T130&\"H\",0)","v":0},null,null,0,0,{"$f":"IF(AND(Y130=24,$W$4>=69,$W$4<=74),\"Dbl.\"&Y130&\"H\",0)","v":0}]
[null,null,61,"10/10/11",3,null,null,null,null,null,null,null,null,null,null,null,null,null,0,0,{"$f":"IF(AND(T131=24,$R$4>=75,$R$4<=80),\"Dbl.\"&T131&\"I\",0)","v":0},null,null,0,0,{"$f":"IF(AND(Y131=24,$W$4>=75,$W$4<=80),\"Dbl.\"&Y131&\"I\",0)","v":0}]
[null,null,62,"10/10/11",3,null,null,null,null,null,null,null,null,null,null,null,null,null,{"$f":"IF(AND(T132>0,U132>0),T132,0)","v":0},{"$f":"IF(AND($S$4<=26,$S$4>24),26,0)","v":0},{"$f":"IF(AND(T132=26,$R$4>=6,$R$4<=11),T132&\"A\",0)","v":0},null,null,0,{"$f":"IF(AND($X$4<=26,$X$4>24),26,0)","v":0},{"$f":"IF(AND(Y132=26,$W$4>=6,$W$4<=11),Y132&\"A\",0)","v":0}]
[null,null,63,"10/11/11",3,null,null,null,null,null,null,null,null,null,null,null,null,null,0,0,{"$f":"IF(AND(T133=26,$R$4>=12,$R$4<=17),T133&\"B\",0)","v":0},null,null,{"$f":"IF(AND(Y133>0,Z133>0),Y133,0)","v":0},0,{"$f":"IF(AND(Y133=26,$W$4>=12,$W$4<=17),Y133&\"B\",0)","v":0}]
[null,null,64,"10/11/11",3,null,null,null,null,null,null,null,null,null,null,null,null,null,0,0,{"$f":"IF(AND(T134=26,$R$4>=18,$R$4<=22),T134&\"C\",0)","v":0},null,null,0,0,{"$f":"IF(AND(Y134=26,$W$4>=18,$W$4<=22),Y134&\"C\",0)","v":0}]
[null,null,65,"11/11/11",3,null,null,null,null,null,null,null,null,null,null,null,null,null,0,0,{"$f":"IF(AND(T135=26,$R$4>=23,$R$4<=26),T135&\"D\",0)","v":0},null,null,0,0,{"$f":"IF(AND(Y135=26,$W$4>=23,$W$4<=26),Y135&\"D\",0)","v":0}]
[null,null,66,"11/11/11",3,null,null,null,null,null,null,null,null,null,null,null,null,null,0,0,{"$f":"IF(AND(T136=26,$R$4>=27,$R$4<=30),T136&\"E\",0)","v":0},null,null,0,0,{"$f":"IF(AND(Y136=26,$W$4>=27,$W$4<=30),Y136&\"E\",0)","v":0}]
[null,null,67,"8/8/9/9",4,null,null,null,null,null,null,null,null,null,null,null,null,null,0,0,{"$f":"IF(AND(T137=26,$R$4>=31,$R$4<=34),T137&\"F\",0)","v":0},null,null,0,0,{"$f":"IF(AND(Y137=26,$W$4>=31,$W$4<=34),Y137&\"F\",0)","v":0}]
[null,null,68,"8/8/9/9",4,null,null,null,null,null,null,null,null,null,null,null,null,null,0,0,{"$f":"IF(AND(T138=26,$R$4>=35,$R$4<=38),T138&\"G\",0)","v":0},null,null,0,0,{"$f":"IF(AND(Y138=26,$W$4>=35,$W$4<=38),Y138&\"G\",0)","v":0}]
[null,null,69,"8/9/9/9",4,null,null,null,null,null,null,null,null,null,null,null,null,null,0,0,{"$f":"IF(AND(T139=26,$R$4>=39,$R$4<=42),T139&\"H\",0)","v":0},null,null,0,0,{"$f":"IF(AND(Y139=26,$W$4>=39,$W$4<=42),Y139&\"H\",0)","v":0}]
[null,null,70,"8/9/9/9",4,null,null,null,null,null,null,null,null,null,null,null,null,null,0,0,{"$f":"IF(AND(T140=26,$R$4>=43,$R$4<=45),T140&\"I\",0)","v":0},null,null,0,0,{"$f":"IF(AND(Y140=26,$W$4>=43,$W$4<=45),Y140&\"I\",0)","v":0}]
[null,null,71,"9/9/9/9",4,null,null,null,null,null,null,null,null,null,null,null,null,null,0,0,{"$f":"IF(AND(T141=26,$R$4>=46,$R$4<=52),\"Dbl.\"&T141&\"D\",0)","v":0},null,null,0,0,{"$f":"IF(AND(Y141=26,$W$4>=46,$W$4<=52),\"Dbl.\"&Y141&\"D\",0)","v":0}]
[null,null,72,"9/9/9/9",4,null,null,null,null,null,null,null,null,null,null,null,null,null,0,0,{"$f":"IF(AND(T142=26,$R$4>=53,$R$4<=60),\"Dbl.\"&T142&\"E\",0)","v":0},null,null,0,0,{"$f":"IF(AND(Y142=26,$W$4>=53,$W$4<=60),\"Dbl.\"&Y142&\"E\",0)","v":0}]
[null,null,null,null,null,null,null,null,null,null,null,null,null,null,null,null,null,null,0,0,{"$f":"IF(AND(T143=26,$R$4>=61,$R$4<=68),\"Dbl.\"&T143&\"F\",0)","v":0},null,null,0,0,{"$f":"IF(AND(Y143=26,$W$4>=61,$W$4<=68),\"Dbl.\"&Y143&\"F\",0)","v":0}]
[null,null,null,null,null,null,null,null,null,null,null,null,null,null,null,null,null,null,0,0,{"$f":"IF(AND(T144=26,$R$4>=69,$R$4<=76),\"Dbl.\"&T144&\"G\",0)","v":0},null,null,0,0,{"$f":"IF(AND(Y144=26,$W$4>=69,$W$4<=76),\"Dbl.\"&Y144&\"G\",0)","v":0}]
[null,null,null,null,null,null,null,null,null,null,null,null,null,null,null,null,null,null,0,0,{"$f":"IF(AND(T145=26,$R$4>=77,$R$4<=80),\"Dbl.\"&T145&\"H\",0)","v":0},null,null,0,0,{"$f":"IF(AND(Y145=26,$W$4>=77,$W$4<=80),\"Dbl.\"&Y145&\"H\",0)","v":0}]
[null,null,null,null,null,null,null,null,null,null,null,null,null,null,null,null,null,null,0,{"$f":"IF(AND($S$4<=28,$S$4>26),28,0)","v":0},{"$f":"IF(AND(T146=28,$R$4>=7,$R$4<=12),T146&\"A\",0)","v":0},null,null,0,{"$f":"IF(AND($X$4<=28,$X$4>26),28,0)","v":0},{"$f":"IF(AND(Y146=28,$W$4>=7,$W$4<=12),Y146&\"A\",0)","v":0}]
[null,null,null,null,null,null,null,null,null,null,null,null,null,null,null,null,null,null,0,0,{"$f":"IF(AND(T147=28,$R$4>=13,$R$4<=18),T147&\"B\",0)","v":0},null,null,0,0,{"$f":"IF(AND(Y147=28,$W$4>=13,$W$4<=18),Y147&\"B\",0)","v":0}]
[null,null,null,null,null,null,null,null,null,null,null,null,null,null,null,null,null,null,0,0,{"$f":"IF(AND(T148=28,$R$4>=19,$R$4<=23),T148&\"C\",0)","v":0},null,null,0,0,{"$f":"IF(AND(Y148=28,$W$4>=19,$W$4<=23),Y148&\"C\",0)","v":0}]
[null,null,null,null,null,null,null,null,null,null,null,null,null,null,null,null,null,null,0,0,{"$f":"IF(AND(T149=28,$R$4>=24,$R$4<=28),T149&\"D\",0)","v":0},null,null,0,0,{"$f":"IF(AND(Y149=28,$W$4>=24,$W$4<=28),Y149&\"D\",0)","v":0}]
[null,null,null,null,null,null,null,null,null,null,null,null,null,null,null,null,null,null,0,0,{"$f":"IF(AND(T150=28,$R$4>=29,$R$4<=32),T150&\"E\",0)","v":0},null,null,0,0,{"$f":"IF(AND(Y150=28,$W$4>=29,$W$4<=32),Y150&\"E\",0)","v":0}]
[null,null,null,null,null,null,null,null,null,null,null,null,null,null,null,null,null,null,0,0,{"$f":"IF(AND(T151=28,$R$4>=33,$R$4<=36),T151&\"F\",0)","v":0},null,null,0,0,{"$f":"IF(AND(Y151=28,$W$4>=33,$W$4<=36),Y151&\"F\",0)","v":0}]
[null,null,null,null,null,null,null,null,null,null,null,null,null,null,null,null,null,null,0,0,{"$f":"IF(AND(T152=28,$R$4>=37,$R$4<=40),T152&\"G\",0)","v":0},null,null,0,0,{"$f":"IF(AND(Y152=28,$W$4>=37,$W$4<=40),Y152&\"G\",0)","v":0}]
[null,null,null,null,null,null,null,null,null,null,null,null,null,null,null,null,null,null,0,0,{"$f":"IF(AND(T153=28,$R$4>=41,$R$4<=43),T153&\"H\",0)","v":0},null,null,0,0,{"$f":"IF(AND(Y153=28,$W$4>=41,$W$4<=43),Y153&\"H\",0)","v":0}]
[null,null,null,null,null,null,null,null,null,null,null,null,null,null,null,null,null,null,0,0,{"$f":"IF(AND(T154=28,$R$4>=44,$R$4<=45),T154&\"I\",0)","v":0},null,null,0,0,{"$f":"IF(AND(Y154=28,$W$4>=44,$W$4<=45),Y154&\"I\",0)","v":0}]
[null,null,null,null,null,null,null,null,null,null,null,null,null,null,null,null,null,null,0,0,{"$f":"IF(AND(T155=28,$R$4=46),\"Dbl.\"&T155&\"C\",0)","v":0},null,null,0,0,{"$f":"IF(AND(Y155=28,$W$4=46),\"Dbl.\"&Y155&\"C\",0)","v":0}]
[null,null,null,null,null,null,null,null,null,null,null,null,null,null,null,null,null,null,0,0,{"$f":"IF(AND(T156=28,$R$4>=47,$R$4<=56),\"Dbl.\"&T156&\"D\",0)","v":0},null,null,0,0,{"$f":"IF(AND(Y156=28,$W$4>=47,$W$4<=56),\"Dbl.\"&Y156&\"D\",0)","v":0}]
[null,null,null,null,null,null,null,null,null,null,null,null,null,null,null,null,null,null,0,0,{"$f":"IF(AND(T157=28,$R$4>=57,$R$4<=64),\"Dbl.\"&T157&\"E\",0)","v":0},null,null,0,0,{"$f":"IF(AND(Y157=28,$W$4>=57,$W$4<=64),\"Dbl.\"&Y157&\"E\",0)","v":0}]
[null,null,null,null,null,null,null,null,null,null,null,null,null,null,null,null,null,null,0,0,{"$f":"IF(AND(T158=28,$R$4>=65,$R$4<=72),\"Dbl.\"&T158&\"F\",0)","v":0},null,null,0,0,{"$f":"IF(AND(Y158=28,$W$4>=65,$W$4<=72),\"Dbl.\"&Y158&\"F\",0)","v":0}]
[null,null,null,null,null,null,null,null,null,null,null,null,null,null,null,null,null,null,0,0,{"$f":"IF(AND(T159=28,$R$4>=73,$R$4<=80),\"Dbl.\"&T159&\"G\",0)","v":0},null,null,0,0,{"$f":"IF(AND(Y159=28,$W$4>=73,$W$4<=80),\"Dbl.\"&Y159&\"G\",0)","v":0}]
[null,null,null,null,null,null,null,null,null,null,null,null,null,null,null,null,null,null,0,{"$f":"IF(AND($S$4<=30,$S$4>28),30,0)","v":0},{"$f":"IF(AND(T160=30,$R$4>=8,$R$4<=13),T160&\"A\",0)","v":0},null,null,0,{"$f":"IF(AND($X$4<=30,$X$4>28),30,0)","v":0},{"$f":"IF(AND(Y160=30,$W$4>=8,$W$4<=13),Y160&\"A\",0)","v":0}]
[null,null,null,null,null,null,null,null,null,null,null,null,null,null,null,null,null,null,0,0,{"$f":"IF(AND(T161=30,$R$4>=14,$R$4<=19),T161&\"B\",0)","v":0},null,null,0,0,{"$f":"IF(AND(Y161=30,$W$4>=14,$W$4<=19),Y161&\"B\",0)","v":0}]
[null,null,null,null,null,null,null,null,null,null,null,null,null,null,null,null,null,null,0,0,{"$f":"IF(AND(T162=30,$R$4>=20,$R$4<=24),T162&\"C\",0)","v":0},null,null,0,0,{"$f":"IF(AND(Y162=30,$W$4>=20,$W$4<=24),Y162&\"C\",0)","v":0}]
[null,null,null,null,null,null,null,null,null,null,null,null,null,null,null,null,null,null,0,0,{"$f":"IF(AND(T163=30,$R$4>=25,$R$4<=29),T163&\"D\",0)","v":0},null,null,0,0,{"$f":"IF(AND(Y163=30,$W$4>=25,$W$4<=29),Y163&\"D\",0)","v":0}]
[null,null,null,null,null,null,null,null,null,null,null,null,null,null,null,null,null,null,{"$f":"IF(AND(T164>0,U164>0),T164,0)","v":0},0,{"$f":"IF(AND(T164=30,$R$4>=30,$R$4<=33),T164&\"E\",0)","v":0},null,null,0,0,{"$f":"IF(AND(Y164=30,$W$4>=30,$W$4<=33),Y164&\"E\",0)","v":0}]
[null,null,null,null,null,null,null,null,null,null,null,null,null,null,null,null,null,null,0,0,{"$f":"IF(AND(T165=30,$R$4>=34,$R$4<=37),T165&\"F\",0)","v":0},null,null,0,0,{"$f":"IF(AND(Y165=30,$W$4>=34,$W$4<=37),Y165&\"F\",0)","v":0}]
[null,null,null,null,null,null,null,null,null,null,null,null,null,null,null,null,null,null,0,0,{"$f":"IF(AND(T166=30,$R$4>=38,$R$4<=40),T166&\"G\",0)","v":0},null,null,0,0,{"$f":"IF(AND(Y166=30,$W$4>=38,$W$4<=40),Y166&\"G\",0)","v":0}]
[null,null,null,null,null,null,null,null,null,null,null,null,null,null,null,null,null,null,0,0,{"$f":"IF(AND(T167=30,$R$4>=41,$R$4<=43),T167&\"H\",0)","v":0},null,null,0,0,{"$f":"IF(AND(Y167=30,$W$4>=41,$W$4<=43),Y167&\"H\",0)","v":0}]
[null,null,null,null,null,null,null,null,null,null,null,null,null,null,null,null,null,null,0,0,{"$f":"IF(AND(T168=30,$R$4>=44,$R$4<=45),T168&\"I\",0)","v":0},null,null,0,0,{"$f":"IF(AND(Y168=30,$W$4>=44,$W$4<=45),Y168&\"I\",0)","v":0}]
[null,null,null,null,null,null,null,null,null,null,null,null,null,null,null,null,null,null,0,0,{"$f":"IF(AND(T169=30,$R$4>=46,$R$4<=48),\"Dbl.\"&T169&\"C\",0)","v":0},null,null,0,0,{"$f":"IF(AND(Y169=30,$W$4>=46,$W$4<=48),\"Dbl.\"&Y169&\"C\",0)","v":0}]
[null,null,null,null,null,null,null,null,null,null,null,null,null,null,null,null,null,null,0,0,{"$f":"IF(AND(T170=30,$R$4>=49,$R$4<=58),\"Dbl.\"&T170&\"D\",0)","v":0},null,null,0,0,{"$f":"IF(AND(Y170=30,$W$4>=49,$W$4<=58),\"Dbl.\"&Y170&\"D\",0)","v":0}]
[null,null,null,null,null,null,null,null,null,null,null,null,null,null,null,null,null,null,0,0,{"$f":"IF(AND(T171=30,$R$4>=59,$R$4<=66),\"Dbl.\"&T171&\"E\",0)","v":0},null,null,0,0,{"$f":"IF(AND(Y171=30,$W$4>=59,$W$4<=66),\"Dbl.\"&Y171&\"E\",0)","v":0}]
[null,null,null,null,null,null,null,null,null,null,null,null,null,null,null,null,null,null,0,0,{"$f":"IF(AND(T172=30,$R$4>=67,$R$4<=74),\"Dbl.\"&T172&\"F\",0)","v":0},null,null,0,0,{"$f":"IF(AND(Y172=30,$W$4>=67,$W$4<=74),\"Dbl.\"&Y172&\"F\",0)","v":0}]
[null,null,null,null,null,null,null,null,null,null,null,null,null,null,null,null,null,null,0,0,{"$f":"IF(AND(T173=30,$R$4>=75,$R$4<=80),\"Dbl.\"&T173&\"G\",0)","v":0},null,null,0,0,{"$f":"IF(AND(Y173=30,$W$4>=75,$W$4<=80),\"Dbl.\"&Y173&\"G\",0)","v":0}]
[null,null,null,null,null,null,null,null,null,null,null,null,null,null,null,null,null,null,0,{"$f":"IF(AND($S$4<=32,$S$4>30),32,0)","v":0},{"$f":"IF(AND(T174=32,$R$4>=8,$R$4<=14),T174&\"A\",0)","v":0},null,null,0,{"$f":"IF(AND($X$4<=32,$X$4>30),32,0)","v":0},{"$f":"IF(AND(Y174=32,$W$4>=8,$W$4<=14),Y174&\"A\",0)","v":0}]
[null,null,null,null,null,null,null,null,null,null,null,null,null,null,null,null,null,null,0,0,{"$f":"IF(AND(T175=32,$R$4>=15,$R$4<=20),T175&\"B\",0)","v":0},null,null,0,0,{"$f":"IF(AND(Y175=32,$W$4>=15,$W$4<=20),Y175&\"B\",0)","v":0}]
[null,null,null,null,null,null,null,null,null,null,null,null,null,null,null,null,null,null,0,0,{"$f":"IF(AND(T176=32,$R$4>=21,$R$4<=25),T176&\"C\",0)","v":0},null,null,0,0,{"$f":"IF(AND(Y176=32,$W$4>=21,$W$4<=25),Y176&\"C\",0)","v":0}]
[null,null,null,null,null,null,null,null,null,null,null,null,null,null,null,null,null,null,0,0,{"$f":"IF(AND(T177=32,$R$4>=26,$R$4<=30),T177&\"D\",0)","v":0},null,null,0,0,{"$f":"IF(AND(Y177=32,$W$4>=26,$W$4<=30),Y177&\"D\",0)","v":0}]
[null,null,null,null,null,null,null,null,null,null,null,null,null,null,null,null,null,null,0,0,{"$f":"IF(AND(T178=32,$R$4>=31,$R$4<=34),T178&\"E\",0)","v":0},null,null,0,0,{"$f":"IF(AND(Y178=32,$W$4>=31,$W$4<=34),Y178&\"E\",0)","v":0}]
[null,null,null,null,null,null,null,null,null,null,null,null,null,null,null,null,null,null,0,0,{"$f":"IF(AND(T179=32,$R$4>=35,$R$4<=37),T179&\"F\",0)","v":0},null,null,0,0,{"$f":"IF(AND(Y179=32,$W$4>=35,$W$4<=37),Y179&\"F\",0)","v":0}]
[null,null,null,null,null,null,null,null,null,null,null,null,null,null,null,null,null,null,0,0,{"$f":"IF(AND(T180=32,$R$4>=38,$R$4<=40),T180&\"G\",0)","v":0},null,null,0,0,{"$f":"IF(AND(Y180=32,$W$4>=38,$W$4<=40),Y180&\"G\",0)","v":0}]
[null,null,null,null,null,null,null,null,null,null,null,null,null,null,null,null,null,null,0,0,{"$f":"IF(AND(T181=32,$R$4>=41,$R$4<=43),T181&\"H\",0)","v":0},null,null,0,0,{"$f":"IF(AND(Y181=32,$W$4>=41,$W$4<=43),Y181&\"H\",0)","v":0}]
[null,null,null,null,null,null,null,null,null,null,null,null,null,null,null,null,null,null,0,0,{"$f":"IF(AND(T182=32,$R$4>=44,$R$4<=45),T182&\"I\",0)","v":0},null,null,0,0,{"$f":"IF(AND(Y182=32,$W$4>=44,$W$4<=45),Y182&\"I\",0)","v":0}]
[null,null,null,null,null,null,null,null,null,null,null,null,null,null,null,null,null,null,0,0,{"$f":"IF(AND(T183=32,$R$4>=46,$R$4<=50),\"Dbl.\"&T183&\"C\",0)","v":0},null,null,0,0,{"$f":"IF(AND(Y183=32,$W$4>=46,$W$4<=50),\"Dbl.\"&Y183&\"C\",0)","v":0}]
[null,null,null,null,null,null,null,null,null,null,null,null,null,null,null,null,null,null,0,0,{"$f":"IF(AND(T184=32,$R$4>=51,$R$4<=60),\"Dbl.\"&T184&\"D\",0)","v":0},null,null,0,0,{"$f":"IF(AND(Y184=32,$W$4>=51,$W$4<=60),\"Dbl.\"&Y184&\"D\",0)","v":0}]
[null,null,null,null,null,null,null,null,null,null,null,null,null,null,null,null,null,null,0,0,{"$f":"IF(AND(T185=32,$R$4>=61,$R$4<=68),\"Dbl.\"&T185&\"E\",0)","v":0},null,null,0,0,{"$f":"IF(AND(Y185=32,$W$4>=61,$W$4<=68),\"Dbl.\"&Y185&\"E\",0)","v":0}]
[null,null,null,null,null,null,null,null,null,null,null,null,null,null,null,null,null,null,0,0,{"$f":"IF(AND(T186=32,$R$4>=69,$R$4<=74),\"Dbl.\"&T186&\"F\",0)","v":0},null,null,0,0,{"$f":"IF(AND(Y186=32,$W$4>=69,$W$4<=74),\"Dbl.\"&Y186&\"F\",0)","v":0}]
[null,null,null,null,null,null,null,null,null,null,null,null,null,null,null,null,null,null,0,0,{"$f":"IF(AND(T187=32,$R$4>=75,$R$4<=80),\"Dbl.\"&T187&\"G\",0)","v":0},null,null,0,0,{"$f":"IF(AND(Y187=32,$W$4>=75,$W$4<=80),\"Dbl.\"&Y187&\"G\",0)","v":0}]
[null,null,null,null,null,null,null,null,null,null,null,null,null,null,null,null,null,null,0,{"$f":"IF(AND($S$4<=34,$S$4>32),34,0)","v":0},{"$f":"IF(AND(T188=34,$R$4>=11,$R$4<=16),T188&\"A\",0)","v":0},null,null,0,{"$f":"IF(AND($X$4<=34,$X$4>32),34,0)","v":0},{"$f":"IF(AND(Y188=34,$W$4>=11,$W$4<=16),Y188&\"A\",0)","v":0}]
[null,null,null,null,null,null,null,null,null,null,null,null,null,null,null,null,null,null,0,0,{"$f":"IF(AND(T189=34,$R$4>=17,$R$4<=22),T189&\"B\",0)","v":0},null,null,0,0,{"$f":"IF(AND(Y189=34,$W$4>=17,$W$4<=22),Y189&\"B\",0)","v":0}]
[null,null,null,null,null,null,null,null,null,null,null,null,null,null,null,null,null,null,0,0,{"$f":"IF(AND(T190=34,$R$4>=23,$R$4<=27),T190&\"C\",0)","v":0},null,null,0,0,{"$f":"IF(AND(Y190=34,$W$4>=23,$W$4<=27),Y190&\"C\",0)","v":0}]
[null,null,null,null,null,null,null,null,null,null,null,null,null,null,null,null,null,null,0,0,{"$f":"IF(AND(T191=34,$R$4>=28,$R$4<=32),T191&\"D\",0)","v":0},null,null,0,0,{"$f":"IF(AND(Y191=34,$W$4>=28,$W$4<=32),Y191&\"D\",0)","v":0}]
[null,null,null,null,null,null,null,null,null,null,null,null,null,null,null,null,null,null,0,0,{"$f":"IF(AND(T192=34,$R$4>=33,$R$4<=34),T192&\"E\",0)","v":0},null,null,0,0,{"$f":"IF(AND(Y192=34,$W$4>=33,$W$4<=34),Y192&\"E\",0)","v":0}]
[null,null,null,null,null,null,null,null,null,null,null,null,null,null,null,null,null,null,0,0,{"$f":"IF(AND(T193=34,$R$4>=35,$R$4<=37),T193&\"F\",0)","v":0},null,null,0,0,{"$f":"IF(AND(Y193=34,$W$4>=35,$W$4<=37),Y193&\"F\",0)","v":0}]
[null,null,null,null,null,null,null,null,null,null,null,null,null,null,null,null,null,null,0,0,{"$f":"IF(AND(T194=34,$R$4>=38,$R$4<=40),T194&\"G\",0)","v":0},null,null,0,0,{"$f":"IF(AND(Y194=34,$W$4>=38,$W$4<=40),Y194&\"G\",0)","v":0}]
[null,null,null,null,null,null,null,null,null,null,null,null,null,null,null,null,null,null,0,0,{"$f":"IF(AND(T195=34,$R$4>=41,$R$4<=43),T195&\"H\",0)","v":0},null,null,0,0,{"$f":"IF(AND(Y195=34,$W$4>=41,$W$4<=43),Y195&\"H\",0)","v":0}]
[null,null,null,null,null,null,null,null,null,null,null,null,null,null,null,null,null,null,{"$f":"IF(AND(T196>0,U196>0),T196,0)","v":0},0,{"$f":"IF(AND(T196=34,$R$4>=44,$R$4<=45),T196&\"I\",0)","v":0},null,null,0,0,{"$f":"IF(AND(Y196=34,$W$4>=44,$W$4<=45),Y196&\"I\",0)","v":0}]
[null,null,null,null,null,null,null,null,null,null,null,null,null,null,null,null,null,null,0,0,{"$f":"IF(AND(T197=34,$R$4>=46,$R$4<=54),\"Dbl.\"&T197&\"C\",0)","v":0},null,null,{"$f":"IF(AND(Y197>0,Z197>0),Y197,0)","v":0},0,{"$f":"IF(AND(Y197=34,$W$4>=46,$W$4<=54),\"Dbl.\"&Y197&\"C\",0)","v":0}]
[null,null,null,null,null,null,null,null,null,null,null,null,null,null,null,null,null,null,0,0,{"$f":"IF(AND(T198=34,$R$4>=55,$R$4<=64),\"Dbl.\"&T198&\"D\",0)","v":0},null,null,0,0,{"$f":"IF(AND(Y198=34,$W$4>=55,$W$4<=64),\"Dbl.\"&Y198&\"D\",0)","v":0}]
[null,null,null,null,null,null,null,null,null,null,null,null,null,null,null,null,null,null,0,0,{"$f":"IF(AND(T199=34,$R$4>=65,$R$4<=68),\"Dbl.\"&T199&\"E\",0)","v":0},null,null,0,0,{"$f":"IF(AND(Y199=34,$W$4>=65,$W$4<=68),\"Dbl.\"&Y199&\"E\",0)","v":0}]
[null,null,null,null,null,null,null,null,null,null,null,null,null,null,null,null,null,null,0,0,{"$f":"IF(AND(T200=34,$R$4>=69,$R$4<=74),\"Dbl.\"&T200&\"F\",0)","v":0},null,null,0,0,{"$f":"IF(AND(Y200=34,$W$4>=69,$W$4<=74),\"Dbl.\"&Y200&\"F\",0)","v":0}]
[null,null,null,null,null,null,null,null,null,null,null,null,null,null,null,null,null,null,0,0,{"$f":"IF(AND(T201=34,$R$4>=75,$R$4<=80),\"Dbl.\"&T201&\"G\",0)","v":0},null,null,0,0,{"$f":"IF(AND(Y201=34,$W$4>=75,$W$4<=80),\"Dbl.\"&Y201&\"G\",0)","v":0}]
[null,null,null,null,null,null,null,null,null,null,null,null,null,null,null,null,null,null,0,{"$f":"IF(AND($S$4<=36,$S$4>34),36,0)","v":0},{"$f":"IF(AND(T202=36,$R$4>=11,$R$4<=16),T202&\"A\",0)","v":0},null,null,0,{"$f":"IF(AND($X$4<=36,$X$4>34),36,0)","v":0},{"$f":"IF(AND(Y202=36,$W$4>=11,$W$4<=16),Y202&\"A\",0)","v":0}]
[null,null,null,null,null,null,null,null,null,null,null,null,null,null,null,null,null,null,0,0,{"$f":"IF(AND(T203=36,$R$4>=17,$R$4<=22),T203&\"B\",0)","v":0},null,null,0,0,{"$f":"IF(AND(Y203=36,$W$4>=17,$W$4<=22),Y203&\"B\",0)","v":0}]
[null,null,null,null,null,null,null,null,null,null,null,null,null,null,null,null,null,null,0,0,{"$f":"IF(AND(T204=36,$R$4>=23,$R$4<=27),T204&\"C\",0)","v":0},null,null,0,0,{"$f":"IF(AND(Y204=36,$W$4>=23,$W$4<=27),Y204&\"C\",0)","v":0}]
[null,null,null,null,null,null,null,null,null,null,null,null,null,null,null,null,null,null,0,0,{"$f":"IF(AND(T205=36,$R$4>=28,$R$4<=32),T205&\"D\",0)","v":0},null,null,0,0,{"$f":"IF(AND(Y205=36,$W$4>=28,$W$4<=32),Y205&\"D\",0)","v":0}]
[null,null,null,null,null,null,null,null,null,null,null,null,null,null,null,null,null,null,0,0,{"$f":"IF(AND(T206=36,$R$4>=33,$R$4<=34),T206&\"E\",0)","v":0},null,null,0,0,{"$f":"IF(AND(Y206=36,$W$4>=33,$W$4<=34),Y206&\"E\",0)","v":0}]
[null,null,null,null,null,null,null,null,null,null,null,null,null,null,null,null,null,null,0,0,{"$f":"IF(AND(T207=36,$R$4>=35,$R$4<=37),T207&\"F\",0)","v":0},null,null,0,0,{"$f":"IF(AND(Y207=36,$W$4>=35,$W$4<=37),Y207&\"F\",0)","v":0}]
[null,null,null,null,null,null,null,null,null,null,null,null,null,null,null,null,null,null,0,0,{"$f":"IF(AND(T208=36,$R$4>=38,$R$4<=40),T208&\"G\",0)","v":0},null,null,0,0,{"$f":"IF(AND(Y208=36,$W$4>=38,$W$4<=40),Y208&\"G\",0)","v":0}]
[null,null,null,null,null,null,null,null,null,null,null,null,null,null,null,null,null,null,0,0,{"$f":"IF(AND(T209=36,$R$4>=41,$R$4<=43),T209&\"H\",0)","v":0},null,null,0,0,{"$f":"IF(AND(Y209=36,$W$4>=41,$W$4<=43),Y209&\"H\",0)","v":0}]
[null,null,null,null,null,null,null,null,null,null,null,null,null,null,null,null,null,null,0,0,{"$f":"IF(AND(T210=36,$R$4>=44,$R$4<=45),T210&\"I\",0)","v":0},null,null,0,0,{"$f":"IF(AND(Y210=36,$W$4>=44,$W$4<=45),Y210&\"I\",0)","v":0}]
[null,null,null,null,null,null,null,null,null,null,null,null,null,null,null,null,null,null,0,0,{"$f":"IF(AND(T211=36,$R$4>=46,$R$4<=54),\"Dbl.\"&T211&\"C\",0)","v":0},null,null,0,0,{"$f":"IF(AND(Y211=36,$W$4>=46,$W$4<=54),\"Dbl.\"&Y211&\"C\",0)","v":0}]
[null,null,null,null,null,null,null,null,null,null,null,null,null,null,null,null,null,null,0,0,{"$f":"IF(AND(T212=36,$R$4>=55,$R$4<=64),\"Dbl.\"&T212&\"D\",0)","v":0},null,null,0,0,{"$f":"IF(AND(Y212=36,$W$4>=55,$W$4<=64),\"Dbl.\"&Y212&\"D\",0)","v":0}]
[null,null,null,null,null,null,null,null,null,null,null,null,null,null,null,null,null,null,0,0,{"$f":"IF(AND(T213=36,$R$4>=65,$R$4<=68),\"Dbl.\"&T213&\"E\",0)","v":0},null,null,0,0,{"$f":"IF(AND(Y213=36,$W$4>=65,$W$4<=68),\"Dbl.\"&Y213&\"E\",0)","v":0}]
[null,null,null,null,null,null,null,null,null,null,null,null,null,null,null,null,null,null,0,0,{"$f":"IF(AND(T214=36,$R$4>=69,$R$4<=74),\"Dbl.\"&T214&\"F\",0)","v":0},null,null,0,0,{"$f":"IF(AND(Y214=36,$W$4>=69,$W$4<=74),\"Dbl.\"&Y214&\"F\",0)","v":0}]
[null,null,null,null,null,null,null,null,null,null,null,null,null,null,null,null,null,null,0,0,{"$f":"IF(AND(T215=36,$R$4>=75,$R$4<=80),\"Dbl.\"&T215&\"G\",0)","v":0},null,null,0,0,{"$f":"IF(AND(Y215=36,$W$4>=75,$W$4<=80),\"Dbl.\"&Y215&\"G\",0)","v":0}]
[null,null,null,null,null,null,null,null,null,null,null,null,null,null,null,null,null,null,0,{"$f":"IF(AND($S$4<=38,$S$4>36),38,0)","v":0},{"$f":"IF(AND(T216=38,$R$4>=11,$R$4<=16),T216&\"A\",0)","v":0},null,null,0,{"$f":"IF(AND($X$4<=38,$X$4>36),38,0)","v":0},{"$f":"IF(AND(Y216=38,$W$4>=11,$W$4<=16),Y216&\"A\",0)","v":0}]
[null,null,null,null,null,null,null,null,null,null,null,null,null,null,null,null,null,null,0,0,{"$f":"IF(AND(T217=38,$R$4>=17,$R$4<=22),T217&\"B\",0)","v":0},null,null,{"$f":"IF(AND(Y217>0,Z217>0),Y217,0)","v":0},0,{"$f":"IF(AND(Y217=38,$W$4>=17,$W$4<=22),Y217&\"B\",0)","v":0}]
[null,null,null,null,null,null,null,null,null,null,null,null,null,null,null,null,null,null,0,0,{"$f":"IF(AND(T218=38,$R$4>=23,$R$4<=27),T218&\"C\",0)","v":0},null,null,0,0,{"$f":"IF(AND(Y218=38,$W$4>=23,$W$4<=27),Y218&\"C\",0)","v":0}]
[null,null,null,null,null,null,null,null,null,null,null,null,null,null,null,null,null,null,0,0,{"$f":"IF(AND(T219=38,$R$4>=28,$R$4<=32),T219&\"D\",0)","v":0},null,null,0,0,{"$f":"IF(AND(Y219=38,$W$4>=28,$W$4<=32),Y219&\"D\",0)","v":0}]
[null,null,null,null,null,null,null,null,null,null,null,null,null,null,null,null,null,null,0,0,{"$f":"IF(AND(T220=38,$R$4>=33,$R$4<=34),T220&\"E\",0)","v":0},null,null,0,0,{"$f":"IF(AND(Y220=38,$W$4>=33,$W$4<=34),Y220&\"E\",0)","v":0}]
[null,null,null,null,null,null,null,null,null,null,null,null,null,null,null,null,null,null,0,0,{"$f":"IF(AND(T221=38,$R$4>=35,$R$4<=37),T221&\"F\",0)","v":0},null,null,0,0,{"$f":"IF(AND(Y221=38,$W$4>=35,$W$4<=37),Y221&\"F\",0)","v":0}]
[null,null,null,null,null,null,null,null,null,null,null,null,null,null,null,null,null,null,0,0,{"$f":"IF(AND(T222=38,$R$4>=38,$R$4<=40),T222&\"G\",0)","v":0},null,null,0,0,{"$f":"IF(AND(Y222=38,$W$4>=38,$W$4<=40),Y222&\"G\",0)","v":0}]
[null,null,null,null,null,null,null,null,null,null,null,null,null,null,null,null,null,null,0,0,{"$f":"IF(AND(T223=38,$R$4>=41,$R$4<=43),T223&\"H\",0)","v":0},null,null,0,0,{"$f":"IF(AND(Y223=38,$W$4>=41,$W$4<=43),Y223&\"H\",0)","v":0}]
[null,null,null,null,null,null,null,null,null,null,null,null,null,null,null,null,null,null,0,0,{"$f":"IF(AND(T224=38,$R$4>=44,$R$4<=45),T224&\"I\",0)","v":0},null,null,0,0,{"$f":"IF(AND(Y224=38,$W$4>=44,$W$4<=45),Y224&\"I\",0)","v":0}]
[null,null,null,null,null,null,null,null,null,null,null,null,null,null,null,null,null,null,0,0,{"$f":"IF(AND(T225=38,$R$4>=46,$R$4<=54),\"Dbl.\"&T225&\"C\",0)","v":0},null,null,0,0,{"$f":"IF(AND(Y225=38,$W$4>=46,$W$4<=54),\"Dbl.\"&Y225&\"C\",0)","v":0}]
[null,null,null,null,null,null,null,null,null,null,null,null,null,null,null,null,null,null,0,0,{"$f":"IF(AND(T226=38,$R$4>=55,$R$4<=64),\"Dbl.\"&T226&\"D\",0)","v":0},null,null,0,0,{"$f":"IF(AND(Y226=38,$W$4>=55,$W$4<=64),\"Dbl.\"&Y226&\"D\",0)","v":0}]
[null,null,null,null,null,null,null,null,null,null,null,null,null,null,null,null,null,null,0,0,{"$f":"IF(AND(T227=38,$R$4>=65,$R$4<=68),\"Dbl.\"&T227&\"E\",0)","v":0},null,null,0,0,{"$f":"IF(AND(Y227=38,$W$4>=65,$W$4<=68),\"Dbl.\"&Y227&\"E\",0)","v":0}]
[null,null,null,null,null,null,null,null,null,null,null,null,null,null,null,null,null,null,{"$f":"IF(AND(T228>0,U228>0),T228,0)","v":0},0,{"$f":"IF(AND(T228=38,$R$4>=69,$R$4<=74),\"Dbl.\"&T228&\"F\",0)","v":0},null,null,0,0,{"$f":"IF(AND(Y228=38,$W$4>=69,$W$4<=74),\"Dbl.\"&Y228&\"F\",0)","v":0}]
[null,null,null,null,null,null,null,null,null,null,null,null,null,null,null,null,null,null,{"$f":"IF(AND(T229>0,U229>0),T229,0)","v":0},0,{"$f":"IF(AND(T229=38,$R$4>=75,$R$4<=80),\"Dbl.\"&T229&\"G\",0)","v":0},null,null,0,0,{"$f":"IF(AND(Y229=38,$W$4>=75,$W$4<=80),\"Dbl.\"&Y229&\"G\",0)","v":0}]
[null,null,null,null,null,null,null,null,null,null,null,null,null,null,null,null,null,null,{"$f":"IF(AND(T230>0,U230>0),T230,0)","v":0},{"$f":"IF(AND($S$4<=40,$S$4>38),40,0)","v":0},{"$f":"IF(AND(T230=40,$R$4>=11,$R$4<=16),T230&\"A\",0)","v":0},null,null,0,{"$f":"IF(AND($X$4<=40,$X$4>38),40,0)","v":0},{"$f":"IF(AND(Y230=40,$W$4>=11,$W$4<=16),Y230&\"A\",0)","v":0}]
[null,null,null,null,null,null,null,null,null,null,null,null,null,null,null,null,null,null,0,0,{"$f":"IF(AND(T231=40,$R$4>=17,$R$4<=22),T231&\"B\",0)","v":0},null,null,0,0,{"$f":"IF(AND(Y231=40,$W$4>=17,$W$4<=22),Y231&\"B\",0)","v":0}]
[null,null,null,null,null,null,null,null,null,null,null,null,null,null,null,null,null,null,0,0,{"$f":"IF(AND(T232=40,$R$4>=23,$R$4<=27),T232&\"C\",0)","v":0},null,null,0,0,{"$f":"IF(AND(Y232=40,$W$4>=23,$W$4<=27),Y232&\"C\",0)","v":0}]
[null,null,null,null,null,null,null,null,null,null,null,null,null,null,null,null,null,null,0,0,{"$f":"IF(AND(T233=40,$R$4>=28,$R$4<=32),T233&\"D\",0)","v":0},null,null,0,0,{"$f":"IF(AND(Y233=40,$W$4>=28,$W$4<=32),Y233&\"D\",0)","v":0}]
[null,null,null,null,null,null,null,null,null,null,null,null,null,null,null,null,null,null,0,0,{"$f":"IF(AND(T234=40,$R$4>=33,$R$4<=34),T234&\"E\",0)","v":0},null,null,0,0,{"$f":"IF(AND(Y234=40,$W$4>=33,$W$4<=34),Y234&\"E\",0)","v":0}]
[null,null,null,null,null,null,null,null,null,null,null,null,null,null,null,null,null,null,0,0,{"$f":"IF(AND(T235=40,$R$4>=35,$R$4<=37),T235&\"F\",0)","v":0},null,null,0,0,{"$f":"IF(AND(Y235=40,$W$4>=35,$W$4<=37),Y235&\"F\",0)","v":0}]
[null,null,null,null,null,null,null,null,null,null,null,null,null,null,null,null,null,null,0,0,{"$f":"IF(AND(T236=40,$R$4>=38,$R$4<=40),T236&\"G\",0)","v":0},null,null,0,0,{"$f":"IF(AND(Y236=40,$W$4>=38,$W$4<=40),Y236&\"G\",0)","v":0}]
[null,null,null,null,null,null,null,null,null,null,null,null,null,null,null,null,null,null,0,0,{"$f":"IF(AND(T237=40,$R$4>=41,$R$4<=43),T237&\"H\",0)","v":0},null,null,0,0,{"$f":"IF(AND(Y237=40,$W$4>=41,$W$4<=43),Y237&\"H\",0)","v":0}]
[null,null,null,null,null,null,null,null,null,null,null,null,null,null,null,null,null,null,0,0,{"$f":"IF(AND(T238=40,$R$4>=44,$R$4<=45),T238&\"I\",0)","v":0},null,null,0,0,{"$f":"IF(AND(Y238=40,$W$4>=44,$W$4<=45),Y238&\"I\",0)","v":0}]
[null,null,null,null,null,null,null,null,null,null,null,null,null,null,null,null,null,null,0,0,{"$f":"IF(AND(T239=40,$R$4>=46,$R$4<=54),\"Dbl.\"&T239&\"C\",0)","v":0},null,null,0,0,{"$f":"IF(AND(Y239=40,$W$4>=46,$W$4<=54),\"Dbl.\"&Y239&\"C\",0)","v":0}]
[null,null,null,null,null,null,null,null,null,null,null,null,null,null,null,null,null,null,0,0,{"$f":"IF(AND(T240=40,$R$4>=55,$R$4<=64),\"Dbl.\"&T240&\"D\",0)","v":0},null,null,0,0,{"$f":"IF(AND(Y240=40,$W$4>=55,$W$4<=64),\"Dbl.\"&Y240&\"D\",0)","v":0}]
[null,null,null,null,null,null,null,null,null,null,null,null,null,null,null,null,null,null,0,0,{"$f":"IF(AND(T241=40,$R$4>=65,$R$4<=68),\"Dbl.\"&T241&\"E\",0)","v":0},null,null,0,0,{"$f":"IF(AND(Y241=40,$W$4>=65,$W$4<=68),\"Dbl.\"&Y241&\"E\",0)","v":0}]
[null,null,null,null,null,null,null,null,null,null,null,null,null,null,null,null,null,null,0,{"$f":"IF(AND($S$4<=40,$S$4>38),470,0)","v":0},{"$f":"IF(AND(T242=40,$R$4>=69,$R$4<=74),\"Dbl.\"&T242&\"F\",0)","v":0},null,null,0,0,{"$f":"IF(AND(Y242=40,$W$4>=69,$W$4<=74),\"Dbl.\"&Y242&\"F\",0)","v":0}]
[null,null,null,null,null,null,null,null,null,null,null,null,null,null,null,null,null,null,0,{"$f":"IF(AND($S$4<=40,$S$4>38),40,0)","v":0},{"$f":"IF(AND(T243=40,$R$4>=75,$R$4<=80),\"Dbl.\"&T243&\"G\",0)","v":0},null,null,0,0,{"$f":"IF(AND(Y243=40,$W$4>=75,$W$4<=80),\"Dbl.\"&Y243&\"G\",0)","v":0}]
[null,null,null,null,null,null,null,null,null,null,null,null,null,null,null,null,null,null,0,{"$f":"IF(AND($S$4<=42,$S$4>40),42,0)","v":0},{"$f":"IF(AND(T244=42,$R$4>=11,$R$4<=16),T244&\"A\",0)","v":0},null,null,0,{"$f":"IF(AND($X$4<=42,$X$4>40),42,0)","v":0},{"$f":"IF(AND(Y244=42,$W$4>=11,$W$4<=16),Y244&\"A\",0)","v":0}]
[null,null,null,null,null,null,null,null,null,null,null,null,null,null,null,null,null,null,0,0,{"$f":"IF(AND(T245=42,$R$4>=17,$R$4<=22),T245&\"B\",0)","v":0},null,null,0,0,{"$f":"IF(AND(Y245=42,$W$4>=17,$W$4<=22),Y245&\"B\",0)","v":0}]
[null,null,null,null,null,null,null,null,null,null,null,null,null,null,null,null,null,null,0,0,{"$f":"IF(AND(T246=42,$R$4>=23,$R$4<=27),T246&\"C\",0)","v":0},null,null,0,0,{"$f":"IF(AND(Y246=42,$W$4>=23,$W$4<=27),Y246&\"C\",0)","v":0}]
[null,null,null,null,null,null,null,null,null,null,null,null,null,null,null,null,null,null,0,0,{"$f":"IF(AND(T247=42,$R$4>=28,$R$4<=32),T247&\"D\",0)","v":0},null,null,0,0,{"$f":"IF(AND(Y247=42,$W$4>=28,$W$4<=32),Y247&\"D\",0)","v":0}]
[null,null,null,null,null,null,null,null,null,null,null,null,null,null,null,null,null,null,0,0,{"$f":"IF(AND(T248=42,$R$4>=33,$R$4<=34),T248&\"E\",0)","v":0},null,null,0,0,{"$f":"IF(AND(Y248=42,$W$4>=33,$W$4<=34),Y248&\"E\",0)","v":0}]
[null,null,null,null,null,null,null,null,null,null,null,null,null,null,null,null,null,null,0,0,{"$f":"IF(AND(T249=42,$R$4>=35,$R$4<=37),T249&\"F\",0)","v":0},null,null,0,0,{"$f":"IF(AND(Y249=42,$W$4>=35,$W$4<=37),Y249&\"F\",0)","v":0}]
[null,null,null,null,null,null,null,null,null,null,null,null,null,null,null,null,null,null,0,0,{"$f":"IF(AND(T250=42,$R$4>=38,$R$4<=40),T250&\"G\",0)","v":0},null,null,0,0,{"$f":"IF(AND(Y250=42,$W$4>=38,$W$4<=40),Y250&\"G\",0)","v":0}]
[null,null,null,null,null,null,null,null,null,null,null,null,null,null,null,null,null,null,0,0,{"$f":"IF(AND(T251=42,$R$4>=41,$R$4<=43),T251&\"H\",0)","v":0},null,null,0,0,{"$f":"IF(AND(Y251=42,$W$4>=41,$W$4<=43),Y251&\"H\",0)","v":0}]
[null,null,null,null,null,null,null,null,null,null,null,null,null,null,null,null,null,null,0,0,{"$f":"IF(AND(T252=42,$R$4>=44,$R$4<=45),T252&\"I\",0)","v":0},null,null,0,0,{"$f":"IF(AND(Y252=42,$W$4>=44,$W$4<=45),Y252&\"I\",0)","v":0}]
[null,null,null,null,null,null,null,null,null,null,null,null,null,null,null,null,null,null,0,0,{"$f":"IF(AND(T253=42,$R$4>=46,$R$4<=54),\"Dbl.\"&T253&\"C\",0)","v":0},null,null,0,0,{"$f":"IF(AND(Y253=42,$W$4>=46,$W$4<=54),\"Dbl.\"&Y253&\"C\",0)","v":0}]
[null,null,null,null,null,null,null,null,null,null,null,null,null,null,null,null,null,null,0,0,{"$f":"IF(AND(T254=42,$R$4>=55,$R$4<=64),\"Dbl.\"&T254&\"D\",0)","v":0},null,null,0,0,{"$f":"IF(AND(Y254=42,$W$4>=55,$W$4<=64),\"Dbl.\"&Y254&\"D\",0)","v":0}]
[null,null,null,null,null,null,null,null,null,null,null,null,null,null,null,null,null,null,0,0,{"$f":"IF(AND(T255=42,$R$4>=65,$R$4<=68),\"Dbl.\"&T255&\"E\",0)","v":0},null,null,0,0,{"$f":"IF(AND(Y255=42,$W$4>=65,$W$4<=68),\"Dbl.\"&Y255&\"E\",0)","v":0}]
[null,null,null,null,null,null,null,null,null,null,null,null,null,null,null,null,null,null,0,0,{"$f":"IF(AND(T256=42,$R$4>=69,$R$4<=74),\"Dbl.\"&T256&\"F\",0)","v":0},null,null,0,0,{"$f":"IF(AND(Y256=42,$W$4>=69,$W$4<=74),\"Dbl.\"&Y256&\"F\",0)","v":0}]
[null,null,null,null,null,null,null,null,null,null,null,null,null,null,null,null,null,null,0,0,{"$f":"IF(AND(T257=42,$R$4>=75,$R$4<=80),\"Dbl.\"&T257&\"G\",0)","v":0},null,null,0,0,{"$f":"IF(AND(Y257=42,$W$4>=75,$W$4<=80),\"Dbl.\"&Y257&\"G\",0)","v":0}]
[null,null,null,null,null,null,null,null,null,null,null,null,null,null,null,null,null,null,0,{"$f":"IF(AND($S$4<=44,$S$4>42),44,0)","v":0},{"$f":"IF(AND(T258=44,$R$4>=11,$R$4<=16),T258&\"A\",0)","v":0},null,null,0,{"$f":"IF(AND($X$4<=44,$X$4>42),44,0)","v":0},{"$f":"IF(AND(Y258=44,$W$4>=11,$W$4<=16),Y258&\"A\",0)","v":0}]
[null,null,null,null,null,null,null,null,null,null,null,null,null,null,null,null,null,null,0,0,{"$f":"IF(AND(T259=44,$R$4>=17,$R$4<=22),T259&\"B\",0)","v":0},null,null,{"$f":"IF(AND(Y259>0,Z259>0),Y259,0)","v":0},0,{"$f":"IF(AND(Y259=44,$W$4>=17,$W$4<=22),Y259&\"B\",0)","v":0}]
[null,null,null,null,null,null,null,null,null,null,null,null,null,null,null,null,null,null,0,0,{"$f":"IF(AND(T260=44,$R$4>=23,$R$4<=27),T260&\"C\",0)","v":0},null,null,0,0,{"$f":"IF(AND(Y260=44,$W$4>=23,$W$4<=27),Y260&\"C\",0)","v":0}]
[null,null,null,null,null,null,null,null,null,null,null,null,null,null,null,null,null,null,0,0,{"$f":"IF(AND(T261=44,$R$4>=28,$R$4<=32),T261&\"D\",0)","v":0},null,null,0,0,{"$f":"IF(AND(Y261=44,$W$4>=28,$W$4<=32),Y261&\"D\",0)","v":0}]
[null,null,null,null,null,null,null,null,null,null,null,null,null,null,null,null,null,null,0,0,{"$f":"IF(AND(T262=44,$R$4>=33,$R$4<=34),T262&\"E\",0)","v":0},null,null,0,0,{"$f":"IF(AND(Y262=44,$W$4>=33,$W$4<=34),Y262&\"E\",0)","v":0}]
[null,null,null,null,null,null,null,null,null,null,null,null,null,null,null,null,null,null,0,0,{"$f":"IF(AND(T263=44,$R$4>=35,$R$4<=37),T263&\"F\",0)","v":0},null,null,0,0,{"$f":"IF(AND(Y263=44,$W$4>=35,$W$4<=37),Y263&\"F\",0)","v":0}]
[null,null,null,null,null,null,null,null,null,null,null,null,null,null,null,null,null,null,0,0,{"$f":"IF(AND(T264=44,$R$4>=38,$R$4<=40),T264&\"G\",0)","v":0},null,null,0,0,{"$f":"IF(AND(Y264=44,$W$4>=38,$W$4<=40),Y264&\"G\",0)","v":0}]
[null,null,null,null,null,null,null,null,null,null,null,null,null,null,null,null,null,null,0,0,{"$f":"IF(AND(T265=44,$R$4>=41,$R$4<=43),T265&\"H\",0)","v":0},null,null,0,0,{"$f":"IF(AND(Y265=44,$W$4>=41,$W$4<=43),Y265&\"H\",0)","v":0}]
[null,null,null,null,null,null,null,null,null,null,null,null,null,null,null,null,null,null,0,0,{"$f":"IF(AND(T266=44,$R$4>=44,$R$4<=45),T266&\"I\",0)","v":0},null,null,0,0,{"$f":"IF(AND(Y266=44,$W$4>=44,$W$4<=45),Y266&\"I\",0)","v":0}]
[null,null,null,null,null,null,null,null,null,null,null,null,null,null,null,null,null,null,0,0,{"$f":"IF(AND(T267=44,$R$4>=46,$R$4<=54),\"Dbl.\"&T267&\"C\",0)","v":0},null,null,0,0,{"$f":"IF(AND(Y267=44,$W$4>=46,$W$4<=54),\"Dbl.\"&Y267&\"C\",0)","v":0}]
[null,null,null,null,null,null,null,null,null,null,null,null,null,null,null,null,null,null,0,0,{"$f":"IF(AND(T268=44,$R$4>=55,$R$4<=64),\"Dbl.\"&T268&\"D\",0)","v":0},null,null,0,0,{"$f":"IF(AND(Y268=44,$W$4>=55,$W$4<=64),\"Dbl.\"&Y268&\"D\",0)","v":0}]
[null,null,null,null,null,null,null,null,null,null,null,null,null,null,null,null,null,null,0,0,{"$f":"IF(AND(T269=44,$R$4>=65,$R$4<=68),\"Dbl.\"&T269&\"E\",0)","v":0},null,null,0,0,{"$f":"IF(AND(Y269=44,$W$4>=65,$W$4<=68),\"Dbl.\"&Y269&\"E\",0)","v":0}]
[null,null,null,null,null,null,null,null,null,null,null,null,null,null,null,null,null,null,{"$f":"IF(AND(T270>0,U270>0),T270,0)","v":0},0,{"$f":"IF(AND(T270=44,$R$4>=69,$R$4<=74),\"Dbl.\"&T270&\"F\",0)","v":0},null,null,0,0,{"$f":"IF(AND(Y270=44,$W$4>=69,$W$4<=74),\"Dbl.\"&Y270&\"F\",0)","v":0}]
[null,null,null,null,null,null,null,null,null,null,null,null,null,null,null,null,null,null,{"$f":"IF(AND(T271>0,U271>0),T271,0)","v":0},0,{"$f":"IF(AND(T271=44,$R$4>=75,$R$4<=80),\"Dbl.\"&T271&\"G\",0)","v":0},null,null,0,0,{"$f":"IF(AND(Y271=44,$W$4>=75,$W$4<=80),\"Dbl.\"&Y271&\"G\",0)","v":0}]

{"sheet":"Tables","index":2,"n_rows":23,"n_cols":15,"rows_kept":23,"cut":false,"hidden":true,"merged":[]}
[]
[null,null,null,null,null,"Glass Strength"]
[null,null,1,{"$f":"IF(F3>\"\",VLOOKUP(F3,GLASSLOOKUP,2,FALSE),\"\")","v":""},{"$f":"IF(F3>\"\",VLOOKUP(D3,WEIGHTCHART,2,FALSE),\"\")","v":""},{"$f":"GLASS1","v":""},null,null,"Extrusion"]
[null,null,2,"","",{"$f":"GLASS2","v":""},null,1,{"$f":"IF(EXT_1=0,\"\",EXT_1)","v":""},0,0,null,null,null,"Type"]
[null,null,3,"","",{"$f":"GLASS3","v":""},null,2,{"$f":"IF(EXT_2=0,\"\",EXT_2)","v":""},2.40625,12.5,null,null,1,{"$f":"IF(TYPE1>\"\",TYPE1,\"\")","v":""}]
[null,null,4,"","",{"$f":"GLASS4","v":""},null,3,{"$f":"IF(EXT_3=0,\"\",EXT_3)","v":""},2.40625,13,null,null,2,{"$f":"IF(TYPE2>\"\",TYPE2,\"\")","v":""}]
[null,null,5,"","",{"$f":"GLASS5","v":""},null,4,{"$f":"IF(EXT_5=0,\"\",EXT_5)","v":""},1,10,null,null,3,{"$f":"IF(TYPE3>\"\",TYPE3,\"\")","v":""}]
[null,null,6,"","",{"$f":"GLASS6","v":""},null,5,{"$f":"IF(EXT_4=0,\"\",EXT_6)","v":""},1.75,11.75,null,null,1,{"$f":"VLOOKUP(TYPE,N5:O8,2,FALSE)","v":""}]
[null,null,7,"","",{"$f":"GLASS7","v":""},null,6,{"$f":"IF(EXT_4=0,\"\",EXT_7)","v":""},1.8125,12]
[null,null,8,"","",{"$f":"GLASS8","v":""},null,7,{"$f":"IF(EXT_5=0,\"\",EXT_8)","v":""},1.8125,12]
[null,null,null,null,null,1,null,null,1,{"$f":"VLOOKUP(EXTSELECT,H4:J10,3,FALSE)","v":0},{"$f":"IF(AND(OR(ModelNo=\"03A0\",ModelNo=\"03A2\",ModelNo=\"03A3\",ModelNo=\"03A9\"),EXTSELECT=1,W>0,H>0),\"<< Must Select\",\"\")","v":""},null,null,null,"Opening"]
[null,null,null,null,{"$f":"VLOOKUP(GT,D3:E10,2,FALSE)","v":""},{"$f":"VLOOKUP(Glass,C3:E10,2,FALSE)","v":""},null,null,null,null,null,null,null,1,"Exact Size"]
[null,null,null,null,null,null,null,null,null,null,null,null,null,2,"Rough Opening"]
[null,null,null,null,null,null,null,null,null,null,null,null,null,1,{"$f":"VLOOKUP(RO,N12:O13,2,FALSE)","v":"Exact Size"}]
[null,null,null,null,null,null,null,null,{"$f":"IF(Frame_Width>=24,\"Egress Width (Using 13in Hinge)\",\"\")","v":""}]
[null,null,null,null,null,null,null,null,null,null,null,null,null,{"$f":"IF(OR(ModelNo=\"0100\",ModelNo=\"01HP\",ModelNo=\"0102\",ModelNo=\"0103\",ModelNo=\"0104\",ModelNo=\"0109\",ModelNo=\"0151\",ModelNo=\"0152\",ModelNo=\"0153\",ModelNo=\"0154\",ModelNo=\"0155\",ModelNo=\"0170\",ModelNo=\"0171\",ModelNo=\"0172\",ModelNo=\"0173\",ModelNo=\"S174\",ModelNo=\"S175\",ModelNo=\"0179\",ModelNo=\"0301\"),1,0)","v":0},"Screen"]
[null,null,null,null,null,null,null,null,null,null,null,null,null,1,{"$f":"IF(SCREEN1>\"\",SCREEN1,\"\")","v":""}]
[null,null,null,null,null,null,null,null,null,null,null,null,null,2,{"$f":"IF(SCREEN2>\"\",SCREEN2,\"\")","v":""}]
[null,null,null,null,null,null,null,null,null,null,null,null,null,3,{"$f":"IF(SCREEN3>\"\",SCREEN3,\"\")","v":""}]
[null,null,null,null,null,null,null,null,null,null,null,null,null,1,{"$f":"IF(Screen_Type=3,\"L\",IF(Screen_Type=2,\"F\",\"H\"))","v":"H"}]
[]
[null,null,null,null,null,null,null,null,null,null,null,null,null,null,"Add Grid for Weight Calc"]
[null,null,null,null,null,null,null,null,null,null,null,null,null,{"$f":"IF(GRIDWEIGHT=TRUE,0.25,0)","v":0},false]

{"sheet":"Data","index":3,"n_rows":467,"n_cols":81,"rows_kept":467,"cut":false,"hidden":true,"merged":[]}
[null,"Model","Description","Value"]
[{"$f":"IF(ModelNo=B2,1,\"\")","v":""},"3M40A","Sash Width",{"$f":"BSW_3M40A","v":-2.6875},null,{"$f":"Model_Select","v":"Select Model"},"Models","Description","W cut-back","H-cut-back","Width","Height","Min W","Min H","Max W","Max H","Max UI","Type1","Type2","Type3","CMR_MSG","Screen1","Screen2","Screen3","Ext./Reinf.","Ext./Reinf.","Ext./Reinf.","Ext./Reinf.","Ext./Reinf.","Ext./Reinf.","Ext./Reinf.","Ext./Reinf.","Glass1","Glass2","Glass3","Glass4","Glass5","Glass6","Glass7","Glass8","Opening","CDIM","DDIM","TSW","TSH","TGW","TGH","TGSF","BSW","BSH","BGW","BGH","BGSF","Bott. Sash Weight","Top Sash Weight","Bot. of Coil From CMR","Head + 4","Sill","EW","EH",null,null,null,null,null,null,null,null,"Triple IG calculation",null,null,null,null,null,null,null,"S140 Limitations"]
[{"$f":"IF(ModelNo=B3,2,\"\")","v":""},"3M40A","Sash Height",{"$f":"BSH_3M40A","v":-0.5625},null,1,"Select Model"]
[{"$f":"IF(ModelNo=B4,3,\"\")","v":""},"3M40A","Top Glass Width",{"$f":"TGW_3M40A","v":-3.0625},null,2,"3M40A","3000 Series Single Hung",0,0,null,null,15.5,25.5,43,75,118,"Standard","Custom",null,{"$f":"IF(AND(W>0,H>0,BTYPE=\"Custom\",CMR=0),\"<< Enter CMR Location\",IF(AND(W>0,H>0,BTYPE=\"Custom\"),\"<< CMR, Bottom-Up\",\"\"))","v":""},"Half Only",null,null,null,null,null,null,null,null,null,null,"Double Strength (3 mm)","M. Strength (4 mm)","Triple Strength (5 mm)","Triple IG Double Strength","Laminated",null,null,null,{"$f":"IF(RO=2,\"<< Exact Size Only\",\"\")","v":""},{"$f":"Frame_Height-DDIM_3M40A","v":0},{"$f":"IF(TYPE=1,(Frame_Height/2),IF(TYPE=2,CMR))","v":0},null,null,{"$f":"Frame_Width-3.0625","v":-3.0625},{"$f":"CDIM_3M40A-2.4375","v":-2.4375},{"$f":"(AT4*AU4)/144","v":5.1839192708333336E-2},{"$f":"Frame_Width-2.6875","v":-2.6875},{"$f":"DDIM_3M40A-0.5625","v":-0.5625},{"$f":"Frame_Width-4.5625","v":-4.5625},{"$f":"DDIM_3M40A-2.4375","v":-2.4375},{"$f":"(AY4*AZ4)/144","v":7.7229817708333329E-2},{"$f":"BWGT_3M40A","v":{"$error":"#VALUE!"}},null,{"$f":"IF(COIL=1,3.5625-0.16875,3.5625+((COIL-1)*1.625)-0.16875)","v":{"$error":"#N/A"}},{"$f":"1.375+4","v":5.375},1.96875,{"$f":"Frame_Width-4","v":-4},{"$f":"IF(AND(AX4>36.0625,(Frame_Height/2)<=CMR),CDIM_3M40A-BF4-BD4-0.125,IF(OR(AND(AX4>36.0625,(Frame_Height/2)<=CMR),(Frame_Height/2)>=CMR),Frame_Height-AX4-BE4-BF4,CDIM_3M40A-BF4-BD4-0.125))","v":-6.78125},null,null,null,1,"Single Strength (2.5 mm)",null,null,null,"SS (2.2)","DS (3.2)","4 mm","TS (5.0)",null,null,null,null,"Min. W","Min. H","Max. W","Max. H","Max. UI"]
[{"$f":"IF(ModelNo=B5,4,\"\")","v":""},"3M40A","Top Glass Height",{"$f":"TGH_3M40A","v":-2.4375},null,3,"8M40A","3000 Series Double Hung",0,0,null,null,16.5,27.5,44,77,121,"Standard","Custom",null,{"$f":"IF(AND(W>0,H>0,BTYPE=\"Custom\",CMR=0),\"<< Enter CMR Location\",IF(AND(W>0,H>0,BTYPE=\"Custom\"),\"<< CMR, Bottom-Up\",\"\"))","v":""},"Full Only",null,null,null,null,null,null,null,null,null,null,"Double Strength (3 mm)","M. Strength (4 mm)","Triple Strength (5 mm)","Triple IG Double Strength","Laminated",null,null,null,"",{"$f":"Frame_Height-DDIM_8M40A","v":0},{"$f":"IF(TYPE=1,(Frame_Height/2),IF(TYPE=2,CMR))","v":0},{"$f":"Frame_Width-3.8125","v":-3.8125},{"$f":"CDIM_8M40A-1.9375","v":-1.9375},{"$f":"Frame_Width-5.6875","v":-5.6875},{"$f":"CDIM_8M40A-3.8125","v":-3.8125},{"$f":"(TGW_8M40A*TGH_8M40A)/144","v":0.15058051215277779},{"$f":"Frame_Width-2.6875","v":-2.6875},{"$f":"DDIM_8M40A-0.8125","v":-0.8125},{"$f":"Frame_Width-4.5625","v":-4.5625},{"$f":"DDIM_8M40A-2.6875","v":-2.6875},{"$f":"(BGW_8M40A*BGH_8M40A)/144","v":8.5150824652777776E-2},{"$f":"BWGT_8M40A","v":{"$error":"#VALUE!"}},{"$f":"TWGT_8M40A","v":{"$error":"#VALUE!"}},{"$f":"IF(COIL=1,3.5625-0.16875,3.5625+((COIL-1)*1.625)-0.16875)","v":{"$error":"#N/A"}},{"$f":"1.375+4","v":5.375},1.96875,{"$f":"Frame_Width-4","v":-4},{"$f":"IF(AND(AX5>36.0625,(Frame_Height/2)<=CMR),CDIM_3M40A-BF5-BD5-0.125,IF(OR(AND(AX5>36.0625,(Frame_Height/2)<=CMR),(Frame_Height/2)>=CMR),Frame_Height-AX5-BE5-BF5,CDIM_3M40A-BF5-BD5-0.125))","v":-6.53125},null,null,null,2,"Double Strength (3 mm)",null,null,"Max. Short",{"$f":"IF(TG2W>41,0,41)","v":41},{"$f":"IF(TG2W>56,0,56)","v":56},{"$f":"IF(TG2W>67,0,67)","v":67},{"$f":"IF(TG2W>70,0,70)","v":70},"Annealed",null,null,"Mezzo",25,40]
[{"$f":"IF(ModelNo=B6,5,\"\")","v":""},"3M40A","Bottom Glass Width",{"$f":"BGW_3M40A","v":-4.5625},null,4,"3M10A","3000 Series Single Slider Lift-Out",0,0,null,null,25.5,15.5,71,55,126,"Standard","Custom",null,{"$f":"IF(AND(W>0,H>0,BTYPE=\"Custom\",CMR=0),\"<< Enter CMR Location\",IF(AND(W>0,H>0,BTYPE=\"Custom\"),\"<< CMR, Left to Right\",\"\"))","v":""},"Half Only",null,null,null,null,null,null,null,null,null,null,"Double Strength (3 mm)","M. Strength (4 mm)","Triple Strength (5 mm)","Triple IG Double Strength","Laminated",null,null,null,"",{"$f":"Frame_Width-DDIM_3M10A","v":0},{"$f":"IF(TYPE=1,(Frame_Width/2),IF(TYPE=2,CMR))","v":0},null,null,null,null,null,null,null,null,null,null,null,null,null,null,null,null,null,null,null,null,3,"Triple Strength (5 mm)",null,null,"Max. Long",{"$f":"IF(TG2H>62,0,62)","v":62},{"$f":"IF(TG2H>76,0,76)","v":76},{"$f":"IF(TG2H>90,0,90)","v":90},{"$f":"IF(TG2H>102,0,102)","v":102},"Annealed",null,null,"Mezzo/N.F",26,41]
[{"$f":"IF(ModelNo=B7,6,\"\")","v":""},"3M40A","Bottom Glass Height",{"$f":"BGH_3M40A","v":-2.4375},null,5,"3M10R","3000 Series Single Slider Lift-Out Reverse",0,0,null,null,25.5,15.5,71,55,126,"Standard","Custom",null,{"$f":"IF(AND(W>0,H>0,BTYPE=\"Custom\",CMR=0),\"<< Enter CMR Location\",IF(AND(W>0,H>0,BTYPE=\"Custom\"),\"<< CMR, Left to Right\",\"\"))","v":""},"Half Only",null,null,null,null,null,null,null,null,null,null,"Double Strength (3 mm)","M. Strength (4 mm)","Triple Strength (5 mm)","Triple IG Double Strength","Laminated",null,null,null,"",{"$f":"IF(TYPE=1,(Frame_Width/2),IF(TYPE=2,CMR))","v":0},{"$f":"Frame_Width-CDIM_3M10R","v":0},null,null,null,null,null,null,null,null,null,null,null,null,null,null,null,null,null,null,null,null,4,"Triple IG Single Strrength",null,null,"Max Sq.Ft.",{"$f":"IF(TG2A>12,0,12)","v":12},{"$f":"IF(TG2A>22,0,22)","v":22},{"$f":"IF(TG2A>32,0,32)","v":32},{"$f":"IF(TG2A>35,0,35)","v":35},"Annealed",null,null,"New Construction",20,36]
[{"$f":"IF(ModelNo=B8,7,\"\")","v":""},"3M40A","Screen Width",{"$f":"Frame_Width-3.5","v":-3.5},null,6,"3M10C13","3000 Series End Vent (1/3-1/3-1/3)",0,0,null,null,36,15.5,87,58,145,"Standard (1/3-1/3-1/3)",null,null,{"$f":"IF(AND(W>0,H>0,BTYPE=\"Custom\",CMR=0),\"<< Enter CMR Location\",IF(AND(W>0,H>0,BTYPE=\"Custom\"),\"<< CMR, Ends to M.R\",\"\"))","v":""},"Half Only",null,null,null,null,null,null,null,null,null,null,"Double Strength (3 mm)","M. Strength (4 mm)","Triple Strength (5 mm)","Triple IG Double Strength","Laminated",null,null,null,"",{"$f":"Frame_Width-(DDIM_3M10C13*2)","v":0},{"$f":"Frame_Width/3","v":0},null,null,null,null,null,null,null,null,null,null,null,null,null,null,null,null,null,null,null,null,5,"Triple IG Double Strength",null,null,"Max. Short",0,{"$f":"IF(TG2W>42,0,42)","v":42},{"$f":"IF(TG2W>70,0,70)","v":70},{"$f":"IF(TG2W>70,0,70)","v":70},"Tempered",null,null,"0700 Series",20,36]
[{"$f":"IF(ModelNo=B9,8,\"\")","v":""},"3M40A","Screen Height",{"$f":"DDIM_3M40A-1.9375","v":-1.9375},null,7,"3M10C14","3000 Series End Vent (1/4-1/2-1/4)",null,null,null,null,45,15.5,113,58,171,"Standard (1/4-1/2-1/4)",null,null,{"$f":"IF(AND(W>0,H>0,BTYPE=\"Custom\",CMR=0),\"<< Enter CMR Location\",IF(AND(W>0,H>0,BTYPE=\"Custom\"),\"<< CMR, Ends to M.R\",\"\"))","v":""},"Half Only",null,null,null,null,null,null,null,null,null,null,"Double Strength (3 mm)","M. Strength (4 mm)","Triple Strength (5 mm)","Triple IG Double Strength","Laminated",null,null,null,"",{"$f":"Frame_Width-(DDIM_3M10C14*2)","v":0},{"$f":"Frame_Width/4","v":0},null,null,null,null,null,null,null,null,null,null,null,null,null,null,null,null,null,null,null,null,6,"Laminated",null,null,"Max. Long",0,{"$f":"IF(TG2H>84,0,84)","v":84},{"$f":"IF(TG2H>129,0,129)","v":129},{"$f":"IF(TG2H>129,0,129)","v":129},"Tempered",null,null,"Fusion",23.5,38]
[{"$f":"IF(ModelNo=B10,9,\"\")","v":""},"3M40A","Bottom Sash Weight",{"$f":"IF(ISERROR(BTM_WGT&\" \"&\"lb\"),\"N/A\",BTM_WGT&\" \"&\"lb\")","v":"0 lb"},null,8,"8M10A","3000 Series Double Slider",null,null,null,null,27.5,16.5,71,56,127,"Standard","Custom",null,{"$f":"IF(AND(W>0,H>0,BTYPE=\"Custom\",CMR=0),\"<< Enter CMR Location\",IF(AND(W>0,H>0,BTYPE=\"Custom\"),\"<< CMR, Left to Right\",\"\"))","v":""},"Full Only",null,null,null,null,null,null,null,null,null,null,"Double Strength (3 mm)","M. Strength (4 mm)","Triple Strength (5 mm)","Triple IG Double Strength","Laminated",null,null,null,"",{"$f":"Frame_Width-DDIM_3M10A","v":0},{"$f":"IF(TYPE=1,(Frame_Width/2),IF(TYPE=2,CMR))","v":0},null,null,null,null,null,null,null,null,null,null,null,null,null,null,null,null,null,null,null,null,7,"HP Package",null,null,"Max Sq.Ft.",0,{"$f":"IF(TG2A>24.5,0,24.5)","v":24.5},{"$f":"IF(TG2A>42,0,42)","v":42},{"$f":"IF(TG2A>42,0,42)","v":42},"Tempered",null,null,1700,24]
[{"$f":"IF(ModelNo=B11,10,\"\")","v":""},"3M40A","Bottom Balance Size (C.F)",{"$f":"IF(ISERROR((VLOOKUP(BTM_WGT,CFB,2,FALSE))),\"N/A\",(VLOOKUP(BTM_WGT,CFB,2,FALSE)))","v":"N/A"},null,9,"8M21A","3000 Series Double Slider Tilt",null,null,null,null,24,13,78,60,132,"Standard","Custom",null,{"$f":"IF(AND(W>0,H>0,BTYPE=\"Custom\",CMR=0),\"<< Enter CMR Location\",IF(AND(W>0,H>0,BTYPE=\"Custom\"),\"<< CMR, Left to Right\",\"\"))","v":""},"Full Only",null,null,null,null,null,null,null,null,null,null,"Double Strength (3 mm)","M. Strength (4 mm)","Triple Strength (5 mm)","Triple IG Double Strength","Laminated",null,null,null,"",{"$f":"Frame_Width-DDIM_3M10A","v":0},{"$f":"IF(TYPE=1,(Frame_Width/2),IF(TYPE=2,CMR))","v":0},null,null,null,null,null,null,null,null,null,null,null,null,null,null,null,null,null,null,null,null,8,"Impact Laminated",null,null,null,{"$f":"IF(AND(BQ5>0,BQ6>0,BQ7>0),1,0)","v":1},{"$f":"IF(AND(BR5>0,BR6>0,BR7>0),1,0)","v":1},{"$f":"IF(AND(BS5>0,BS6>0,BS7>0),1,0)","v":1},{"$f":"IF(AND(BT5>0,BT6>0,BT7>0),1,0)","v":1},{"$f":"IF(BQ11>0,\"≥SS Annealed\",IF(BR11>0,\"≥DS Annealed\",IF(BT11>0,\"TS Annealed\",\"\")))","v":"≥SS Annealed"},null,null,1900,24]
[{"$f":"IF(ModelNo=B12,11,\"\")","v":""},"3M40A","Egress Opening Width",{"$f":"IF(ISERROR(EW),\"N/A\",EW)","v":0},null,10,"8M00A","3000 Series Small Picture Window",null,null,null,null,12,12,108,108,162,null,null,null,null,null,null,null,null,null,null,null,null,null,null,null,"Double Strength (3 mm)","M. Strength (4 mm)","Triple Strength (5 mm)","Triple IG Double Strength","Laminated",null,null,null,"",null,null,null,null,null,null,null,null,null,null,null,null,null,null,null,null,null,null,null,null,null,null,null,null,null,null,null,null,{"$f":"IF(AND(BR8>0,BR9>0,BR10>0),1,0)","v":1},{"$f":"IF(AND(BS8>0,BS9>0,BS10>0),1,0)","v":1},{"$f":"IF(AND(BT8>0,BT9>0,BT10>0),1,0)","v":1},{"$f":"IF(BR12>0,\"≥DS Tempered\",IF(BT12>0,\"TS Tempered\",\"\"))","v":"≥DS Tempered"}]
[{"$f":"IF(ModelNo=B13,12,\"\")","v":""},"3M40A","Egress Opening Height",{"$f":"IF(ISERROR(EH),\"N/A\",EH)","v":0},null,11,"8M71F","3000 Series Large Picture Window",null,null,null,null,12,12,108,108,162,null,null,null,null,null,null,null,null,null,null,null,null,null,null,null,"Double Strength (3 mm)","M. Strength (4 mm)","Triple Strength (5 mm)","Triple IG Double Strength","Laminated",null,null,null,"",null,null,null,null,null,null,null,null,null,null,null,null,null,null,null,null,null,null,null,null,null,null,null,null,null,null,null,"2.5 mm","3.2 mm","4 mm","5 mm"]
[{"$f":"IF(ModelNo=B14,13,\"\")","v":""},"3M40A","Egress Opening Area (sq.ft.)",{"$f":"(D12*D13)/144","v":0},null,12,"8M71L","3000 Sereis Left Operating Casement",null,null,null,null,16,16,36.75,72,108.75,null,null,null,null,"Full Only",null,null,null,null,null,null,null,null,null,null,"Double Strength (3 mm)","M. Strength (4 mm)","Triple Strength (5 mm)","Triple IG Double Strength","Laminated",null,null,null,"",null,null,null,null,null,null,null,null,null,null,null,null,null,null,null,null,null,null,null,null,null,null,null,null,null,null,"Max. Short",{"$f":"IF(TG2H>41,0,41)","v":41},{"$f":"IF(TG2H>56,0,56)","v":56},{"$f":"IF(TG2H>67,0,67)","v":67},{"$f":"IF(TG2H>70,0,70)","v":70},"Annealed"]
[{"$f":"IF(ModelNo=B15,1,\"\")","v":""},"3P40A","Sash Width",{"$f":"BSW_3P40A","v":-3.75},null,13,"8M71R","3000 Sereis Right Operating Casement",null,null,null,null,16,16,36.75,72,108.75,null,null,null,null,"Full Only",null,null,null,null,null,null,null,null,null,null,"Double Strength (3 mm)","M. Strength (4 mm)","Triple Strength (5 mm)","Triple IG Double Strength","Laminated",null,null,null,"",null,null,null,null,null,null,null,null,null,null,null,null,null,null,null,null,null,null,null,null,null,null,null,null,null,null,"Max. Long",{"$f":"IF(TG2W>62,0,62)","v":62},{"$f":"IF(TG2W>76,0,76)","v":76},{"$f":"IF(TG2W>90,0,90)","v":90},{"$f":"IF(TG2W>102,0,102)","v":102},"Annealed"]
[{"$f":"IF(ModelNo=B16,2,\"\")","v":""},"3P40A","Sash Height",{"$f":"BSH_3P40A","v":-1.125},null,14,"8M81A","3000 Series Operating Awning",null,null,null,null,16,16,54,32,86,null,null,null,null,"Full Only",null,null,null,null,null,null,null,null,null,null,"Double Strength (3 mm)","M. Strength (4 mm)","Triple Strength (5 mm)","Triple IG Double Strength","Laminated",null,null,null,"",null,null,null,null,null,null,null,null,null,null,null,null,null,null,null,null,null,null,null,null,null,null,null,null,null,null,"Max Sq.Ft.",{"$f":"IF(TG2A>12,0,12)","v":12},{"$f":"IF(TG2A>22,0,22)","v":22},{"$f":"IF(TG2A>32,0,32)","v":32},{"$f":"IF(TG2A>35,0,35)","v":35},"Annealed"]
[{"$f":"IF(ModelNo=B17,3,\"\")","v":""},"3P40A","Top Glass Width",{"$f":"TGW_3P40A","v":-4.125},null,15,"3M55A","3000 Series Hopper",null,null,null,null,12,12,37,37,55,null,null,null,null,"Full Only",null,null,null,null,null,null,null,null,null,null,"Double Strength (3 mm)","M. Strength (4 mm)","Triple Strength (5 mm)","Triple IG Double Strength","Laminated",null,null,null,"",null,null,null,null,null,null,null,null,null,null,null,null,null,null,null,null,null,null,null,null,null,null,null,null,null,null,"Max. Short",0,{"$f":"IF(TG2H>42,0,42)","v":42},{"$f":"IF(TG2H>70,0,70)","v":70},{"$f":"IF(TG2H>70,0,70)","v":70},"Tempered"]
[{"$f":"IF(ModelNo=B18,4,\"\")","v":""},"3P40A","Top Glass Height",{"$f":"TGH_3P40A","v":-3},null,16,"3M56A","3000 Series Basement",null,null,null,null,14,14,54,36,72,null,null,null,null,"Full Only",null,null,null,null,null,null,null,null,null,null,"Double Strength (3 mm)","M. Strength (4 mm)","Triple Strength (5 mm)","Triple IG Double Strength","Laminated",null,null,null,"",null,null,null,null,null,null,null,null,null,null,null,null,null,null,null,null,null,null,null,null,null,null,null,null,null,null,"Max. Long",0,{"$f":"IF(TG2W>84,0,84)","v":84},{"$f":"IF(TG2W>129,0,129)","v":129},{"$f":"IF(TG2W>129,0,129)","v":129},"Tempered"]
[{"$f":"IF(ModelNo=B19,5,\"\")","v":""},"3P40A","Bottom Glass Width",{"$f":"BGW_3P40A","v":-5.625},null,17,"3P40A","4000 Series Single Hung",null,null,null,null,15.5,25.5,43,75,118,"Standard","Custom",null,{"$f":"IF(AND(W>0,H>0,BTYPE=\"Custom\",CMR=0),\"<< Enter CMR Location\",IF(AND(W>0,H>0,BTYPE=\"Custom\"),\"<< CMR, Bottom-Up\",\"\"))","v":""},"Half Only",null,null,null,null,null,null,null,null,null,null,"Double Strength (3 mm)","M. Strength (4 mm)","Triple Strength (5 mm)","Triple IG Double Strength","Laminated",null,null,null,"",{"$f":"Frame_Height-DDIM_3P40A","v":0},{"$f":"IF(TYPE=1,(Frame_Height/2),IF(TYPE=2,CMR))","v":0},null,null,{"$f":"Frame_Width-4.125","v":-4.125},{"$f":"CDIM_3P40A-3","v":-3},{"$f":"(AT19*AU19)/144","v":8.59375E-2},{"$f":"Frame_Width-3.75","v":-3.75},{"$f":"DDIM_3P40A-1.125","v":-1.125},{"$f":"Frame_Width-5.625","v":-5.625},{"$f":"DDIM_3P40A-3","v":-3},{"$f":"(AY19*AZ19)/144","v":0.1171875},{"$f":"BWGT_3P40A","v":{"$error":"#VALUE!"}},null,{"$f":"IF(COIL=1,3.5625-0.16875,3.5625+((COIL-1)*1.625)-0.16875)","v":{"$error":"#N/A"}},{"$f":"1.9375+4","v":5.9375},2.5,{"$f":"Frame_Width-5.125","v":-5.125},{"$f":"IF(AND(AX19>36.0625,(Frame_Height/2)<=CMR),CDIM_3P40A-BF19-BD19-0.125,IF(OR(AND(AX19>36.0625,(Frame_Height/2)<=CMR),(Frame_Height/2)>=CMR),Frame_Height-AX19-BE19-BF19,CDIM_3P40A-BF19-BD19-0.125))","v":-7.3125},null,null,null,null,null,null,null,"Max Sq.Ft.",0,{"$f":"IF(TG2A>24.5,0,24.5)","v":24.5},{"$f":"IF(TG2A>42,0,42)","v":42},{"$f":"IF(TG2A>42,0,42)","v":42},"Tempered"]
[{"$f":"IF(ModelNo=B20,6,\"\")","v":""},"3P40A","Bottom Glass Height",{"$f":"BGH_3P40A","v":-3},null,18,"8P40A","4000 Series Double Hung",null,null,null,null,16.5,27.5,44,77,121,"Standard","Custom",null,{"$f":"IF(AND(W>0,H>0,BTYPE=\"Custom\",CMR=0),\"<< Enter CMR Location\",IF(AND(W>0,H>0,BTYPE=\"Custom\"),\"<< CMR, Bottom-Up\",\"\"))","v":""},"Full Only",null,null,null,null,null,null,null,null,null,null,"Double Strength (3 mm)","M. Strength (4 mm)","Triple Strength (5 mm)","Triple IG Double Strength","Laminated",null,null,null,"",{"$f":"Frame_Height-DDIM_8P40A","v":0},{"$f":"IF(TYPE=1,(Frame_Height/2),IF(TYPE=2,CMR))","v":0},{"$f":"Frame_Width-4.875","v":-4.875},{"$f":"CDIM_8P40A-2.375","v":-2.375},{"$f":"Frame_Width-6.75","v":-6.75},{"$f":"CDIM_8P40A-4.25","v":-4.25},{"$f":"(TGW_8M40A*TGH_8M40A)/144","v":0.15058051215277779},{"$f":"Frame_Width-3.75","v":-3.75},{"$f":"DDIM_8P40A-1.25","v":-1.25},{"$f":"Frame_Width-5.625","v":-5.625},{"$f":"DDIM_8P40A-3.125","v":-3.125},{"$f":"(BGW_8M40A*BGH_8M40A)/144","v":8.5150824652777776E-2},{"$f":"BWGT_8P40A","v":{"$error":"#VALUE!"}},{"$f":"TWGT_8P40A","v":{"$error":"#VALUE!"}},{"$f":"IF(COIL=1,3.5625-0.16875,3.5625+((COIL-1)*1.625)-0.16875)","v":{"$error":"#N/A"}},{"$f":"1.9375+4","v":5.9375},2.5,{"$f":"Frame_Width-6.125","v":-6.125},{"$f":"IF(AND(AX20>36.0625,(Frame_Height/2)<=CMR),CDIM_3M40A-BF20-BD20-0.125,IF(OR(AND(AX20>36.0625,(Frame_Height/2)<=CMR),(Frame_Height/2)>=CMR),Frame_Height-AX20-BE20-BF20,CDIM_3M40A-BF20-BD20-0.125))","v":-7.1875},null,null,null,null,null,null,null,null,{"$f":"IF(AND(BQ14>0,BQ15>0,BQ16>0),1,0)","v":1},{"$f":"IF(AND(BR14>0,BR15>0,BR16>0),1,0)","v":1},{"$f":"IF(AND(BS14>0,BS15>0,BS16>0),1,0)","v":1},{"$f":"IF(AND(BT14>0,BT15>0,BT16>0),1,0)","v":1},{"$f":"IF(BQ20>0,\"≥SS Annealed\",IF(BR20>0,\"≥DS Annealed\",IF(BT20>0,\"TS Annealed\",\"\")))","v":"≥SS Annealed"}]
[{"$f":"IF(ModelNo=B21,7,\"\")","v":""},"3P40A","Screen Width",{"$f":"Frame_Width-4.5625","v":-4.5625},null,19,"3P10A","4000 Series Single Slider Lift-Out",null,null,null,null,25.5,15.5,71,55,126,"Standard","Custom",null,{"$f":"IF(AND(W>0,H>0,BTYPE=\"Custom\",CMR=0),\"<< Enter CMR Location\",IF(AND(W>0,H>0,BTYPE=\"Custom\"),\"<< CMR, Left to Right\",\"\"))","v":""},"Half Only",null,null,null,null,null,null,null,null,null,null,"Double Strength (3 mm)","M. Strength (4 mm)","Triple Strength (5 mm)","Triple IG Double Strength","Laminated",null,null,null,"",{"$f":"Frame_Width-DDIM_3P10A","v":0},{"$f":"IF(TYPE=1,(Frame_Width/2),IF(TYPE=2,CMR))","v":0},null,null,null,null,null,null,null,null,null,null,null,null,null,null,null,null,null,null,null,null,null,null,null,null,null,null,{"$f":"IF(AND(BR17>0,BR18>0,BR19>0),1,0)","v":1},{"$f":"IF(AND(BS17>0,BS18>0,BS19>0),1,0)","v":1},{"$f":"IF(AND(BT17>0,BT18>0,BT19>0),1,0)","v":1},{"$f":"IF(BR21>0,\"≥DS Tempered\",IF(BT21>0,\"TS Tempered\",\"\"))","v":"≥DS Tempered"}]
[{"$f":"IF(ModelNo=B22,8,\"\")","v":""},"3P40A","Screen Height",{"$f":"DDIM_3P40A-2.5","v":-2.5},null,20,"3P10R","4000 Series Single Slider Lift-Out Reverse",null,null,null,null,25.5,15.5,71,55,126,"Standard","Custom",null,{"$f":"IF(AND(W>0,H>0,BTYPE=\"Custom\",CMR=0),\"<< Enter CMR Location\",IF(AND(W>0,H>0,BTYPE=\"Custom\"),\"<< CMR, Left to Right\",\"\"))","v":""},"Half Only",null,null,null,null,null,null,null,null,null,null,"Double Strength (3 mm)","M. Strength (4 mm)","Triple Strength (5 mm)","Triple IG Double Strength","Laminated",null,null,null,"",{"$f":"IF(TYPE=1,(Frame_Width/2),IF(TYPE=2,CMR))","v":0},{"$f":"Frame_Width-CDIM_3P10R","v":0},null,null,null,null,null,null,null,null,null,null,null,null,null,null,null,null,null,null,null,null,null,null,null,null,{"$f":"IF(AND(OR(BU11=\"≥SS Annealed\",BU11=\"≥DS Annealed\",BU12=\"≥DS Tempered\",BU20=\"≥SS Annealed\",BU20=\"≥DS Annealed\",BU21=\"≥DS Tempered\")),\"TIG\",\"\")","v":"TIG"},{"$f":"IF(AND(ANNEALED1=0,ANNEALED2=0,OR(TEMPERED1>0,TEMPERED2>0)),\"Tempered is Required for TIG\",\"\")","v":""}]
[{"$f":"IF(ModelNo=B23,9,\"\")","v":""},"3P40A","Bottom Sash Weight",{"$f":"IF(ISERROR(BTM_WGT&\" \"&\"lb\"),\"N/A\",BTM_WGT&\" \"&\"lb\")","v":"0 lb"},null,21,"8P10A","4000 Series Double Slider Lift-Out",null,null,null,null,27.5,16.5,71,56,127,"Standard","Custom",null,{"$f":"IF(AND(W>0,H>0,BTYPE=\"Custom\",CMR=0),\"<< Enter CMR Location\",IF(AND(W>0,H>0,BTYPE=\"Custom\"),\"<< CMR, Left to Right\",\"\"))","v":""},"Full Only",null,null,null,null,null,null,null,null,null,null,"Double Strength (3 mm)","M. Strength (4 mm)","Triple Strength (5 mm)","Triple IG Double Strength","Laminated",null,null,null,"",{"$f":"Frame_Width-DDIM_8P10A","v":0},{"$f":"IF(TYPE=1,(Frame_Width/2),IF(TYPE=2,CMR))","v":0},null,null,null,null,null,null,null,null,null,null,null,null,null,null,null,null,null,null,null,null,null,null,null,null,"Model","Width","Height","Area","Balance"]
[{"$f":"IF(ModelNo=B24,10,\"\")","v":""},"3P40A","Bottom Balance Size (C.F)",{"$f":"IF(ISERROR((VLOOKUP(BTM_WGT,CFB,2,FALSE))),\"N/A\",(VLOOKUP(BTM_WGT,CFB,2,FALSE)))","v":"N/A"},null,22,"3P10C13","4000 Series End Vent (1/3-1/3-1/3)",null,null,null,null,36,15.5,87,58,145,"Standard (1/3-1/3-1/3)",null,null,{"$f":"IF(AND(W>0,H>0,BTYPE=\"Custom\",CMR=0),\"<< Enter CMR Location\",IF(AND(W>0,H>0,BTYPE=\"Custom\"),\"<< CMR, Ends to M.R\",\"\"))","v":""},"Half Only",null,null,null,null,null,null,null,null,null,null,"Double Strength (3 mm)","M. Strength (4 mm)","Triple Strength (5 mm)","Triple IG Double Strength","Laminated",null,null,null,"",{"$f":"Frame_Width-(DDIM_3P10C13*2)","v":0},{"$f":"Frame_Width/3","v":0},null,null,null,null,null,null,null,null,null,null,null,null,null,null,null,null,null,null,null,null,null,null,null,{"$f":"IF(ModelNo=BP24,ModelNo,0)","v":0},"3001",{"$f":"MAX(#REF!,$D$90)","v":{"$error":"#REF!"}},{"$f":"MAX(#REF!,$D$91)","v":{"$error":"#REF!"}},{"$f":"(BQ24*BR24)/144","v":{"$error":"#REF!"}},{"$f":"IF(AND(OR(Glass=4,Glass=5),OR((ISERROR((VLOOKUP(TOP_WGT,CFB,2,FALSE)))),(ISERROR((VLOOKUP(BTM_WGT,CFB,2,FALSE)))))),1,IF(AND(Glass=3,Single_ST=0),1,0))","v":0}]
[{"$f":"IF(ModelNo=B25,11,\"\")","v":""},"3P40A","Egress Opening Width",{"$f":"IF(ISERROR(EW),\"N/A\",EW)","v":0},null,23,"3P10C14","4000 Series End Vent (1/4-1/2-1/4)",null,null,null,null,45,15.5,113,58,171,"Standard (1/4-1/2-1/4)",null,null,{"$f":"IF(AND(W>0,H>0,BTYPE=\"Custom\",CMR=0),\"<< Enter CMR Location\",IF(AND(W>0,H>0,BTYPE=\"Custom\"),\"<< CMR, Ends to M.R\",\"\"))","v":""},"Half Only",null,null,null,null,null,null,null,null,null,null,"Double Strength (3 mm)","M. Strength (4 mm)","Triple Strength (5 mm)","Triple IG Double Strength","Laminated",null,null,null,"",{"$f":"Frame_Width-(DDIM_3P10C14*2)","v":0},{"$f":"Frame_Width/4","v":0},null,null,null,null,null,null,null,null,null,null,null,null,null,null,null,null,null,null,null,null,null,null,null,0,"3002",{"$f":"#REF!","v":{"$error":"#REF!"}},{"$f":"#REF!","v":{"$error":"#REF!"}},{"$f":"(BQ25*BR25)/144","v":{"$error":"#REF!"}}]
[{"$f":"IF(ModelNo=B26,12,\"\")","v":""},"3P40A","Egress Opening Height",{"$f":"IF(ISERROR(EH),\"N/A\",EH)","v":0},null,24,"8P00A","4000 Sereis Small Picture Window",null,null,null,null,12,12,108,108,162,null,null,null,null,null,null,null,null,null,null,null,null,null,null,null,"Double Strength (3 mm)","M. Strength (4 mm)","Triple Strength (5 mm)","Triple IG Double Strength","Laminated",null,null,null,"",null,null,null,null,null,null,null,null,null,null,null,null,null,null,null,null,null,null,null,null,null,null,null,null,null,0,"3003",{"$f":"MAX($D$119,$D$121)","v":-1.125},{"$f":"MAX($D$120,$D$122)","v":-3.875},3.02734375E-2]
[{"$f":"IF(ModelNo=B27,13,\"\")","v":""},"3P40A","Egress Opening Area (sq.ft.)",{"$f":"(D25*D26)/144","v":0},null,25,"8P71F","4000 Series Large Picture Window",null,null,null,null,12,12,108,108,162,null,null,null,null,null,null,null,null,null,null,null,null,null,null,null,"Double Strength (3 mm)","M. Strength (4 mm)","Triple Strength (5 mm)","Triple IG Double Strength","Laminated",null,null,null,"",null,null,null,null,null,null,null,null,null,null,null,null,null,null,null,null,null,null,null,null,null,null,null,null,null,0,"3004",{"$f":"$D$236","v":-4.1875},{"$f":"$D$237","v":-4.1875},0.12177191840277778]
[{"$f":"IF(ModelNo=B28,1,\"\")","v":""},"8M40A","Top Sash Width",{"$f":"TSW_8M40A","v":-3.8125},null,26,"8P71L","4000 Series Left Operating Casement",null,null,null,null,16,16,36.75,72,109,null,null,null,null,"Full Only",null,null,null,null,null,null,null,null,null,null,"Double Strength (3 mm)","M. Strength (4 mm)","Triple Strength (5 mm)","Triple IG Double Strength","Laminated",null,null,null,"",null,null,null,null,null,null,null,null,null,null,null,null,null,null,null,null,null,null,null,null,null,null,null,null,null,0,"3009",{"$f":"MAX(#REF!,#REF!)","v":{"$error":"#REF!"}},{"$f":"MAX(#REF!,#REF!)","v":{"$error":"#REF!"}},{"$error":"#REF!"}]
[{"$f":"IF(ModelNo=B29,2,\"\")","v":""},"8M40A","Top Sash Height",{"$f":"TSH_8M40A","v":-1.9375},null,27,"8P71R","4000 Series Right Operating Casement",null,null,null,null,16,16,36.75,72,109,null,null,null,null,"Full Only",null,null,null,null,null,null,null,null,null,null,"Double Strength (3 mm)","M. Strength (4 mm)","Triple Strength (5 mm)","Triple IG Double Strength","Laminated",null,null,null,"",null,null,null,null,null,null,null,null,null,null,null,null,null,null,null,null,null,null,null,null,null,null,null,null,null,0,"03A0",{"$f":"MAX($D$241,$D$243)","v":-4.6875},{"$f":"MAX($D$242,$D$244)","v":-2.59375},8.4431966145833329E-2,{"$f":"IF(AND(OR(Glass=4,Glass=5),(ISERROR((VLOOKUP(BTM_WGT,CFB,2,FALSE))))),1,IF(AND(Glass=3,Single_ST=0),1,0))","v":0}]
[{"$f":"IF(ModelNo=B30,3,\"\")","v":""},"8M40A","Bottom Sash Width",{"$f":"BSW_8M40A","v":-2.6875},null,28,"8P81A","4000 Series Operating Awning",null,null,null,null,16,16,54,32,86,null,null,null,null,"Full Only",null,null,null,null,null,null,null,null,null,null,"Double Strength (3 mm)","M. Strength (4 mm)","Triple Strength (5 mm)","Triple IG Double Strength","Laminated",null,null,null,"",null,null,null,null,null,null,null,null,null,null,null,null,null,null,null,null,null,null,null,null,null,null,null,null,null,0,"03A2",{"$f":"MAX($D$256,$D$258)","v":-2.5625},{"$f":"MAX($D$257,$D$259)","v":-4.6875},8.3414713541666671E-2]
[{"$f":"IF(ModelNo=B31,4,\"\")","v":""},"8M40A","Bottom Sash Height",{"$f":"BSH_8M40A","v":-0.8125},null,29,"03A0","Mezzo Single Hung",0,0,null,null,12,22,{"$f":"IF(EXTSELECT=2,48,IF(EXTSELECT=3,52,\"\"))","v":""},{"$f":"IF(EXTSELECT=2,78,IF(EXTSELECT=3,96,\"\"))","v":""},{"$f":"IF(EXTSELECT=2,126,IF(EXTSELECT=3,148,\"\"))","v":""},"Standard","Custom",null,null,"Half","Full","Locking","Select Reinforcement","Composite","Steel",null,null,null,null,null,null,"Double Strength (3 mm)","Triple Strength (5 mm)","Triple IG Single Strength","Triple IG Double Strength","Laminated",null,null,"",{"$f":"Frame_Height-DDIM_03A0","v":0},{"$f":"IF(TYPE=1,(Frame_Height/2),IF(TYPE=2,CMR))","v":0},null,null,{"$f":"TRUNC((Frame_Width-4.75)*16+0.5)/16","v":-4.6875},{"$f":"TRUNC((DDIM_03A0-2.625)*32+0.5)/32","v":-2.59375},{"$f":"(AT31*AU31)/144","v":8.4431966145833329E-2},{"$f":"Frame_Width-3.125","v":-3.125},{"$f":"CDIM_03A0-1.125","v":-1.125},{"$f":"TRUNC((Frame_Width-4.8125)*16+0.5)/16","v":-4.75},{"$f":"TRUNC((CDIM_03A0-2.75)*32+0.5)/32","v":-2.71875},{"$f":"(AY31*AZ31)/144","v":8.9680989583333329E-2},{"$f":"BWGT_03A0","v":{"$error":"#VALUE!"}},null,{"$f":"IF(COIL=1,3.875-0.16875,3.875+((COIL-1)*1.625)-0.16875)","v":{"$error":"#N/A"}},6,1.875,{"$f":"Frame_Width-5.8125","v":-5.8125},{"$f":"IF(AND(AX31>36.0625,(Frame_Height/2)<=CMR),CDIM_03A0-BF31-BD31-0.125,IF(OR(AND(AX31>36.0625,(Frame_Height/2)<=CMR),(Frame_Height/2)>=CMR),Frame_Height-AX31-BE31-BF31,CDIM_03A0-BF31-BD31-0.125))","v":-6.75},null,null,null,null,null,null,0,"03A3",{"$f":"MAX($D$268,$D$270)","v":-1.5},{"$f":"MAX($D$269,$D$271)","v":-4.6875},4.8828125E-2]
[{"$f":"IF(ModelNo=B32,5,\"\")","v":""},"8M40A","Top Glass Width",{"$f":"TGW_8M40A","v":-5.6875},null,30,"03A2","Mezzo Two Lite Single Slider",0,0,null,null,18.5,12,{"$f":"IF(EXTSELECT=2,72,IF(EXTSELECT=3,96,\"\"))","v":""},{"$f":"IF(EXTSELECT=2,56,IF(EXTSELECT=3,72,\"\"))","v":""},{"$f":"IF(EXTSELECT=2,128,IF(EXTSELECT=3,156,\"\"))","v":""},"Standard",null,null,null,"Half","Full",null,"Select Reinforcement","Composite","Steel",null,null,null,null,null,null,"Double Strength (3 mm)","Triple Strength (5 mm)","Triple IG Single Strength","Triple IG Double Strength","Laminated",null,null,{"$f":"IF(RO=2,\"<< Exact Size Only\",\"\")","v":""},null,null,null,null,null,null,null,null,null,null,null,null,null,null,null,null,null,{"$f":"(Frame_Width/2)-4.75","v":-4.75},null,null,null,null,null,null,null,0,"03A4",{"$f":"$D$236","v":-4.1875},{"$f":"$D$237","v":-4.1875},0.12177191840277778]
[{"$f":"IF(ModelNo=B33,6,\"\")","v":""},"8M40A","Top Glass Height",{"$f":"TGH_8M40A","v":-3.8125},null,31,"03A3","Mezzo Three Lite Slider (1/4-1/2-1/4)",0,0,null,null,52,12,{"$f":"IF(EXTSELECT=2,108,IF(EXTSELECT=3,110,\"\"))","v":""},{"$f":"IF(EXTSELECT=2,56,IF(EXTSELECT=3,72,\"\"))","v":""},{"$f":"IF(EXTSELECT=2,164,IF(EXTSELECT=3,182,\"\"))","v":""},"Standard (1/4-1/2-1/4)",null,null,null,"Half","Full",null,"Select Reinforcement","Composite","Steel",null,null,null,null,null,null,"Double Strength (3 mm)","Triple Strength (5 mm)","Triple IG Single Strength","Triple IG Double Strength","Laminated",null,null,"",null,null,null,null,null,null,null,null,null,null,null,null,null,null,null,null,null,{"$f":"(Frame_Width/4)-2.875","v":-2.875},null,null,null,null,null,null,null,0,"03A9",{"$f":"MAX($D$281,$D$283)","v":-1.875},{"$f":"MAX($D$282,$D$284)","v":-4.6875},6.103515625E-2]
[{"$f":"IF(ModelNo=B34,7,\"\")","v":""},"8M40A","Bottom Glass Width",{"$f":"BGW_8M40A","v":-4.5625},null,32,"03A4","Mezzo Picture Window",0,0,null,null,9.5,9.5,112,112,154,"Standard",null,null,null,null,null,null,null,null,null,null,null,null,null,null,null,"Double Strength (3 mm)","Triple Strength (5 mm)","Triple IG Single Strength","Triple IG Double Strength","Laminated",null,null,"",null,null,null,null,null,null,null,null,null,null,null,null,null,null,null,null,null,null,null,null,null,null,null,null,null,0,"0951",{"$f":"#REF!","v":{"$error":"#REF!"}},{"$f":"#REF!","v":{"$error":"#REF!"}},{"$f":"(BQ34*BR34)/144","v":{"$error":"#REF!"}}]
[{"$f":"IF(ModelNo=B35,8,\"\")","v":""},"8M40A","Bottom Glass Height",{"$f":"BGH_8M40A","v":-2.6875},null,33,"03A9","Mezzo Three Lite Slider Equal Lite",0,0,null,null,52,12,{"$f":"IF(EXTSELECT=2,108,IF(EXTSELECT=3,120,\"\"))","v":""},{"$f":"IF(EXTSELECT=2,56,IF(EXTSELECT=3,72,\"\"))","v":""},{"$f":"IF(EXTSELECT=2,164,IF(EXTSELECT=3,192,\"\"))","v":""},"Standard (1/3-1/3-1/3)",null,null,null,"Half","Full",null,"Select Reinforcement","Composite","Steel",null,null,null,null,null,null,"Double Strength (3 mm)","Triple Strength (5 mm)","Triple IG Single Strength","Triple IG Double Strength","Laminated",null,null,"",null,null,null,null,null,null,null,null,null,null,null,null,null,null,null,null,null,{"$f":"(Frame_Width/3)-4.375","v":-4.375},null,null,null,null,null,null,null,0,"0952",{"$f":"MAX(#REF!,#REF!)","v":{"$error":"#REF!"}},{"$f":"MAX(#REF!,#REF!)","v":{"$error":"#REF!"}},{"$error":"#REF!"}]
[{"$f":"IF(ModelNo=B36,9,\"\")","v":""},"8M40A","Screen Width",{"$f":"Frame_Width-3.3125","v":-3.3125},null,34,"L201","Fusion Double Hung",0,0,null,null,11,20,48,78,126,"Standard","Custom",null,null,"Half","Full","Locking",null,null,null,null,null,null,null,null,"Single Strength (2.5 mm)","Double Strength (3 mm)","Triple Strength (5 mm)",null,null,null,null,null,"",{"$f":"Frame_Height-DDIM_L201","v":0},{"$f":"IF(TYPE=1,(Frame_Height/2),IF(TYPE=2,CMR))","v":0},{"$f":"Frame_Width-3.25","v":-3.25},{"$f":"DDIM_L201-1.5625","v":-1.5625},{"$f":"TRUNC((Frame_Width-4.9375)*16+0.5)/16","v":-4.875},{"$f":"TRUNC((DDIM_L201-3.21875)*32+0.5)/32","v":-3.1875},{"$f":"(AT36*AU36)/144","v":0.10791015625},{"$f":"Frame_Width-2.25","v":-2.25},{"$f":"CDIM_L201-0.5625","v":-0.5625},{"$f":"TRUNC((Frame_Width-3.9375)*16+0.5)/16","v":-3.875},{"$f":"TRUNC((CDIM_L201-2.21875)*32+0.5)/32","v":-2.1875},{"$f":"(AY36*AZ36)/144","v":5.8865017361111112E-2},{"$f":"BWGT_L201","v":{"$error":"#VALUE!"}},{"$f":"TWGT_L201","v":{"$error":"#VALUE!"}},{"$f":"IF(COIL=1,3.875-0.6875,3.875+((COIL-1)*1.625)-0.6875)","v":{"$error":"#N/A"}},7.4375,1.75,{"$f":"Frame_Width-4.5","v":-4.5},{"$f":"IF(AND(AX36>36.0625,(Frame_Height/2)<=CMR),CDIM_L201-BF36-BD36-0.125,IF(OR(AND(AX36>36.0625,(Frame_Height/2)<=CMR),(Frame_Height/2)>=CMR),Frame_Height-AX36-BE36-BF36,CDIM_L201-BF36-BD36-0.125))","v":-8.625},null,null,null,null,null,null,0,"0953",{"$f":"MAX(#REF!,#REF!)","v":{"$error":"#REF!"}},{"$f":"MAX(#REF!,#REF!)","v":{"$error":"#REF!"}},{"$error":"#REF!"}]
[{"$f":"IF(ModelNo=B37,10,\"\")","v":""},"8M40A","Screen Height",{"$f":"Frame_Height-3.6875","v":-3.6875},null,35,"L202","Fusion 2 Lite Slider",0,0,null,null,18,9,84,56,140,"Standard",null,null,null,"Half","Full",null,null,null,null,null,null,null,null,null,"Single Strength (2.5 mm)","Double Strength (3 mm)","Triple Strength (5 mm)",null,null,null,null,null,"",null,null,null,null,null,null,null,null,null,null,null,null,null,null,null,null,null,{"$f":"(Frame_Width/2)-4.25","v":-4.25},null,null,null,null,null,null,null,0,"0954",{"$f":"MAX(#REF!,#REF!)","v":{"$error":"#REF!"}},{"$f":"MAX(#REF!,#REF!)","v":{"$error":"#REF!"}},{"$error":"#REF!"}]
[{"$f":"IF(ModelNo=B38,11,\"\")","v":""},"8M40A","Top Sash Weight",{"$f":"IF(ISERROR(BTM_WGT&\" \"&\"lb\"),\"N/A\",TOP_WGT&\" \"&\"lb\")","v":"0 lb"},null,36,"L203","Fusion 3 Lite Slider (1/4-1/2-1/4)",0,0,null,null,48,9,108,56,164,"Standard (1/4-1/2-1/4)",null,null,null,"Half","Full",null,null,null,null,null,null,null,null,null,"Single Strength (2.5 mm)","Double Strength (3 mm)","Triple Strength (5 mm)",null,null,null,null,null,"",null,null,null,null,null,null,null,null,null,null,null,null,null,null,null,null,null,{"$f":"(Frame_Width/4)-1.5","v":-1.5},null,null,null,null,null,null,null,0,"0955",{"$f":"#REF!","v":{"$error":"#REF!"}},{"$f":"#REF!","v":{"$error":"#REF!"}},{"$error":"#REF!"}]
[{"$f":"IF(ModelNo=B39,12,\"\")","v":""},"8M40A","Top Balance Size (C.F)",{"$f":"IF(ISERROR((VLOOKUP(TOP_WGT,CFB,2,FALSE))),\"N/A\",(VLOOKUP(TOP_WGT,CFB,2,FALSE)))","v":"N/A"},null,37,"L204","Fusion Picture Window",0,0,null,null,9,9,96,96,154,"Standard",null,null,null,null,null,null,null,null,null,null,null,null,null,null,null,"Double Strength (3 mm)","Triple Strength (5 mm)",null,null,null,null,null,"",null,null,null,null,null,null,null,null,null,null,null,null,null,null,null,null,null,null,null,null,null,null,null,null,null,0,"0970",{"$f":"#REF!","v":{"$error":"#REF!"}},{"$f":"#REF!","v":{"$error":"#REF!"}},{"$error":"#REF!"}]
[{"$f":"IF(ModelNo=B40,13,\"\")","v":""},"8M40A","Bottom Sash Weight",{"$f":"IF(ISERROR(BTM_WGT&\" \"&\"lb\"),\"N/A\",BTM_WGT&\" \"&\"lb\")","v":"0 lb"},null,38,"L209","Fusion 3 Lite Slider Equal Lite",0,0,null,null,38,9,108,56,164,"Standard (1/3-1/3-1/3)",null,null,null,"Half","Full",null,null,null,null,null,null,null,null,null,"Single Strength (2.5 mm)","Double Strength (3 mm)","Triple Strength (5 mm)",null,null,null,null,null,"",null,null,null,null,null,null,null,null,null,null,null,null,null,null,null,null,null,{"$f":"(TRUNC((Frame_Width/3+0.1875)*16+0.5)/16)-2.125","v":-1.9375},null,null,null,null,null,null,null,0,"B970",{"$f":"#REF!","v":{"$error":"#REF!"}},{"$f":"#REF!","v":{"$error":"#REF!"}},{"$error":"#REF!"}]
[{"$f":"IF(ModelNo=B41,14,\"\")","v":""},"8M40A","Bottom Balance Size (C.F)",{"$f":"IF(ISERROR((VLOOKUP(BTM_WGT,CFB,2,FALSE))),\"N/A\",(VLOOKUP(BTM_WGT,CFB,2,FALSE)))","v":"N/A"},null,39,"0970","Casement Picture Window",0,0,null,null,13,13,96,96,154,"Standard",null,null,null,null,null,null,null,null,null,null,null,null,null,null,null,"Double Strength (3 mm)","Triple Strength (5 mm)","Triple IG Single Strength","Triple IG Double Strength","Laminated",null,null,{"$f":"IF(RO=2,\"<< Exact Size Only\",\"\")","v":""},null,null,null,null,null,null,null,null,null,null,null,null,null,null,null,null,null,null,null,null,null,null,null,null,null,0,"0971",{"$f":"#REF!","v":{"$error":"#REF!"}},{"$f":"#REF!","v":{"$error":"#REF!"}},{"$error":"#REF!"}]
[{"$f":"IF(ModelNo=B42,15,\"\")","v":""},"8M40A","Egress Opening Width",{"$f":"IF(ISERROR(EW),\"N/A\",EW)","v":0},null,40,"0971","Single Vent Casement",0,0,null,null,16,19,36,78,114,"Standard",null,null,null,"Full",null,null,null,null,null,null,null,null,null,null,null,"Double Strength (3 mm)","Triple Strength (5 mm)","Triple IG Single Strength","Triple IG Double Strength","Laminated",null,null,{"$f":"IF(RO=2,\"<< Exact Size Only\",\"\")","v":""},null,null,null,null,null,null,null,null,null,null,null,null,null,null,null,null,null,null,null,null,null,null,null,null,null,0,"B971",{"$f":"#REF!","v":{"$error":"#REF!"}},{"$f":"#REF!","v":{"$error":"#REF!"}},{"$error":"#REF!"}]
[{"$f":"IF(ModelNo=B43,16,\"\")","v":""},"8M40A","Egress Opening Height",{"$f":"IF(ISERROR(EH),\"N/A\",EH)","v":0},null,41,"0972","Dual Vent Casement",0,0,null,null,32,19,72,78,150,"Standard",null,null,null,"Half",null,null,null,null,null,null,null,null,null,null,null,"Double Strength (3 mm)","Triple Strength (5 mm)","Triple IG Single Strength","Triple IG Double Strength","Laminated",null,null,"",null,null,null,null,null,null,null,null,null,null,null,null,null,null,null,null,null,null,null,null,null,null,null,null,null,0,"0972",{"$f":"#REF!","v":{"$error":"#REF!"}},{"$f":"#REF!","v":{"$error":"#REF!"}},{"$error":"#REF!"}]
[{"$f":"IF(ModelNo=B44,17,\"\")","v":""},"8M40A","Egress Opening Area (sq.ft.)",{"$f":"(D42*D43)/144","v":0},null,42,"0973","Dual Vent 3 Lite Casement (1/4-1/2-1/4)",0,0,null,null,64,19,120,78,198,"Standard (1/4-1/2-1/4)",null,null,null,"Half",null,null,null,null,null,null,null,null,null,null,null,"Double Strength (3 mm)","Triple Strength (5 mm)","Triple IG Single Strength","Triple IG Double Strength","Laminated",null,null,"",null,null,null,null,null,null,null,null,null,null,null,null,null,null,null,null,null,null,null,null,null,null,null,null,null,0,"0973",{"$f":"MAX(#REF!,#REF!)","v":{"$error":"#REF!"}},{"$f":"MAX(#REF!,#REF!)","v":{"$error":"#REF!"}},{"$error":"#REF!"}]
[{"$f":"IF(ModelNo=B45,1,\"\")","v":""},"8P40A","Top Sash Width",{"$f":"TSW_8P40A","v":-4.875},null,43,"0974","4 Lite Casement",0,0,null,null,64,19,120,78,198,"Standard",null,null,null,"Half",null,null,null,null,null,null,null,null,null,null,null,"Double Strength (3 mm)","Triple Strength (5 mm)","Triple IG Single Strength","Triple IG Double Strength","Laminated",null,null,"",null,null,null,null,null,null,null,null,null,null,null,null,null,null,null,null,null,null,null,null,null,null,null,null,null,0,"0974",{"$f":"MAX(#REF!,#REF!)","v":{"$error":"#REF!"}},{"$f":"MAX(#REF!,#REF!)","v":{"$error":"#REF!"}},{"$error":"#REF!"}]
[{"$f":"IF(ModelNo=B46,2,\"\")","v":""},"8P40A","Top Sash Height",{"$f":"TSH_8P40A","v":-2.375},null,44,"0975","5 Lite Casement",0,0,null,null,80,19,120,78,198,"Standard",null,null,null,"Half",null,null,null,null,null,null,null,null,null,null,null,"Double Strength (3 mm)","Triple Strength (5 mm)","Triple IG Single Strength","Triple IG Double Strength","Laminated",null,null,"",null,null,null,null,null,null,null,null,null,null,null,null,null,null,null,null,null,null,null,null,null,null,null,null,null,0,"0975",{"$f":"MAX(#REF!,#REF!)","v":{"$error":"#REF!"}},{"$f":"MAX(#REF!,#REF!)","v":{"$error":"#REF!"}},{"$error":"#REF!"}]
[{"$f":"IF(ModelNo=B47,3,\"\")","v":""},"8P40A","Bottom Sash Width",{"$f":"BSW_8P40A","v":-3.75},null,45,"0979","Dual Vent 3 Lite Casement (Equal Lite)",0,0,null,null,48,19,108,78,186,"Standard (1/3-1/3-1/3)",null,null,null,"Half",null,null,null,null,null,null,null,null,null,null,null,"Double Strength (3 mm)","Triple Strength (5 mm)","Triple IG Single Strength","Triple IG Double Strength","Laminated",null,null,"",null,null,null,null,null,null,null,null,null,null,null,null,null,null,null,null,null,null,null,null,null,null,null,null,null,0,"0979",{"$f":"MAX(#REF!,#REF!)","v":{"$error":"#REF!"}},{"$f":"MAX(#REF!,#REF!)","v":{"$error":"#REF!"}},{"$error":"#REF!"}]
[{"$f":"IF(ModelNo=B48,4,\"\")","v":""},"8P40A","Bottom Sash Height",{"$f":"BSH_8P40A","v":-1.25},null,46,"1105","New Const. 4 Foot Patio Door",0.625,0.5,60,80,59.375,79.5,59.375,79.5,140,"Standard",null,null,null,"Half",null,null,null,null,null,null,null,null,null,null,null,"Double Strength (3 mm)","Triple Strength (5 mm)","Triple IG Single Strength","Triple IG Double Strength","Laminated",null,null,{"$f":"IF(RO=1,\"<< Rough Opening Only\",\"\")","v":"<< Rough Opening Only"},null,null,null,null,null,null,null,null,null,null,null,null,null,null,null,null,null,null,null,null,null,null,null,null,null,0,"6402",{"$f":"$D$62","v":-0.5625},{"$f":"$D$63","v":-2.75},1.07421875E-2]
[{"$f":"IF(ModelNo=B49,5,\"\")","v":""},"8P40A","Top Glass Width",{"$f":"TGW_8P40A","v":-6.75},null,47,"1106","New Const. Six Foot Patio Door",0.625,0.5,72,80,71.375,79.5,71.375,95.5,168,"Standard",null,null,null,"Half",null,null,null,null,null,null,null,null,null,null,null,"Double Strength (3 mm)","Triple Strength (5 mm)","Triple IG Single Strength","Triple IG Double Strength","Laminated",null,null,"<< Rough Opening Only",null,null,null,null,null,null,null,null,null,null,null,null,null,null,null,null,null,null,null,null,null,null,null,null,null,0,"6403",{"$f":"#REF!","v":{"$error":"#REF!"}},{"$f":"#REF!","v":{"$error":"#REF!"}},{"$error":"#REF!"}]
[{"$f":"IF(ModelNo=B50,6,\"\")","v":""},"8P40A","Top Glass Height",{"$f":"TGH_8P40A","v":-4.25},null,48,"1108","New Const. Eight Foot Patio Door",0.625,0.5,96,80,95.375,79.5,95.375,79.5,176,"Standard",null,null,null,"Half",null,null,null,null,null,null,null,null,null,null,null,"Double Strength (3 mm)","Triple Strength (5 mm)","Triple IG Single Strength","Triple IG Double Strength","Laminated",null,null,"<< Rough Opening Only",null,null,null,null,null,null,null,null,null,null,null,null,null,null,null,null,null,null,null,null,null,null,null,null,null,0,"6404",{"$f":"#REF!","v":{"$error":"#REF!"}},{"$f":"#REF!","v":{"$error":"#REF!"}},{"$error":"#REF!"}]
[{"$f":"IF(ModelNo=B51,7,\"\")","v":""},"8P40A","Bottom Glass Width",{"$f":"BGW_8P40A","v":-5.625},null,49,"1109","New Const. Nine Foot Patio Door",0.625,0.5,108,80,107.375,79.5,107.375,95.5,204,"Standard",null,null,null,"Half",null,null,null,null,null,null,null,null,null,null,null,"Double Strength (3 mm)","Triple Strength (5 mm)","Triple IG Single Strength","Triple IG Double Strength","Laminated",null,null,"<< Rough Opening Only",null,null,null,null,null,null,null,null,null,null,null,null,null,null,null,null,null,null,null,null,null,null,null,null,null,0,"6405",{"$f":"$D$62","v":-0.5625},{"$f":"$D$63","v":-2.75},1.07421875E-2]
[{"$f":"IF(ModelNo=B52,8,\"\")","v":""},"8P40A","Bottom Glass Height",{"$f":"BGH_8P40A","v":-3.125},null,50,{"$f":"ModelNo","v":"Select Model"},{"$f":"VLOOKUP(Model_Select,Data,2,FALSE)","v":0},{"$f":"VLOOKUP(Model_Select,Data,3,FALSE)","v":0},{"$f":"VLOOKUP(Model_Select,Data,4,FALSE)","v":0},{"$f":"VLOOKUP(Model_Select,Data,5,FALSE)","v":0},{"$f":"VLOOKUP(Model_Select,Data,6,FALSE)","v":0},{"$f":"VLOOKUP(Model_Select,Data,7,FALSE)","v":0},{"$f":"VLOOKUP(Model_Select,Data,8,FALSE)","v":0},{"$f":"VLOOKUP(Model_Select,Data,9,FALSE)","v":0},{"$f":"VLOOKUP(Model_Select,Data,10,FALSE)","v":0},{"$f":"VLOOKUP(Model_Select,Data,11,FALSE)","v":0},{"$f":"VLOOKUP(Model_Select,Data,12,FALSE)","v":0},{"$f":"VLOOKUP(Model_Select,Data,13,FALSE)","v":0},{"$f":"VLOOKUP(Model_Select,Data,14,FALSE)","v":0},{"$f":"VLOOKUP(Model_Select,Data,15,FALSE)","v":0},{"$f":"VLOOKUP(Model_Select,Data,16,FALSE)","v":0},{"$f":"VLOOKUP(Model_Select,Data,17,FALSE)","v":0},{"$f":"VLOOKUP(Model_Select,Data,18,FALSE)","v":0},{"$f":"VLOOKUP(Model_Select,Data,19,FALSE)","v":0},{"$f":"VLOOKUP(Model_Select,Data,20,FALSE)","v":0},{"$f":"VLOOKUP(Model_Select,Data,21,FALSE)","v":0},{"$f":"VLOOKUP(Model_Select,Data,22,FALSE)","v":0},{"$f":"VLOOKUP(Model_Select,Data,23,FALSE)","v":0},{"$f":"VLOOKUP(Model_Select,Data,24,FALSE)","v":0},{"$f":"VLOOKUP(Model_Select,Data,25,FALSE)","v":0},{"$f":"VLOOKUP(Model_Select,Data,26,FALSE)","v":0},{"$f":"VLOOKUP(Model_Select,Data,27,FALSE)","v":0},{"$f":"VLOOKUP(Model_Select,Data,28,FALSE)","v":0},{"$f":"VLOOKUP(Model_Select,Data,29,FALSE)","v":0},{"$f":"VLOOKUP(Model_Select,Data,30,FALSE)","v":0},{"$f":"VLOOKUP(Model_Select,Data,31,FALSE)","v":0},{"$f":"VLOOKUP(Model_Select,Data,32,FALSE)","v":0},{"$f":"VLOOKUP(Model_Select,Data,33,FALSE)","v":0},{"$f":"VLOOKUP(Model_Select,Data,34,FALSE)","v":0},{"$f":"VLOOKUP(Model_Select,Data,35,FALSE)","v":0},{"$f":"VLOOKUP(Model_Select,Data,36,FALSE)","v":0},{"$f":"VLOOKUP(Model_Select,Data,37,FALSE)","v":0},{"$f":"VLOOKUP(Model_Select,Data,38,FALSE)","v":0},{"$f":"VLOOKUP(Model_Select,Data,39,FALSE)","v":0},{"$f":"VLOOKUP(Model_Select,Data,40,FALSE)","v":0},{"$f":"VLOOKUP(Model_Select,Data,41,FALSE)","v":0},{"$f":"VLOOKUP(Model_Select,Data,42,FALSE)","v":0},{"$f":"VLOOKUP(Model_Select,Data,43,FALSE)","v":0},{"$f":"VLOOKUP(Model_Select,Data,44,FALSE)","v":0},{"$f":"VLOOKUP(Model_Select,Data,45,FALSE)","v":0},{"$f":"VLOOKUP(Model_Select,Data,46,FALSE)","v":0},{"$f":"VLOOKUP(Model_Select,Data,47,FALSE)","v":0},{"$f":"VLOOKUP(Model_Select,Data,48,FALSE)","v":0},{"$f":"VLOOKUP(Model_Select,Data,49,FALSE)","v":0},{"$f":"VLOOKUP(Model_Select,Data,50,FALSE)","v":0},{"$f":"VLOOKUP(Model_Select,Data,51,FALSE)","v":0},{"$f":"VLOOKUP(Model_Select,Data,52,FALSE)","v":0},{"$f":"VLOOKUP(Model_Select,Data,53,FALSE)","v":0},{"$f":"VLOOKUP(Model_Select,Data,54,FALSE)","v":0},null,null,null,null,null,null,0,"6406",{"$f":"$D$62","v":-0.5625},{"$f":"$D$63","v":-2.75},1.07421875E-2]
[{"$f":"IF(ModelNo=B53,9,\"\")","v":""},"8P40A","Screen Width",{"$f":"Frame_Width-4.4375","v":-4.4375},null,null,null,null,null,null,null,null,null,null,null,null,null,null,null,null,null,null,null,null,null,null,null,null,null,null,null,null,{"$f":"IF(AG52>0,1,0)","v":0},0,0,0,0,0,0,0,null,null,null,null,null,null,null,null,null,null,null,null,null,null,null,null,null,null,null,null,null,null,null,null,null,null,0,"6408",{"$f":"$D$62","v":-0.5625},{"$f":"$D$63","v":-2.75},1.07421875E-2]
[{"$f":"IF(ModelNo=B54,10,\"\")","v":""},"8P40A","Screen Height",{"$f":"Frame_Height-4.75","v":-4.75},null,null,null,null,null,null,null,null,null,null,null,null,null,null,null,null,null,null,null,null,null,null,null,null,null,null,null,null,{"$f":"AG53","v":0},{"$f":"SUM(AG53:AH53)","v":0},{"$f":"SUM(AG53:AI53)","v":0},{"$f":"SUM(AG53:AJ53)","v":0},{"$f":"SUM(AG53:AK53)","v":0},{"$f":"SUM(AG53:AL53)","v":0},{"$f":"SUM(AG53:AM53)","v":0},{"$f":"SUM(AG53:AN53)","v":0},null,null,null,null,null,null,null,null,null,null,null,null,null,null,null,null,null,null,null,null,null,null,null,null,null,null,0,"6409",{"$f":"#REF!","v":{"$error":"#REF!"}},{"$f":"#REF!","v":{"$error":"#REF!"}},{"$error":"#REF!"}]
[{"$f":"IF(ModelNo=B55,11,\"\")","v":""},"8P40A","Top Sash Weight",{"$f":"IF(ISERROR(BTM_WGT&\" \"&\"lb\"),\"N/A\",TOP_WGT&\" \"&\"lb\")","v":"0 lb"},null,null,null,null,null,null,null,null,null,null,null,null,null,null,null,null,null,null,null,null,null,null,null,null,null,null,null,null,{"$f":"AG52","v":0},{"$f":"AH52","v":0},{"$f":"AI52","v":0},0,0,0,0,{"$f":"AN52","v":0},null,null,null,null,null,null,null,null,null,null,null,null,null,null,null,null,null,null,null,null,null,null,null,null,null,null,0,"6412",{"$f":"#REF!","v":{"$error":"#REF!"}},{"$f":"#REF!","v":{"$error":"#REF!"}},{"$error":"#REF!"}]
[{"$f":"IF(ModelNo=B56,12,\"\")","v":""},"8P40A","Top Balance Size (C.F)",{"$f":"IF(ISERROR((VLOOKUP(TOP_WGT,CFB,2,FALSE))),\"N/A\",(VLOOKUP(TOP_WGT,CFB,2,FALSE)))","v":"N/A"},null,null,null,null,null,null,null,null,null,null,null,null,null,null,null,null,null,null,null,null,null,null,null,null,null,null,null,null,{"$f":"IF(ISERROR(HLOOKUP(1,AG54:AN55,2,FALSE)),\"\",HLOOKUP(1,AG54:AN55,2,FALSE))","v":""},{"$f":"IF(ISERROR(HLOOKUP(2,AG54:AN55,2,FALSE)),\"\",HLOOKUP(2,AG54:AN55,2,FALSE))","v":""},{"$f":"IF(ISERROR(HLOOKUP(3,AG54:AN55,2,FALSE)),\"\",HLOOKUP(3,AG54:AN55,2,FALSE))","v":""},{"$f":"IF(ISERROR(HLOOKUP(4,AG54:AN55,2,FALSE)),\"\",HLOOKUP(4,AG54:AN55,2,FALSE))","v":""},{"$f":"IF(ISERROR(HLOOKUP(5,AG54:AN55,2,FALSE)),\"\",HLOOKUP(5,AG54:AN55,2,FALSE))","v":""},{"$f":"IF(ISERROR(HLOOKUP(6,AG54:AN55,2,FALSE)),\"\",HLOOKUP(6,AG54:AN55,2,FALSE))","v":""},{"$f":"IF(ISERROR(HLOOKUP(7,AG54:AN55,2,FALSE)),\"\",HLOOKUP(7,AG54:AN55,2,FALSE))","v":""},{"$f":"IF(ISERROR(HLOOKUP(8,AG54:AN55,2,FALSE)),\"\",HLOOKUP(8,AG54:AN55,2,FALSE))","v":""},null,null,null,null,null,null,null,null,null,null,null,null,null,null,null,null,null,null,null,null,null,null,null,null,null,null,{"$f":"IF(ModelNo=BP56,ModelNo,0)","v":0},"6422",{"$f":"#REF!","v":{"$error":"#REF!"}},{"$f":"#REF!","v":{"$error":"#REF!"}},{"$error":"#REF!"}]
[{"$f":"IF(ModelNo=B57,13,\"\")","v":""},"8P40A","Bottom Sash Weight",{"$f":"IF(ISERROR(BTM_WGT&\" \"&\"lb\"),\"N/A\",BTM_WGT&\" \"&\"lb\")","v":"0 lb"},null,null,null,null,null,null,null,null,null,null,null,null,null,null,null,null,null,null,null,null,null,null,null,null,null,null,null,null,"Single Strength (2.5 mm)","S",2.3140000000000001,null,null,null,null,null,null,null,null,null,null,null,null,null,null,null,null,null,null,null,null,null,null,null,null,null,null,null,null,null,null,null,0,"6475",{"$f":"$D$62","v":-0.5625},{"$f":"$D$63","v":-2.75},1.07421875E-2]
[{"$f":"IF(ModelNo=B58,14,\"\")","v":""},"8P40A","Bottom Balance Size (C.F)",{"$f":"IF(ISERROR((VLOOKUP(BTM_WGT,CFB,2,FALSE))),\"N/A\",(VLOOKUP(BTM_WGT,CFB,2,FALSE)))","v":"N/A"},null,null,null,null,null,null,null,null,null,null,null,null,null,null,null,null,null,null,null,null,null,null,null,null,null,null,null,null,"Double Strength (3 mm)","D",3.2,null,null,null,null,null,null,null,null,null,null,null,null,null,null,null,null,null,null,null,null,null,null,null,null,null,null,null,null,null,null,null,0,"8001",{"$f":"MAX($D$6,#REF!)","v":{"$error":"#REF!"}},{"$f":"MAX($D$7,#REF!)","v":{"$error":"#REF!"}},{"$error":"#REF!"},{"$f":"IF(AND(OR(Glass=4,Glass=5),OR((ISERROR(TOP_TUBE)),(ISERROR(BTM_TUBE)))),1,IF(AND(Glass=3,Single_ST=0),1,0))","v":0}]
[{"$f":"IF(ModelNo=B59,15,\"\")","v":""},"8P40A","Egress Opening Width",{"$f":"IF(ISERROR(EW),\"N/A\",EW)","v":0},null,null,null,null,null,null,null,null,null,null,null,null,null,null,null,null,null,null,null,null,null,null,null,null,null,null,null,null,"M. Strength (4 mm)","M",4.04,null,null,null,null,null,null,null,null,null,null,null,null,null,null,null,null,null,null,null,null,null,null,null,null,null,null,null,null,null,null,null,0,"8002",{"$f":"$D$19","v":-5.625},{"$f":"$D$20","v":-3},0.1171875]
[{"$f":"IF(ModelNo=B60,16,\"\")","v":""},"8P40A","Egress Opening Height",{"$f":"IF(ISERROR(EH),\"N/A\",EH)","v":0},null,null,null,null,null,null,null,null,null,null,null,null,null,null,null,null,null,null,null,null,null,null,null,null,null,null,null,null,"Triple Strength (5 mm)","T",4.8159999999999998,null,null,null,null,null,null,null,null,null,null,null,null,null,null,null,null,null,null,null,null,null,null,null,null,null,null,null,null,null,null,null,0,"8003",{"$f":"MAX($D$28,$D$32)","v":-3.8125},{"$f":"MAX($D$29,$D$33)","v":-1.9375},5.1296657986111112E-2]
[{"$f":"IF(ModelNo=B61,17,\"\")","v":""},"8P40A","Egress Opening Area (sq.ft.)",{"$f":"(D59*D60)/144","v":0},null,null,null,null,null,null,null,null,null,null,null,null,null,null,null,null,null,null,null,null,null,null,null,null,null,null,null,null,"Triple IG Single Strength","STG",3.4710000000000001,null,null,null,null,null,null,null,null,null,null,null,null,null,null,null,null,null,null,null,null,null,null,null,null,null,null,null,null,null,null,null,0,"8009",{"$f":"MAX($D$44,#REF!)","v":{"$error":"#REF!"}},{"$f":"MAX(#REF!,#REF!)","v":{"$error":"#REF!"}},{"$error":"#REF!"}]
[{"$f":"IF(ModelNo=B62,1,\"\")","v":""},"3M10A","Sash Width",{"$f":"DDIM_3M10A-0.5625","v":-0.5625},null,null,null,null,null,null,null,null,null,null,null,null,null,null,null,null,null,null,null,null,null,null,null,null,null,null,null,null,"Triple IG Double Strength","DTG",4.8,null,null,null,null,null,null,null,null,null,null,null,null,null,null,null,null,null,null,null,null,null,null,null,null,null,null,null,null,null,null,null,0,"8014",{"$f":"#REF!","v":{"$error":"#REF!"}},{"$f":"#REF!","v":{"$error":"#REF!"}},{"$error":"#REF!"}]
[{"$f":"IF(ModelNo=B63,2,\"\")","v":""},"3M10A","Sash Height",{"$f":"Frame_Height-2.75","v":-2.75},null,null,null,null,null,null,null,null,null,null,null,null,null,null,null,null,null,null,null,null,null,null,null,null,null,null,null,null,"Laminated","L",5.3659999999999997,null,null,null,null,null,null,null,null,null,null,null,null,null,null,null,null,null,null,null,null,null,null,null,null,null,null,null,null,null,null,null,0,"8051",{"$f":"#REF!","v":{"$error":"#REF!"}},{"$f":"#REF!","v":{"$error":"#REF!"}},{"$error":"#REF!"}]
[{"$f":"IF(ModelNo=B64,3,\"\")","v":""},"3M10A","Fixed Glass Width",{"$f":"CDIM_3M10A-2.4375","v":-2.4375},null,null,null,null,null,null,null,null,null,null,null,null,null,null,null,null,null,null,null,null,null,null,null,null,null,null,null,null,"Impact Laminated","IL",5.3659999999999997,null,null,null,null,null,null,null,null,null,null,null,null,null,null,null,null,null,null,null,null,null,null,null,null,null,null,null,null,null,null,null,0,"8052",{"$f":"MAX(#REF!,#REF!)","v":{"$error":"#REF!"}},{"$f":"MAX(#REF!,#REF!)","v":{"$error":"#REF!"}},{"$error":"#REF!"}]
[{"$f":"IF(ModelNo=B65,4,\"\")","v":""},"3M10A","Fixed Glass Height",{"$f":"Frame_Height-3.0625","v":-3.0625},null,null,null,null,null,null,null,null,null,null,null,null,null,null,null,null,null,null,null,null,null,null,null,null,null,null,null,null,null,null,null,null,null,null,null,null,null,null,null,null,null,null,null,null,null,null,null,null,null,null,null,null,null,null,null,null,null,null,null,null,null,null,0,"8053",{"$f":"MAX(#REF!,#REF!)","v":{"$error":"#REF!"}},{"$f":"MAX(#REF!,#REF!)","v":{"$error":"#REF!"}},{"$error":"#REF!"}]
[{"$f":"IF(ModelNo=B66,5,\"\")","v":""},"3M10A","Sash Glass Width",{"$f":"DDIM_3M10A-2.4375","v":-2.4375},null,null,null,null,null,null,null,null,null,null,null,null,null,null,null,null,null,null,null,null,null,null,null,null,null,null,null,null,null,null,null,null,null,null,null,null,null,null,null,null,null,null,null,null,null,null,null,null,null,null,null,null,null,null,null,null,null,null,null,null,null,null,0,"8054",{"$f":"MAX(#REF!,#REF!)","v":{"$error":"#REF!"}},{"$f":"MAX(#REF!,#REF!)","v":{"$error":"#REF!"}},{"$f":"(BQ66*BR66)/144","v":{"$error":"#REF!"}}]
[{"$f":"IF(ModelNo=B67,6,\"\")","v":""},"3M10A","Sash Glass Height",{"$f":"Frame_Height-4.625","v":-4.625},null,null,null,null,null,null,null,null,null,null,null,null,null,null,null,null,null,null,null,null,null,null,null,null,null,null,null,null,null,null,null,null,null,null,null,null,null,null,null,null,null,null,null,null,null,null,null,null,null,null,null,null,null,null,null,null,null,null,null,null,null,null,0,"8055",{"$f":"#REF!","v":{"$error":"#REF!"}},{"$f":"#REF!","v":{"$error":"#REF!"}},{"$error":"#REF!"}]
[{"$f":"IF(ModelNo=B68,7,\"\")","v":""},"3M10A","Screen Width",{"$f":"DDIM_3M10A-1.9375","v":-1.9375},null,null,null,null,null,null,null,null,null,null,null,null,null,null,null,null,null,null,null,null,null,null,null,null,null,null,null,null,null,null,null,null,null,null,null,null,null,null,null,null,null,null,null,null,null,null,null,null,null,null,null,null,null,null,null,null,null,null,null,null,null,null,0,"8070",{"$f":"#REF!","v":{"$error":"#REF!"}},{"$f":"#REF!","v":{"$error":"#REF!"}},{"$error":"#REF!"}]
[{"$f":"IF(ModelNo=B69,8,\"\")","v":""},"3M10A","Screen Height",{"$f":"Frame_Height-3.5","v":-3.5},null,null,null,null,null,null,null,null,null,null,null,null,null,null,null,null,null,null,null,null,null,null,null,null,null,null,null,null,null,null,null,null,null,null,null,null,null,null,null,null,null,null,null,null,null,null,null,null,null,null,null,null,null,null,null,null,null,null,null,null,null,null,0,"8071",{"$f":"#REF!","v":{"$error":"#REF!"}},{"$f":"#REF!","v":{"$error":"#REF!"}},{"$error":"#REF!"}]
[{"$f":"IF(ModelNo=B70,9,\"\")","v":""},"3M10A","Egress Opening Width",{"$f":"DDIM_3M10A-3.5","v":-3.5},null,null,null,null,null,null,null,null,null,null,null,null,null,null,null,null,null,null,null,null,null,null,null,null,null,null,null,null,null,null,null,null,null,null,null,null,null,null,null,null,null,null,null,null,null,null,null,null,null,null,null,null,null,null,null,null,null,null,null,null,null,null,0,"8072",{"$f":"#REF!","v":{"$error":"#REF!"}},{"$f":"#REF!","v":{"$error":"#REF!"}},{"$error":"#REF!"}]
[{"$f":"IF(ModelNo=B71,10,\"\")","v":""},"3M10A","Egress Opening Height",{"$f":"Frame_Height-4","v":-4},null,null,null,null,null,null,null,null,null,null,null,null,null,null,null,null,null,null,null,null,null,null,null,null,null,null,null,null,null,null,null,null,null,null,null,null,null,null,null,null,null,null,null,null,null,null,null,null,null,null,null,null,null,null,null,null,null,null,null,null,null,null,0,"8073",{"$f":"MAX(#REF!,#REF!)","v":{"$error":"#REF!"}},{"$f":"MAX(#REF!,#REF!)","v":{"$error":"#REF!"}},{"$error":"#REF!"}]
[{"$f":"IF(ModelNo=B72,11,\"\")","v":""},"3M10A","Egress Opening Area (sq.ft.)",{"$f":"(D70*D71)/144","v":9.7222222222222224E-2},null,null,null,null,null,null,null,null,null,null,null,null,null,null,null,null,null,null,null,null,null,null,null,null,null,null,null,null,null,null,null,null,null,null,null,null,null,null,null,null,null,null,null,null,null,null,null,null,null,null,null,null,null,null,null,null,null,null,null,null,null,null,0,"8074",{"$f":"MAX(#REF!,#REF!)","v":{"$error":"#REF!"}},{"$f":"MAX(#REF!,#REF!)","v":{"$error":"#REF!"}},{"$error":"#REF!"}]
[{"$f":"IF(ModelNo=B73,1,\"\")","v":""},"3M10R","Sash Width",{"$f":"DDIM_3M10A-0.5625","v":-0.5625},null,null,null,null,null,null,null,null,null,null,null,null,null,null,null,null,null,null,null,null,null,null,null,null,null,null,null,null,null,null,null,null,null,null,null,null,null,null,null,null,null,null,null,null,null,null,null,null,null,null,null,null,null,null,null,null,null,null,null,null,null,null,0,"8075",{"$f":"MAX(#REF!,#REF!)","v":{"$error":"#REF!"}},{"$f":"MAX(#REF!,#REF!)","v":{"$error":"#REF!"}},{"$error":"#REF!"}]
[{"$f":"IF(ModelNo=B74,2,\"\")","v":""},"3M10R","Sash Height",{"$f":"Frame_Height-2.75","v":-2.75},null,null,null,null,null,null,null,null,null,null,null,null,null,null,null,null,null,null,null,null,null,null,null,null,null,null,null,null,null,null,null,null,null,null,null,null,null,null,null,null,null,null,null,null,null,null,null,null,null,null,null,null,null,null,null,null,null,null,null,null,null,null,0,"8079",{"$f":"MAX(#REF!,#REF!)","v":{"$error":"#REF!"}},{"$f":"MAX(#REF!,#REF!)","v":{"$error":"#REF!"}},{"$error":"#REF!"}]
[{"$f":"IF(ModelNo=B75,3,\"\")","v":""},"3M10R","Fixed Glass Width",{"$f":"CDIM_3M10A-2.4375","v":-2.4375},null,null,null,null,null,null,null,null,null,null,null,null,null,null,null,null,null,null,null,null,null,null,null,null,null,null,null,null,null,null,null,null,null,null,null,null,null,null,null,null,null,null,null,null,null,null,null,null,null,null,null,null,null,null,null,null,null,null,null,null,null,null,0,"8402",{"$f":"$D$62","v":-0.5625},{"$f":"$D$63","v":-2.75},1.07421875E-2]
[{"$f":"IF(ModelNo=B76,4,\"\")","v":""},"3M10R","Fixed Glass Height",{"$f":"Frame_Height-3.0625","v":-3.0625},null,null,null,null,null,null,null,null,null,null,null,null,null,null,null,null,null,null,null,null,null,null,null,null,null,null,null,null,null,null,null,null,null,null,null,null,null,null,null,null,null,null,null,null,null,null,null,null,null,null,null,null,null,null,null,null,null,null,null,null,null,null,0,"8403",{"$f":"#REF!","v":{"$error":"#REF!"}},{"$f":"#REF!","v":{"$error":"#REF!"}},{"$error":"#REF!"}]
[{"$f":"IF(ModelNo=B77,5,\"\")","v":""},"3M10R","Sash Glass Width",{"$f":"DDIM_3M10A-2.4375","v":-2.4375},null,null,null,null,null,null,null,null,null,null,null,null,null,null,null,null,null,null,null,null,null,null,null,null,null,null,null,null,null,null,null,null,null,null,null,null,null,null,null,null,null,null,null,null,null,null,null,null,null,null,null,null,null,null,null,null,null,null,null,null,null,null,0,"8404",{"$f":"#REF!","v":{"$error":"#REF!"}},{"$f":"#REF!","v":{"$error":"#REF!"}},{"$error":"#REF!"}]
[{"$f":"IF(ModelNo=B78,6,\"\")","v":""},"3M10R","Sash Glass Height",{"$f":"Frame_Height-4.625","v":-4.625},null,null,null,null,null,null,null,null,null,null,null,null,null,null,null,null,null,null,null,null,null,null,null,null,null,null,null,null,null,null,null,null,null,null,null,null,null,null,null,null,null,null,null,null,null,null,null,null,null,null,null,null,null,null,null,null,null,null,null,null,null,null,0,"8405",{"$f":"$D$62","v":-0.5625},{"$f":"$D$63","v":-2.75},1.07421875E-2]
[{"$f":"IF(ModelNo=B79,7,\"\")","v":""},"3M10R","Screen Width",{"$f":"DDIM_3M10A-1.9375","v":-1.9375},null,null,null,null,null,null,null,null,null,null,null,null,null,null,null,null,null,null,null,null,null,null,null,null,null,null,null,null,null,null,null,null,null,null,null,null,null,null,null,null,null,null,null,null,null,null,null,null,null,null,null,null,null,null,null,null,null,null,null,null,null,null,0,"8406",{"$f":"$D$62","v":-0.5625},{"$f":"$D$63","v":-2.75},1.07421875E-2]
[{"$f":"IF(ModelNo=B80,8,\"\")","v":""},"3M10R","Screen Height",{"$f":"Frame_Height-3.5","v":-3.5},null,null,null,null,null,null,null,null,null,null,null,null,null,null,null,null,null,null,null,null,null,null,null,null,null,null,null,null,null,null,null,null,null,null,null,null,null,null,null,null,null,null,null,null,null,null,null,null,null,null,null,null,null,null,null,null,null,null,null,null,null,null,0,"8408",{"$f":"$D$62","v":-0.5625},{"$f":"$D$63","v":-2.75},1.07421875E-2]
[{"$f":"IF(ModelNo=B81,9,\"\")","v":""},"3M10R","Egress Opening Width",{"$f":"DDIM_3M10A-3.5","v":-3.5},null,null,null,null,null,null,null,null,null,null,null,null,null,null,null,null,null,null,null,null,null,null,null,null,null,null,null,null,null,null,null,null,null,null,null,null,null,null,null,null,null,null,null,null,null,null,null,null,null,null,null,null,null,null,null,null,null,null,null,null,null,null,0,"8409",{"$f":"#REF!","v":{"$error":"#REF!"}},{"$f":"#REF!","v":{"$error":"#REF!"}},{"$error":"#REF!"}]
[{"$f":"IF(ModelNo=B82,10,\"\")","v":""},"3M10R","Egress Opening Height",{"$f":"Frame_Height-4","v":-4},null,null,null,null,null,null,null,null,null,null,null,null,null,null,null,null,null,null,null,null,null,null,null,null,null,null,null,null,null,null,null,null,null,null,null,null,null,null,null,null,null,null,null,null,null,null,null,null,null,null,null,null,null,null,null,null,null,null,null,null,null,null,0,"8412",{"$f":"#REF!","v":{"$error":"#REF!"}},{"$f":"#REF!","v":{"$error":"#REF!"}},{"$error":"#REF!"}]
[{"$f":"IF(ModelNo=B83,11,\"\")","v":""},"3M10R","Egress Opening Area (sq.ft.)",{"$f":"(D81*D82)/144","v":9.7222222222222224E-2},null,null,null,null,null,null,null,null,null,null,null,null,null,null,null,null,null,null,null,null,null,null,null,null,null,null,null,null,null,null,null,null,null,null,null,null,null,null,null,null,null,null,null,null,null,null,null,null,null,null,null,null,null,null,null,null,null,null,null,null,null,null,0,"8422",{"$f":"#REF!","v":{"$error":"#REF!"}},{"$f":"#REF!","v":{"$error":"#REF!"}},{"$error":"#REF!"}]
[{"$f":"IF(ModelNo=B84,1,\"\")","v":""},"3M10C14","Operating Sash Width",{"$f":"DDIM_3M10C14-0.5625","v":-0.5625},null,null,null,null,null,null,null,null,null,null,null,null,null,null,null,null,null,null,null,null,null,null,null,null,null,null,null,null,null,null,null,null,null,null,null,null,null,null,null,null,null,null,null,null,null,null,null,null,null,null,null,null,null,null,null,null,null,null,null,null,null,null,0,"8475",{"$f":"$D$62","v":-0.5625},{"$f":"$D$63","v":-2.75},1.07421875E-2]
[{"$f":"IF(ModelNo=B85,2,\"\")","v":""},"3M10C14","Operating Sash Height",{"$f":"Frame_Height-2.6875","v":-2.6875},null,null,null,null,null,null,null,null,null,null,null,null,null,null,null,null,null,null,null,null,null,null,null,null,null,null,null,null,null,null,null,null,null,null,null,null,null,null,null,null,null,null,null,null,null,null,null,null,null,null,null,null,null,null,null,null,null,null,null,null,null,null,0,"R970",{"$f":"#REF!","v":{"$error":"#REF!"}},{"$f":"#REF!","v":{"$error":"#REF!"}},{"$error":"#REF!"}]
[{"$f":"IF(ModelNo=B86,3,\"\")","v":""},"3M10C14","Sash Glass Width",{"$f":"DDIM_3M10C14-2.4375","v":-2.4375},null,null,null,null,null,null,null,null,null,null,null,null,null,null,null,null,null,null,null,null,null,null,null,null,null,null,null,null,null,null,null,null,null,null,null,null,null,null,null,null,null,null,null,null,null,null,null,null,null,null,null,null,null,null,null,null,null,null,null,null,null,null,0,"R971",{"$f":"#REF!","v":{"$error":"#REF!"}},{"$f":"#REF!","v":{"$error":"#REF!"}},{"$error":"#REF!"}]
[{"$f":"IF(ModelNo=B87,4,\"\")","v":""},"3M10C14","Sash Glass Height",{"$f":"Frame_Height-4.5625","v":-4.5625},null,null,null,null,null,null,null,null,null,null,null,null,null,null,null,null,null,null,null,null,null,null,null,null,null,null,null,null,null,null,null,null,null,null,null,null,null,null,null,null,null,null,null,null,null,null,null,null,null,null,null,null,null,null,null,null,null,null,null,null,null,null,{"$f":"IF(ModelNo=BP86,ModelNo,0)","v":0},{"$f":"ModelNo","v":"Select Model"},{"$f":"IF(ISERROR(VLOOKUP(ModelNo,$BP$24:$BT$86,2,FALSE)),0,VLOOKUP(ModelNo,$BP$24:$BT$86,2,FALSE))","v":0},{"$f":"IF(ISERROR(VLOOKUP(ModelNo,$BP$24:$BT$86,3,FALSE)),0,VLOOKUP(ModelNo,$BP$24:$BT$86,3,FALSE))","v":0},{"$f":"IF(ISERROR(VLOOKUP(ModelNo,$BP$24:$BT$86,4,FALSE)),0,VLOOKUP(ModelNo,$BP$24:$BT$86,4,FALSE))","v":0},{"$f":"IF(ISERROR(VLOOKUP(ModelNo,$BP$24:$BT$86,5,FALSE)),0,VLOOKUP(ModelNo,$BP$24:$BT$86,5,FALSE))","v":0}]
[{"$f":"IF(ModelNo=B88,5,\"\")","v":""},"3M10C14","Fixed Glass Width",{"$f":"CDIM_3M10C14-1.875","v":-1.875}]
[{"$f":"IF(ModelNo=B89,6,\"\")","v":""},"3M10C14","Fixed Glass Height",{"$f":"Frame_Height-3.0625","v":-3.0625}]
[{"$f":"IF(ModelNo=B90,7,\"\")","v":""},"3M10C14","Screen Width",{"$f":"DDIM_3M10C14-1.9375","v":-1.9375}]
[{"$f":"IF(ModelNo=B91,8,\"\")","v":""},"3M10C14","Screen Height",{"$f":"Frame_Height-3.5","v":-3.5}]
[{"$f":"IF(ModelNo=B92,9,\"\")","v":""},"3M10C14","Egress Opening Width",{"$f":"DDIM_3M10C14-3","v":-3}]
[{"$f":"IF(ModelNo=B93,10,\"\")","v":""},"3M10C14","Egress Opening Height",{"$f":"Frame_Height-4","v":-4}]
[{"$f":"IF(ModelNo=B94,11,\"\")","v":""},"3M10C14","Egress Opening Area (sq.ft.)",{"$f":"(D92*D93)/144","v":8.3333333333333329E-2}]
[{"$f":"IF(ModelNo=B95,1,\"\")","v":""},"3M10C13","Operating Sash Width",{"$f":"DDIM_3M10C13-0.5625","v":-0.5625}]
[{"$f":"IF(ModelNo=B96,2,\"\")","v":""},"3M10C13","Operating Sash Height",{"$f":"Frame_Height-2.6875","v":-2.6875}]
[{"$f":"IF(ModelNo=B97,3,\"\")","v":""},"3M10C13","Sash Glass Width",{"$f":"DDIM_3M10C13-2.4375","v":-2.4375}]
[{"$f":"IF(ModelNo=B98,4,\"\")","v":""},"3M10C13","Sash Glass Height",{"$f":"Frame_Height-4.5625","v":-4.5625}]
[{"$f":"IF(ModelNo=B99,5,\"\")","v":""},"3M10C13","Fixed Glass Width",{"$f":"CDIM_3M10C13-1.875","v":-1.875}]
[{"$f":"IF(ModelNo=B100,6,\"\")","v":""},"3M10C13","Fixed Glass Height",{"$f":"Frame_Height-3.0625","v":-3.0625}]
[{"$f":"IF(ModelNo=B101,7,\"\")","v":""},"3M10C13","Screen Width",{"$f":"DDIM_3M10C13-1.9375","v":-1.9375}]
[{"$f":"IF(ModelNo=B102,8,\"\")","v":""},"3M10C13","Screen Height",{"$f":"Frame_Height-3.5","v":-3.5}]
[{"$f":"IF(ModelNo=B103,9,\"\")","v":""},"3M10C13","Egress Opening Width",{"$f":"DDIM_3M10C13-4","v":-4}]
[{"$f":"IF(ModelNo=B104,10,\"\")","v":""},"3M10C13","Egress Opening Height",{"$f":"Frame_Height-4","v":-4}]
[{"$f":"IF(ModelNo=B105,11,\"\")","v":""},"3M10C13","Egress Opening Area (sq.ft.)",{"$f":"(D103*D104)/144","v":0.1111111111111111}]
[{"$f":"IF(ModelNo=B106,1,\"\")","v":""},"8M10A","Interior Sash Width",{"$f":"CDIM_8M10A-0.6875","v":-0.6875}]
[{"$f":"IF(ModelNo=B107,2,\"\")","v":""},"8M10A","Interior Sash Height",{"$f":"Frame_Height-2.75","v":-2.75}]
[{"$f":"IF(ModelNo=B108,3,\"\")","v":""},"8M10A","Exterior Sash Width",{"$f":"DDIM_8M10A-1.8125","v":-1.8125}]
[{"$f":"IF(ModelNo=B109,4,\"\")","v":""},"8M10A","Exterior Sash Height",{"$f":"Frame_Height-3.875","v":-3.875}]
[{"$f":"IF(ModelNo=B110,5,\"\")","v":""},"8M10A","Interior Glass Width",{"$f":"CDIM_8M10A-2.5625","v":-2.5625}]
[{"$f":"IF(ModelNo=B111,6,\"\")","v":""},"8M10A","Interior Glass Height",{"$f":"Frame_Height-4.625","v":-4.625}]
[{"$f":"IF(ModelNo=B112,7,\"\")","v":""},"8M10A","Exterior Glass Width",{"$f":"DDIM_8M10A-3.6875","v":-3.6875}]
[{"$f":"IF(ModelNo=B113,8,\"\")","v":""},"8M10A","Exterior Glass Height",{"$f":"Frame_Height-5.75","v":-5.75}]
[{"$f":"IF(ModelNo=B114,9,\"\")","v":""},"8M10A","Screen Width",{"$f":"Frame_Width-3.9375","v":-3.9375}]
[{"$f":"IF(ModelNo=B115,10,\"\")","v":""},"8M10A","Screen Height",{"$f":"Frame_Height-3.25","v":-3.25}]
[{"$f":"IF(ModelNo=B116,11,\"\")","v":""},"8M10A","Egress Opening Width",{"$f":"DDIM_8M10A-5.25","v":-5.25}]
[{"$f":"IF(ModelNo=B117,12,\"\")","v":""},"8M10A","Egress Opening Height",{"$f":"Frame_Height-5","v":-5}]
[{"$f":"IF(ModelNo=B118,13,\"\")","v":""},"8M10A","Egress Opening Area (sq.ft.)",{"$f":"(D116*D117)/144","v":0.18229166666666666}]
[{"$f":"IF(ModelNo=B119,1,\"\")","v":""},"3P10A","Sash Width",{"$f":"DDIM_3P10A-1.125","v":-1.125}]
[{"$f":"IF(ModelNo=B120,2,\"\")","v":""},"3P10A","Sash Height",{"$f":"Frame_Height-3.875","v":-3.875}]
[{"$f":"IF(ModelNo=B121,3,\"\")","v":""},"3P10A","Fixed Glass Width",{"$f":"CDIM_3P10A-3","v":-3}]
[{"$f":"IF(ModelNo=B122,4,\"\")","v":""},"3P10A","Fixed Glass Height",{"$f":"Frame_Height-4.125","v":-4.125}]
[{"$f":"IF(ModelNo=B123,5,\"\")","v":""},"3P10A","Sash Glass Width",{"$f":"DDIM_3P10A-3","v":-3}]
[{"$f":"IF(ModelNo=B124,6,\"\")","v":""},"3P10A","Sash Glass Height",{"$f":"Frame_Height-5.75","v":-5.75}]
[{"$f":"IF(ModelNo=B125,7,\"\")","v":""},"3P10A","Screen Width",{"$f":"DDIM_3P10A-2.5","v":-2.5}]
[{"$f":"IF(ModelNo=B126,8,\"\")","v":""},"3P10A","Screen Height",{"$f":"Frame_Height-4.5625","v":-4.5625}]
[{"$f":"IF(ModelNo=B127,9,\"\")","v":""},"3P10A","Egress Opening Width",{"$f":"DDIM_3P10A-4.5","v":-4.5}]
[{"$f":"IF(ModelNo=B128,10,\"\")","v":""},"3P10A","Egress Opening Height",{"$f":"Frame_Height-5","v":-5}]
[{"$f":"IF(ModelNo=B129,11,\"\")","v":""},"3P10A","Egress Opening Area (sq.ft.)",{"$f":"(D127*D128)/144","v":0.15625}]
[{"$f":"IF(ModelNo=B130,1,\"\")","v":""},"3P10R","Sash Width",{"$f":"DDIM_3P10R-1.125","v":-1.125}]
[{"$f":"IF(ModelNo=B131,2,\"\")","v":""},"3P10R","Sash Height",{"$f":"Frame_Height-3.875","v":-3.875}]
[{"$f":"IF(ModelNo=B132,3,\"\")","v":""},"3P10R","Fixed Glass Width",{"$f":"CDIM_3P10R-3","v":-3}]
[{"$f":"IF(ModelNo=B133,4,\"\")","v":""},"3P10R","Fixed Glass Height",{"$f":"Frame_Height-4.125","v":-4.125}]
[{"$f":"IF(ModelNo=B134,5,\"\")","v":""},"3P10R","Sash Glass Width",{"$f":"DDIM_3P10R-3","v":-3}]
[{"$f":"IF(ModelNo=B135,6,\"\")","v":""},"3P10R","Sash Glass Height",{"$f":"Frame_Height-5.75","v":-5.75}]
[{"$f":"IF(ModelNo=B136,7,\"\")","v":""},"3P10R","Screen Width",{"$f":"DDIM_3P10R-2.5","v":-2.5}]
[{"$f":"IF(ModelNo=B137,8,\"\")","v":""},"3P10R","Screen Height",{"$f":"Frame_Height-4.5625","v":-4.5625}]
[{"$f":"IF(ModelNo=B138,9,\"\")","v":""},"3P10R","Egress Opening Width",{"$f":"DDIM_3P10R-4.5","v":-4.5}]
[{"$f":"IF(ModelNo=B139,10,\"\")","v":""},"3P10R","Egress Opening Height",{"$f":"Frame_Height-5","v":-5}]
[{"$f":"IF(ModelNo=B140,11,\"\")","v":""},"3P10R","Egress Opening Area (sq.ft.)",{"$f":"(D138*D139)/144","v":0.15625}]
[{"$f":"IF(ModelNo=B141,1,\"\")","v":""},"3P10C14","Operating Sash Width",{"$f":"DDIM_3P10C14-0.5625","v":-0.5625}]
[{"$f":"IF(ModelNo=B142,2,\"\")","v":""},"3P10C14","Operating Sash Height",{"$f":"Frame_Height-3.875","v":-3.875}]
[{"$f":"IF(ModelNo=B143,3,\"\")","v":""},"3P10C14","Sash Glass Width",{"$f":"DDIM_3P10C14-2.4375","v":-2.4375}]
[{"$f":"IF(ModelNo=B144,4,\"\")","v":""},"3P10C14","Sash Glass Height",{"$f":"Frame_Height-5.75","v":-5.75}]
[{"$f":"IF(ModelNo=B145,5,\"\")","v":""},"3P10C14","Fixed Glass Width",{"$f":"CDIM_3P10C14-1.875","v":-1.875}]
[{"$f":"IF(ModelNo=B146,6,\"\")","v":""},"3P10C14","Fixed Glass Height",{"$f":"Frame_Height-3.0625","v":-3.0625}]
[{"$f":"IF(ModelNo=B147,7,\"\")","v":""},"3P10C14","Screen Width",{"$f":"DDIM_3P10C14-2.5","v":-2.5}]
[{"$f":"IF(ModelNo=B148,8,\"\")","v":""},"3P10C14","Screen Height",{"$f":"Frame_Height-4.5625","v":-4.5625}]
[{"$f":"IF(ModelNo=B149,9,\"\")","v":""},"3P10C14","Egress Opening Width",{"$f":"DDIM_3P10C14-3.5","v":-3.5}]
[{"$f":"IF(ModelNo=B150,10,\"\")","v":""},"3P10C14","Egress Opening Height",{"$f":"Frame_Height-5.125","v":-5.125}]
[{"$f":"IF(ModelNo=B151,11,\"\")","v":""},"3P10C14","Egress Opening Area (sq.ft.)",{"$f":"(D149*D150)/144","v":0.12456597222222222}]
[{"$f":"IF(ModelNo=B152,1,\"\")","v":""},"3P10C13","Operating Sash Width",{"$f":"DDIM_3P10C13-0.5625","v":-0.5625}]
[{"$f":"IF(ModelNo=B153,2,\"\")","v":""},"3P10C13","Operating Sash Height",{"$f":"Frame_Height-3.875","v":-3.875}]
[{"$f":"IF(ModelNo=B154,3,\"\")","v":""},"3P10C13","Sash Glass Width",{"$f":"DDIM_3P10C13-2.4375","v":-2.4375}]
[{"$f":"IF(ModelNo=B155,4,\"\")","v":""},"3P10C13","Sash Glass Height",{"$f":"Frame_Height-5.75","v":-5.75}]
[{"$f":"IF(ModelNo=B156,5,\"\")","v":""},"3P10C13","Fixed Glass Width",{"$f":"CDIM_3P10C13-1.875","v":-1.875}]
[{"$f":"IF(ModelNo=B157,6,\"\")","v":""},"3P10C13","Fixed Glass Height",{"$f":"Frame_Height-3.0625","v":-3.0625}]
[{"$f":"IF(ModelNo=B158,7,\"\")","v":""},"3P10C13","Screen Width",{"$f":"DDIM_3P10C13-2.5","v":-2.5}]
[{"$f":"IF(ModelNo=B159,8,\"\")","v":""},"3P10C13","Screen Height",{"$f":"Frame_Height-4.5625","v":-4.5625}]
[{"$f":"IF(ModelNo=B160,9,\"\")","v":""},"3P10C13","Egress Opening Width",{"$f":"DDIM_3M10C13-4.5","v":-4.5}]
[{"$f":"IF(ModelNo=B161,10,\"\")","v":""},"3P10C13","Egress Opening Height",{"$f":"Frame_Height-5.125","v":-5.125}]
[{"$f":"IF(ModelNo=B162,11,\"\")","v":""},"3P10C13","Egress Opening Area (sq.ft.)",{"$f":"(D160*D161)/144","v":0.16015625}]
[{"$f":"IF(ModelNo=B163,1,\"\")","v":""},"8P10A","Interior Sash Width",{"$f":"CDIM_8P10A-1.25","v":-1.25}]
[{"$f":"IF(ModelNo=B164,2,\"\")","v":""},"8P10A","Interior Sash Height",{"$f":"Frame_Height-3.875","v":-3.875}]
[{"$f":"IF(ModelNo=B165,3,\"\")","v":""},"8P10A","Exterior Sash Width",{"$f":"DDIM_8M10A-2.375","v":-2.375}]
[{"$f":"IF(ModelNo=B166,4,\"\")","v":""},"8P10A","Exterior Sash Height",{"$f":"Frame_Height-4.9375","v":-4.9375}]
[{"$f":"IF(ModelNo=B167,5,\"\")","v":""},"8P10A","Interior Glass Width",{"$f":"CDIM_8P10A-3.125","v":-3.125}]
[{"$f":"IF(ModelNo=B168,6,\"\")","v":""},"8P10A","Interior Glass Height",{"$f":"Frame_Height-5.75","v":-5.75}]
[{"$f":"IF(ModelNo=B169,7,\"\")","v":""},"8P10A","Exterior Glass Width",{"$f":"DDIM_8M10A-4.25","v":-4.25}]
[{"$f":"IF(ModelNo=B170,8,\"\")","v":""},"8P10A","Exterior Glass Height",{"$f":"Frame_Height-6.8125","v":-6.8125}]
[{"$f":"IF(ModelNo=B171,9,\"\")","v":""},"8P10A","Screen Width",{"$f":"Frame_Width-4.8125","v":-4.8125}]
[{"$f":"IF(ModelNo=B172,10,\"\")","v":""},"8P10A","Screen Height",{"$f":"Frame_Height-4.3125","v":-4.3125}]
[{"$f":"IF(ModelNo=B173,11,\"\")","v":""},"8P10A","Egress Opening Width",{"$f":"DDIM_8P10A-5.25","v":-5.25}]
[{"$f":"IF(ModelNo=B174,12,\"\")","v":""},"8P10A","Egress Opening Height",{"$f":"Frame_Height-6.125","v":-6.125}]
[{"$f":"IF(ModelNo=B175,13,\"\")","v":""},"8P10A","Egress Opening Area (sq.ft.)",{"$f":"(D173*D174)/144","v":0.22330729166666666}]
[{"$f":"IF(ModelNo=B176,1,\"\")","v":""},"8M21A","Interior Sash Width",{"$f":"CDIM_8M21A-0.8125","v":-0.8125}]
[{"$f":"IF(ModelNo=B177,2,\"\")","v":""},"8M21A","Interior Sash Height",{"$f":"Frame_Height-2.6875","v":-2.6875}]
[{"$f":"IF(ModelNo=B178,3,\"\")","v":""},"8M21A","Exterior Sash Width",{"$f":"DDIM_8M21A-1.9375","v":-1.9375}]
[{"$f":"IF(ModelNo=B179,4,\"\")","v":""},"8M21A","Exterior Sash Height",{"$f":"Frame_Height-3.8125","v":-3.8125}]
[{"$f":"IF(ModelNo=B180,5,\"\")","v":""},"8M21A","Interior Glass Width",{"$f":"CDIM_8M21A-2.6875","v":-2.6875}]
[{"$f":"IF(ModelNo=B181,6,\"\")","v":""},"8M21A","Interior Glass Height",{"$f":"Frame_Height-4.5625","v":-4.5625}]
[{"$f":"IF(ModelNo=B182,7,\"\")","v":""},"8M21A","Exterior Glass Width",{"$f":"DDIM_8M21A-3.8125","v":-3.8125}]
[{"$f":"IF(ModelNo=B183,8,\"\")","v":""},"8M21A","Exterior Glass Height",{"$f":"Frame_Height-5.6875","v":-5.6875}]
[{"$f":"IF(ModelNo=B184,9,\"\")","v":""},"8M21A","Screen Width",{"$f":"Frame_Width-3.9375","v":-3.9375}]
[{"$f":"IF(ModelNo=B185,10,\"\")","v":""},"8M21A","Screen Height",{"$f":"Frame_Height-3.25","v":-3.25}]
[{"$f":"IF(ModelNo=B186,11,\"\")","v":""},"8M21A","Egress Opening Width",{"$f":"DDIM_8M21A-5.25","v":-5.25}]
[{"$f":"IF(ModelNo=B187,12,\"\")","v":""},"8M21A","Egress Opening Height",{"$f":"Frame_Height-5","v":-5}]
[{"$f":"IF(ModelNo=B188,13,\"\")","v":""},"8M21A","Egress Opening Area (sq.ft.)",{"$f":"(D186*D187)/144","v":0.18229166666666666}]
[{"$f":"IF(ModelNo=B189,1,\"\")","v":""},"8M00A","Glass Width",{"$f":"Frame_Width-2.8125","v":-2.8125}]
[{"$f":"IF(ModelNo=B190,2,\"\")","v":""},"8M00A","Glass Height",{"$f":"Frame_Height-2.8125","v":-2.8125}]
[{"$f":"IF(ModelNo=B191,3,\"\")","v":""},"8M00A","Glass Area",{"$f":"(D189*D190)/144","v":5.4931640625E-2}]
[{"$f":"IF(ModelNo=B192,1,\"\")","v":""},"8P00A","Glass Width",{"$f":"Frame_Width-3.875","v":-3.875}]
[{"$f":"IF(ModelNo=B193,2,\"\")","v":""},"8P00A","Glass Height",{"$f":"Frame_Height-3.875","v":-3.875}]
[{"$f":"IF(ModelNo=B194,3,\"\")","v":""},"8P00A","Glass Area",{"$f":"(D192*D193)/144","v":0.1042751736111111}]
[{"$f":"IF(ModelNo=B195,1,\"\")","v":""},"8M71F","Glass Width",{"$f":"Frame_Width-5.4375","v":-5.4375}]
[{"$f":"IF(ModelNo=B196,2,\"\")","v":""},"8M71F","Glass Height",{"$f":"Frame_Height-5.4375","v":-5.4375}]
[{"$f":"IF(ModelNo=B197,3,\"\")","v":""},"8M71F","Glass Area",{"$f":"(D195*D196)/144","v":0.205322265625}]
[{"$f":"IF(ModelNo=B198,1,\"\")","v":""},"8P71F","Glass Width",{"$f":"Frame_Width-5.4375","v":-5.4375}]
[{"$f":"IF(ModelNo=B199,2,\"\")","v":""},"8P71F","Glass Height",{"$f":"Frame_Height-5.4375","v":-5.4375}]
[{"$f":"IF(ModelNo=B200,3,\"\")","v":""},"8P71F","Glass Area",{"$f":"(D198*D199)/144","v":0.205322265625}]
[{"$f":"IF(OR(ModelNo=\"8M71L\",ModelNo=\"8M71R\",ModelNo=\"8P71L\",ModelNo=\"8P71R\"),1,\"\")","v":""},"8P71L","Sash Width",{"$f":"Frame_Width-1.8125","v":-1.8125}]
[{"$f":"IF(OR(ModelNo=\"8M71L\",ModelNo=\"8M71R\",ModelNo=\"8P71L\",ModelNo=\"8P71R\"),2,\"\")","v":""},"8P71L","Sash Height",{"$f":"Frame_Height-1.8125","v":-1.8125}]
[{"$f":"IF(OR(ModelNo=\"8M71L\",ModelNo=\"8M71R\",ModelNo=\"8P71L\",ModelNo=\"8P71R\"),3,\"\")","v":""},"8P71L","Glass Width",{"$f":"Frame_Width-5.375","v":-5.375}]
[{"$f":"IF(OR(ModelNo=\"8M71L\",ModelNo=\"8M71R\",ModelNo=\"8P71L\",ModelNo=\"8P71R\"),4,\"\")","v":""},"8P71L","Glass Height",{"$f":"Frame_Height-5.375","v":-5.375}]
[{"$f":"IF(OR(ModelNo=\"8M71L\",ModelNo=\"8M71R\",ModelNo=\"8P71L\",ModelNo=\"8P71R\"),5,\"\")","v":""},"8P71L","Screen Width",{"$f":"Frame_Width-4.3125","v":-4.3125}]
[{"$f":"IF(OR(ModelNo=\"8M71L\",ModelNo=\"8M71R\",ModelNo=\"8P71L\",ModelNo=\"8P71R\"),6,\"\")","v":""},"8P71L","Screen Height",{"$f":"Frame_Height-4.375","v":-4.375}]
[{"$f":"IF(OR(ModelNo=\"8M71L\",ModelNo=\"8M71R\",ModelNo=\"8P71L\",ModelNo=\"8P71R\"),7,\"\")","v":""},"8P71L",{"$f":"IF(Frame_Width>=24,\"Egress Width Using 13in Hinge\",\"Egress Width Using 10in Hinge\")","v":"Egress Width Using 10in Hinge"},{"$f":"IF(Frame_Width>=24,Frame_Width-(2.546+9.327),Frame_Width-(2.546+7.664))","v":-10.209999999999999}]
[{"$f":"IF(OR(ModelNo=\"8M71L\",ModelNo=\"8M71R\",ModelNo=\"8P71L\",ModelNo=\"8P71R\"),8,\"\")","v":""},"8P71L",{"$f":"IF(Frame_Width>=24,\"Egress Height Using 13in Hinge\",\"Egress Height Using 10in Hinge\")","v":"Egress Height Using 10in Hinge"},{"$f":"Frame_Height-5","v":-5}]
[{"$f":"IF(OR(ModelNo=\"8M71L\",ModelNo=\"8M71R\",ModelNo=\"8P71L\",ModelNo=\"8P71R\"),9,\"\")","v":""},"8P71L",{"$f":"IF(Frame_Width>=24,\"Egress Area Using 13in Hinge (sq.ft)\",\"Egress Area Using 10in Hinge (sq.ft)\")","v":"Egress Area Using 10in Hinge (sq.ft)"},{"$f":"(D207*D208)/144","v":0.35451388888888885}]
[{"$f":"IF(OR(ModelNo=\"8M71L\",ModelNo=\"8M71R\",ModelNo=\"8P71L\",ModelNo=\"8P71R\"),10,\"\")","v":""},"8P71L",{"$f":"IF(AND(Frame_Width>16,Frame_Width<24),\"Egress Width Using 10in Egress Hinge\",\"N/A\")","v":"N/A"},{"$f":"IF(AND(Frame_Width>16,Frame_Width<24),Frame_Width-(2.546+5.039),\"N/A\")","v":"N/A"}]
[{"$f":"IF(OR(ModelNo=\"8M71L\",ModelNo=\"8M71R\",ModelNo=\"8P71L\",ModelNo=\"8P71R\"),11,\"\")","v":""},"8P71L",{"$f":"IF(AND(Frame_Width>16,Frame_Width<24),\"Egress Height Using 10in Egress Hinge\",\"N/A\")","v":"N/A"},{"$f":"IF(AND(Frame_Width>16,Frame_Width<24),Frame_Height-5,\"N/A\")","v":"N/A"}]
[{"$f":"IF(OR(ModelNo=\"8M71L\",ModelNo=\"8M71R\",ModelNo=\"8P71L\",ModelNo=\"8P71R\"),12,\"\")","v":""},"8P71L",{"$f":"IF(AND(Frame_Width>16,Frame_Width<24),\"Egress Area Using 10in Egress Hinge (sq.ft)\",\"N/A\")","v":"N/A"},{"$f":"IF(AND(Frame_Width>16,Frame_Width<24),(D210*D211)/144,\"N/A\")","v":"N/A"}]
[{"$f":"IF(ModelNo=B213,1,\"\")","v":""},"3M55A","Sash Width",{"$f":"Frame_Width-2.75","v":-2.75}]
[{"$f":"IF(ModelNo=B214,2,\"\")","v":""},"3M55A","Sash Height",{"$f":"Frame_Height-2.875","v":-2.875}]
[{"$f":"IF(ModelNo=B215,3,\"\")","v":""},"3M55A","Glass Width",{"$f":"Frame_Width-4.625","v":-4.625}]
[{"$f":"IF(ModelNo=B216,4,\"\")","v":""},"3M55A","Glass Height",{"$f":"Frame_Height-4.75","v":-4.75}]
[{"$f":"IF(ModelNo=B217,5,\"\")","v":""},"3M55A","Screen Width",{"$f":"Frame_Width-3.5","v":-3.5}]
[{"$f":"IF(ModelNo=B218,6,\"\")","v":""},"3M55A","Screen Height",{"$f":"Frame_Height-3.625","v":-3.625}]
[{"$f":"IF(ModelNo=B219,7,\"\")","v":""},"3M55A","Hopper Window does not meet Egress","N/A"]
[{"$f":"IF(ModelNo=B220,1,\"\")","v":""},"3M56A","Sash Width",{"$f":"Frame_Width-2.75","v":-2.75}]
[{"$f":"IF(ModelNo=B221,2,\"\")","v":""},"3M56A","Sash Height",{"$f":"Frame_Height-2.875","v":-2.875}]
[{"$f":"IF(ModelNo=B222,3,\"\")","v":""},"3M56A","Glass Width",{"$f":"Frame_Width-4.625","v":-4.625}]
[{"$f":"IF(ModelNo=B223,4,\"\")","v":""},"3M56A","Glass Height",{"$f":"Frame_Height-4.75","v":-4.75}]
[{"$f":"IF(ModelNo=B224,5,\"\")","v":""},"3M56A","Screen Width",{"$f":"Frame_Width-3.5","v":-3.5}]
[{"$f":"IF(ModelNo=B225,6,\"\")","v":""},"3M56A","Screen Height",{"$f":"Frame_Height-3.625","v":-3.625}]
[{"$f":"IF(ModelNo=B226,7,\"\")","v":""},"3M56A","Egress Width",{"$f":"Frame_Width-4","v":-4}]
[{"$f":"IF(ModelNo=B227,8,\"\")","v":""},"3M56A","Egress Height",{"$f":"Frame_Height-5.625","v":-5.625}]
[{"$f":"IF(ModelNo=B228,9,\"\")","v":""},"3M56A","Egress Opening Area (sq.ft.)",{"$f":"(D226*D227)/144","v":0.15625}]
[{"$f":"IF(OR(ModelNo=\"8M81A\",ModelNo=\"8P81A\"),1,\"\")","v":""},"8M81A","Sash Width",{"$f":"Frame_Width-1.8125","v":-1.8125}]
[{"$f":"IF(OR(ModelNo=\"8M81A\",ModelNo=\"8P81A\"),2,\"\")","v":""},"8M81A","Sash Height",{"$f":"Frame_Height-1.8125","v":-1.8125}]
[{"$f":"IF(OR(ModelNo=\"8M81A\",ModelNo=\"8P81A\"),3,\"\")","v":""},"8M81A","Glass Width",{"$f":"Frame_Width-5.375","v":-5.375}]
[{"$f":"IF(OR(ModelNo=\"8M81A\",ModelNo=\"8P81A\"),4,\"\")","v":""},"8M81A","Glass Height",{"$f":"Frame_Height-5.375","v":-5.375}]
[{"$f":"IF(OR(ModelNo=\"8M81A\",ModelNo=\"8P81A\"),5,\"\")","v":""},"8M81A","Screen Width",{"$f":"Frame_Width-4.3125","v":-4.3125}]
[{"$f":"IF(OR(ModelNo=\"8M81A\",ModelNo=\"8P81A\"),6,\"\")","v":""},"8M81A","Screen Height",{"$f":"Frame_Height-4.375","v":-4.375}]
[{"$f":"IF(OR(ModelNo=\"8M81A\",ModelNo=\"8P81A\"),7,\"\")","v":""},"8M81A","Awning Does Not Meet Egress"]
[{"$f":"IF(ModelNo=B236,1,\"\")","v":""},"03A4","Glass Width",{"$f":"Frame_Width-4.1875","v":-4.1875}]
[{"$f":"IF(ModelNo=B237,2,\"\")","v":""},"03A4","Glass Height",{"$f":"Frame_Height-4.1875","v":-4.1875}]
[{"$f":"IF(ModelNo=B238,3,\"\")","v":""},"03A4","Glass Area (sq.ft.)",{"$f":"(D236*D237)/144","v":0.12177191840277778}]
[{"$f":"IF(ModelNo=B239,1,\"\")","v":""},"03A0","Bottom Sash Width",{"$f":"Frame_Width-3.125","v":-3.125}]
[{"$f":"IF(ModelNo=B240,2,\"\")","v":""},"03A0","Bottom Sash Height",{"$f":"CDIM_03A0-1.125","v":-1.125}]
[{"$f":"IF(ModelNo=B241,3,\"\")","v":""},"03A0","Bottom Glass Width",{"$f":"TRUNC((Frame_Width-4.8125)*16+0.5)/16","v":-4.75}]
[{"$f":"IF(ModelNo=B242,4,\"\")","v":""},"03A0","Bottom Glass Height",{"$f":"TRUNC((CDIM_03A0-2.75)*32+0.5)/32","v":-2.71875}]
[{"$f":"IF(ModelNo=B243,5,\"\")","v":""},"03A0","Top Glass Width",{"$f":"TRUNC((Frame_Width-4.75)*16+0.5)/16","v":-4.6875}]
[{"$f":"IF(ModelNo=B244,6,\"\")","v":""},"03A0","Top Glass Height",{"$f":"TRUNC((DDIM_03A0-2.625)*32+0.5)/32","v":-2.59375}]
[{"$f":"IF(ModelNo=B245,7,\"\")","v":""},"03A0","Astragal Length",{"$f":"TRUNC((Frame_Width-4.125)*16+0.5)/16","v":-4.0625}]
[{"$f":"IF(ModelNo=B246,8,\"\")","v":""},"03A0","Screen Width",{"$f":"Frame_Width-4.5","v":-4.5}]
[{"$f":"IF(ModelNo=B247,9,\"\")","v":""},"03A0","Screen Height",{"$f":"IF(Screen=\"F\",Frame_Height-3.3125,IF(Screen=\"L\",CDIM_03A0-1.0625,CDIM_03A0-1.3125))","v":-1.3125}]
[{"$f":"IF(ModelNo=B248,10,\"\")","v":""},"03A0","Bottom Sash Weight",{"$f":"IF(ISERROR(BTM_WGT&\" \"&\"lb\"),\"N/A\",BTM_WGT&\" \"&\"lb\")","v":"0 lb"}]
[{"$f":"IF(ModelNo=B249,11,\"\")","v":""},"03A0","Balance Size",{"$f":"IF(ISERROR((VLOOKUP(BTM_WGT,CFB,2,FALSE))&(VLOOKUP(BTM_WGT,CFB,3,FALSE))),\"N/A\",(VLOOKUP(BTM_WGT,CFB,2,FALSE)))","v":"N/A"}]
[{"$f":"IF(ModelNo=B250,12,\"\")","v":""},"03A0","Egress Opening Width",{"$f":"IF(ISERROR(EW),\"N/A\",EW)","v":0}]
[{"$f":"IF(ModelNo=B251,13,\"\")","v":""},"03A0","Egress Opening Height",{"$f":"IF(ISERROR(EH),\"N/A\",EH)","v":0}]
[{"$f":"IF(ModelNo=B252,14,\"\")","v":""},"03A0","Egress Opening Area (sq.ft.)",{"$f":"(D250*D251)/144","v":0}]
[{"$f":"IF(ModelNo=B253,1,\"\")","v":""},"03A2","Sash Width",{"$f":"TRUNC(((Frame_Width/2)-1.0625)*16+0.5)/16","v":-1}]
[{"$f":"IF(ModelNo=B254,2,\"\")","v":""},"03A2","Sash Height",{"$f":"Frame_Height-3.0625","v":-3.0625}]
[{"$f":"IF(ModelNo=B255,3,\"\")","v":""},"03A2","Roller Track Length",{"$f":"Frame_Width-1.9375","v":-1.9375}]
[{"$f":"IF(ModelNo=B256,4,\"\")","v":""},"03A2","Sash Glass Width",{"$f":"TRUNC(((Frame_Width/2)-2.75)*16+0.5)/16","v":-2.6875}]
[{"$f":"IF(ModelNo=B257,5,\"\")","v":""},"03A2","Sash Glass Height",{"$f":"Frame_Height-4.6875","v":-4.6875}]
[{"$f":"IF(ModelNo=B258,6,\"\")","v":""},"03A2","Fixed Glass Width",{"$f":"TRUNC(((Frame_Width/2)-2.625)*16+0.5)/16","v":-2.5625}]
[{"$f":"IF(ModelNo=B259,7,\"\")","v":""},"03A2","Fixed Glass Height",{"$f":"TRUNC((Frame_Height-4.8125)*16+0.5)/16","v":-4.75}]
[{"$f":"IF(ModelNo=B260,8,\"\")","v":""},"03A2","Screen Width",{"$f":"IF(Screen=\"F\",Frame_Width-5,IF(Screen=\"L\",\"N/A\",TRUNC(((Frame_Width/2)-3.0625)*16+0.5)/16))","v":-3}]
[{"$f":"IF(ModelNo=B261,9,\"\")","v":""},"03A2","Screen Height",{"$f":"Frame_Height-4.5625","v":-4.5625}]
[{"$f":"IF(ModelNo=B262,10,\"\")","v":""},"03A2","Egress Opening Width",{"$f":"(Frame_Width/2)-4.75","v":-4.75}]
[{"$f":"IF(ModelNo=B263,11,\"\")","v":""},"03A2","Egress Opening Height",{"$f":"Frame_Height-5.875","v":-5.875}]
[{"$f":"IF(ModelNo=B264,12,\"\")","v":""},"03A2","Egress Opening Area (sq.ft.)",{"$f":"(D262*D263)/144","v":0.19379340277777779}]
[{"$f":"IF(ModelNo=B265,1,\"\")","v":""},"03A3","Operating Sash Width",{"$f":"TRUNC((((Frame_Width/4)+0.1875))*16+0.5)/16","v":0.1875}]
[{"$f":"IF(ModelNo=B266,2,\"\")","v":""},"03A3","Operating Sash Height",{"$f":"Frame_Height-3.0625","v":-3.0625}]
[{"$f":"IF(ModelNo=B267,3,\"\")","v":""},"03A3","Roller Track Length",{"$f":"Frame_Width-1.9375","v":-1.9375}]
[{"$f":"IF(ModelNo=B268,4,\"\")","v":""},"03A3","Operating Sash Glass Width",{"$f":"D265-1.6875","v":-1.5}]
[{"$f":"IF(ModelNo=B269,5,\"\")","v":""},"03A3","Operating Sash Glass Height",{"$f":"Frame_Height-4.6875","v":-4.6875}]
[{"$f":"IF(ModelNo=B270,6,\"\")","v":""},"03A3","Fixed Sash Glass Width",{"$f":"(Frame_Width-2*(TRUNC((Frame_Width/4+0.6875)*16+0.5)/16))-1.625","v":-3}]
[{"$f":"IF(ModelNo=B271,7,\"\")","v":""},"03A3","Fixed Sash Glass Height",{"$f":"Frame_Height-4.8125","v":-4.8125}]
[{"$f":"IF(ModelNo=B272,8,\"\")","v":""},"03A3","Screen Width",{"$f":"IF(Screen=\"F\",Frame_Width-5,IF(Screen=\"L\",\"N/A\",(TRUNC((Frame_Width/4+0.6875)*16+0.5)/16)-2.5))","v":-1.8125}]
[{"$f":"IF(ModelNo=B273,9,\"\")","v":""},"03A3","Screen Height",{"$f":"Frame_Height-4.5625","v":-4.5625}]
[{"$f":"IF(ModelNo=B274,10,\"\")","v":""},"03A3","Egress Opening Width",{"$f":"(Frame_Width/4)-2.875","v":-2.875}]
[{"$f":"IF(ModelNo=B275,11,\"\")","v":""},"03A3","Egress Opening Height",{"$f":"Frame_Height-5.875","v":-5.875}]
[{"$f":"IF(ModelNo=B276,12,\"\")","v":""},"03A3","Egress Opening Area (sq.ft.)",{"$f":"(D274*D275)/144","v":0.11729600694444445}]
[{"$f":"IF(ModelNo=B277,13,\"\")","v":""},"03A3","Center of Meeting Rail from Edge of Frame",{"$f":"(Frame_Width/4)+1","v":1}]
[{"$f":"IF(ModelNo=B278,1,\"\")","v":""},"03A9","Operating Sash Width",{"$f":"TRUNC(((Frame_Width/3)-0.3125)*16+0.5)/16","v":-0.25}]
[{"$f":"IF(ModelNo=B279,2,\"\")","v":""},"03A9","Operating Sash Height",{"$f":"Frame_Height-3.0625","v":-3.0625}]
[{"$f":"IF(ModelNo=B280,3,\"\")","v":""},"03A9","Roller Track Length",{"$f":"Frame_Width-1.9375","v":-1.9375}]
[{"$f":"IF(ModelNo=B281,4,\"\")","v":""},"03A9","Operating Sash Glass Width",{"$f":"TRUNC(((TRUNC(((Frame_Width/3)-0.3125)*16+0.5)/16)-1.6875)*16+0.5)/16","v":-1.875}]
[{"$f":"IF(ModelNo=B282,5,\"\")","v":""},"03A9","Operating Sash Glass Height",{"$f":"Frame_Height-4.6875","v":-4.6875}]
[{"$f":"IF(ModelNo=B283,6,\"\")","v":""},"03A9","Fixed Sash Glass Width",{"$f":"((Frame_Width-((TRUNC(((Frame_Width/3)+0.1875)*16+0.5)/16)*2))+1.1875)-2.8125","v":-2}]
[{"$f":"IF(ModelNo=B284,7,\"\")","v":""},"03A9","Fixed Sash Glass Height",{"$f":"Frame_Height-4.8125","v":-4.8125}]
[{"$f":"IF(ModelNo=B285,8,\"\")","v":""},"03A9","Screen Width",{"$f":"IF(Screen=\"F\",Frame_Width-5,IF(Screen=\"L\",\"N/A\",(TRUNC((Frame_Width/3+0.1875)*16+0.5)/16)-2.5))","v":-2.3125}]
[{"$f":"IF(ModelNo=B286,9,\"\")","v":""},"03A9","Screen Height",{"$f":"Frame_Height-4.5625","v":-4.5625}]
[{"$f":"IF(ModelNo=B287,10,\"\")","v":""},"03A9","Egress Opening Width",{"$f":"(Frame_Width/3)-4.375","v":-4.375}]
[{"$f":"IF(ModelNo=B288,11,\"\")","v":""},"03A9","Egress Opening Height",{"$f":"Frame_Height-5.875","v":-5.875}]
[{"$f":"IF(ModelNo=B289,12,\"\")","v":""},"03A9","Egress Opening Area (sq.ft.)",{"$f":"(D287*D288)/144","v":0.1784939236111111}]
[{"$f":"IF(ModelNo=B290,13,\"\")","v":""},"03A9","Center of Meeting Rail from Edge of Frame",{"$f":"(TRUNC((Frame_Width/3)*16+0.5)/16)+0.5","v":0.5}]
[{"$f":"IF(ModelNo=B291,1,\"\")","v":""},"L201","Top Sash Width",{"$f":"Frame_Width-3.25","v":-3.25}]
[{"$f":"IF(ModelNo=B292,2,\"\")","v":""},"L201","Top Sash Height",{"$f":"DDIM_L201-1.5625","v":-1.5625}]
[{"$f":"IF(ModelNo=B293,3,\"\")","v":""},"L201","Bottom Sash Width",{"$f":"Frame_Width-2.25","v":-2.25}]
[{"$f":"IF(ModelNo=B294,4,\"\")","v":""},"L201","Bottom Sash Height",{"$f":"CDIM_L201-0.5625","v":-0.5625}]
[{"$f":"IF(ModelNo=B295,5,\"\")","v":""},"L201","Top Glass Width",{"$f":"TRUNC((Frame_Width-4.9375)*16+0.5)/16","v":-4.875}]
[{"$f":"IF(ModelNo=B296,6,\"\")","v":""},"L201","Top Glass Height",{"$f":"TRUNC((DDIM_L201-3.21875)*32+0.5)/32","v":-3.1875}]
[{"$f":"IF(ModelNo=B297,7,\"\")","v":""},"L201","Bottom Glass Width",{"$f":"TRUNC((Frame_Width-3.9375)*16+0.5)/16","v":-3.875}]
[{"$f":"IF(ModelNo=B298,8,\"\")","v":""},"L201","Bottom Glass Height",{"$f":"TRUNC((CDIM_L201-2.21875)*32+0.5)/32","v":-2.1875}]
[{"$f":"IF(ModelNo=B299,9,\"\")","v":""},"L201","Screen Width",{"$f":"IF(Screen=\"L\",Frame_Width-1.6875,Frame_Width-3.6875)","v":-3.6875}]
[{"$f":"IF(ModelNo=B300,10,\"\")","v":""},"L201","Screen Height",{"$f":"IF(Screen=\"L\",TRUNC((CDIM_L201-1.375)*16+0.5)/16,IF(Screen=\"F\",TRUNC((Frame_Height-2.875)*16+0.5)/16,TRUNC((CDIM_L201-0.3125)*16+0.5)/16))","v":-0.25}]
[{"$f":"IF(ModelNo=B301,11,\"\")","v":""},"L201","Top Sash Weight (Plus 1 lb)",{"$f":"IF(ISERROR(TOP_WGT&\" \"&\"lb\"),\"N/A\",TOP_WGT&\" \"&\"lb\")","v":"0 lb"}]
[{"$f":"IF(ModelNo=B302,12,\"\")","v":""},"L201","Top Balance Size (C.F)",{"$f":"IF(ISERROR((VLOOKUP(TOP_WGT,CFB,2,FALSE))),\"N/A\",(VLOOKUP(TOP_WGT,CFB,2,FALSE)))","v":"N/A"}]
[{"$f":"IF(ModelNo=B303,13,\"\")","v":""},"L201","Bottom Sash Weight",{"$f":"IF(ISERROR(BTM_WGT&\" \"&\"lb\"),\"N/A\",BTM_WGT&\" \"&\"lb\")","v":"0 lb"}]
[{"$f":"IF(ModelNo=B304,14,\"\")","v":""},"L201","Bottom Balance Size (C.F)",{"$f":"IF(ISERROR((VLOOKUP(BTM_WGT,CFB,2,FALSE))),\"N/A\",(VLOOKUP(BTM_WGT,CFB,2,FALSE)))","v":"N/A"}]
[{"$f":"IF(ModelNo=B305,15,\"\")","v":""},"L201","Egress Opening Width",{"$f":"IF(ISERROR(EW),\"N/A\",EW)","v":0}]
[{"$f":"IF(ModelNo=B306,16,\"\")","v":""},"L201","Egress Opening Height",{"$f":"IF(ISERROR(EH),\"N/A\",EH)","v":0}]
[{"$f":"IF(ModelNo=B307,17,\"\")","v":""},"L201","Egress Opening Area (sq.ft.)",{"$f":"(D305*D306)/144","v":0}]
[{"$f":"IF(ModelNo=B308,1,\"\")","v":""},"L202","Sash Width",{"$f":"(Frame_Width/2)-0.625","v":-0.625}]
[{"$f":"IF(ModelNo=B309,2,\"\")","v":""},"L202","Sash Height",{"$f":"Frame_Height-3.25","v":-3.25}]
[{"$f":"IF(ModelNo=B310,3,\"\")","v":""},"L202","Roller Track Length",{"$f":"Frame_Width-1.8125","v":-1.8125}]
[{"$f":"IF(ModelNo=B311,4,\"\")","v":""},"L202","Glass Width",{"$f":"(Frame_Width/2)-2.3125","v":-2.3125}]
[{"$f":"IF(ModelNo=B312,5,\"\")","v":""},"L202","Glass Height",{"$f":"Frame_Height-4.9375","v":-4.9375}]
[{"$f":"IF(ModelNo=B313,6,\"\")","v":""},"L202","Screen Width",{"$f":"IF(Screen=\"F\",Frame_Width-4.125,IF(Screen=\"L\",\"N/A\",(Frame_Width/2)-1.5))","v":-1.5}]
[{"$f":"IF(ModelNo=B314,7,\"\")","v":""},"L202","Screen Height",{"$f":"IF(Screen=\"H\",Frame_Height-3.6875,Frame_Height-3.75)","v":-3.6875}]
[{"$f":"IF(ModelNo=B315,8,\"\")","v":""},"L202","Egress Opening Width",{"$f":"(Frame_Width/2)-4.25","v":-4.25}]
[{"$f":"IF(ModelNo=B316,9,\"\")","v":""},"L202","Egress Opening Height",{"$f":"Frame_Height-4.4375","v":-4.4375}]
[{"$f":"IF(ModelNo=B317,10,\"\")","v":""},"L202","Egress Opening Area (sq.ft.)",{"$f":"(D315*D316)/144","v":0.13096788194444445}]
[{"$f":"IF(ModelNo=B318,1,\"\")","v":""},"L203","Operating Sash Width",{"$f":"(TRUNC((((Frame_Width/4)+0.6875))*16+0.5)/16)-0.4375","v":0.25}]
[{"$f":"IF(ModelNo=B319,2,\"\")","v":""},"L203","Operating Sash Height",{"$f":"Frame_Height-3.25","v":-3.25}]
[{"$f":"IF(ModelNo=B320,3,\"\")","v":""},"L203","Fixed Sash Width",{"$f":"(Frame_Width-(2*(TRUNC((((Frame_Width/4)+0.6875))*16+0.5)/16)))+0.125","v":-1.25}]
[{"$f":"IF(ModelNo=B321,4,\"\")","v":""},"L203","Fixed Sash Height",{"$f":"Frame_Height-3.25","v":-3.25}]
[{"$f":"IF(ModelNo=B322,5,\"\")","v":""},"L203","Roller Track Length",{"$f":"Frame_Width-2.3125","v":-2.3125}]
[{"$f":"IF(ModelNo=B323,6,\"\")","v":""},"L203","Operating Sash Glass Width",{"$f":"(TRUNC((Frame_Width/4+0.6875)*16+0.5)/16)-2.125","v":-1.4375}]
[{"$f":"IF(ModelNo=B324,7,\"\")","v":""},"L203","Operating Sash Glass Height",{"$f":"Frame_Height-4.9375","v":-4.9375}]
[{"$f":"IF(ModelNo=B325,8,\"\")","v":""},"L203","Fixed Sash Glass Width",{"$f":"(Frame_Width-2*(TRUNC((Frame_Width/4+0.6875)*16+0.5)/16))-1.5625","v":-2.9375}]
[{"$f":"IF(ModelNo=B326,9,\"\")","v":""},"L203","Fixed Sash Glass Height",{"$f":"Frame_Height-4.9375","v":-4.9375}]
[{"$f":"IF(ModelNo=B327,10,\"\")","v":""},"L203","Screen Width",{"$f":"IF(Screen=\"F\",Frame_Width-4.125,IF(Screen=\"L\",\"N/A\",(TRUNC(((Frame_Width/4)+0.6875)*16+0.5)/16)-1.1875))","v":-0.5}]
[{"$f":"IF(ModelNo=B328,11,\"\")","v":""},"L203","Screen Height",{"$f":"Frame_Height-3.6875","v":-3.6875}]
[{"$f":"IF(ModelNo=B329,12,\"\")","v":""},"L203","Egress Opening Width",{"$f":"(Frame_Width/4)-1.5","v":-1.5}]
[{"$f":"IF(ModelNo=B330,13,\"\")","v":""},"L203","Egress Opening Height",{"$f":"Frame_Height-3.875","v":-3.875}]
[{"$f":"IF(ModelNo=B331,14,\"\")","v":""},"L203","Egress Opening Area (sq.ft.)",{"$f":"(D329*D330)/144","v":4.0364583333333336E-2}]
[{"$f":"IF(ModelNo=B332,1,\"\")","v":""},"L204","Glass Width",{"$f":"Frame_Width-3.4375","v":-3.4375}]
[{"$f":"IF(ModelNo=B333,2,\"\")","v":""},"L204","Glass Height",{"$f":"Frame_Height-3.4375","v":-3.4375}]
[{"$f":"IF(ModelNo=B334,3,\"\")","v":""},"L204","Glass Area (sq.ft.)",{"$f":"(D332*D333)/144","v":8.2058376736111105E-2}]
[{"$f":"IF(ModelNo=B335,1,\"\")","v":""},"L209","Operating Sash Width",{"$f":"(TRUNC(((Frame_Width/3)+0.1875)*16+0.5)/16)-0.4375","v":-0.25}]
[{"$f":"IF(ModelNo=B336,2,\"\")","v":""},"L209","Operating Sash Height",{"$f":"Frame_Height-3.25","v":-3.25}]
[{"$f":"IF(ModelNo=B337,3,\"\")","v":""},"L209","Fixed Sash Width",{"$f":"((TRUNC(((Frame_Width/3)+0.1875)*16+0.5)/16)-0.5625)+0.125","v":-0.25}]
[{"$f":"IF(ModelNo=B338,4,\"\")","v":""},"L209","Fixed Sash Height",{"$f":"Frame_Height-3.25","v":-3.25}]
[{"$f":"IF(ModelNo=B339,5,\"\")","v":""},"L209","Roller Track Length",{"$f":"Frame_Width-2.3125","v":-2.3125}]
[{"$f":"IF(ModelNo=B340,6,\"\")","v":""},"L209","Operating Sash Glass Width",{"$f":"(TRUNC((Frame_Width/3+0.1875)*16+0.5)/16)-2.125","v":-1.9375}]
[{"$f":"IF(ModelNo=B341,7,\"\")","v":""},"L209","Operating Sash Glass Height",{"$f":"Frame_Height-4.9375","v":-4.9375}]
[{"$f":"IF(ModelNo=B342,8,\"\")","v":""},"L209","Fixed Sash Glass Width",{"$f":"(TRUNC((Frame_Width/3+0.1875)*16+0.5)/16)-2.125","v":-1.9375}]
[{"$f":"IF(ModelNo=B343,9,\"\")","v":""},"L209","Fixed Sash Glass Height",{"$f":"Frame_Height-4.9375","v":-4.9375}]
[{"$f":"IF(ModelNo=B344,10,\"\")","v":""},"L209","Screen Width",{"$f":"IF(Screen=\"F\",Frame_Width-4.125,IF(Screen=\"L\",\"N/A\",(TRUNC(((Frame_Width/3)+0.1875)*16+0.5)/16)-1.1875))","v":-1}]
[{"$f":"IF(ModelNo=B345,11,\"\")","v":""},"L209","Screen Height",{"$f":"Frame_Height-3.6875","v":-3.6875}]
[{"$f":"IF(ModelNo=B346,12,\"\")","v":""},"L209","Egress Opening Width",{"$f":"(TRUNC(((Frame_Width/3)+0.1875)*16+0.5)/16)-4.15","v":-3.9625000000000004}]
[{"$f":"IF(ModelNo=B347,13,\"\")","v":""},"L209","Egress Opening Height",{"$f":"Frame_Height-3.875","v":-3.875}]
[{"$f":"IF(ModelNo=B348,14,\"\")","v":""},"L209","Egress Opening Area (sq.ft.)",{"$f":"(D346*D347)/144","v":0.10662977430555556}]
[{"$f":"IF(ModelNo=B349,1,\"\")","v":""},"0971","Sash Width",{"$f":"Frame_Width-1.625","v":-1.625}]
[{"$f":"IF(ModelNo=B350,2,\"\")","v":""},"0971","Sash Height",{"$f":"Frame_Height-1.625","v":-1.625}]
[{"$f":"IF(ModelNo=B351,3,\"\")","v":""},"0971","Glass Width",{"$f":"Frame_Width-4.625","v":-4.625}]
[{"$f":"IF(ModelNo=B352,4,\"\")","v":""},"0971","Glass Height",{"$f":"Frame_Height-4.625","v":-4.625}]
[{"$f":"IF(ModelNo=B353,5,\"\")","v":""},"0971","Screen Width",{"$f":"Frame_Width-4.0625","v":-4.0625}]
[{"$f":"IF(ModelNo=B354,6,\"\")","v":""},"0971","Screen Height",{"$f":"Frame_Height-4","v":-4}]
[{"$f":"IF(ModelNo=B355,7,\"\")","v":""},"0971","Egress Opening Width (Standard Hinge)",{"$f":"Frame_Width-11.25","v":-11.25}]
[{"$f":"IF(ModelNo=B356,8,\"\")","v":""},"0971","Egress Opening Height (Standard Hinge)",{"$f":"Frame_Height-4.375","v":-4.375}]
[{"$f":"IF(ModelNo=B357,9,\"\")","v":""},"0971","Egress Opening Area w/Standard Hinge (sq.ft.)",{"$f":"(D355*D356)/144","v":0.341796875}]
[{"$f":"IF(ModelNo=B358,10,\"\")","v":""},"0971","Egress Opening Width (Egress Hinge)",{"$f":"IF(D349<22.375,\"N/A\",Frame_Width-6.8125)","v":"N/A"}]
[{"$f":"IF(ModelNo=B359,11,\"\")","v":""},"0971","Egress Opening Height (Egress Hinge)",{"$f":"IF(D349<22.375,\"N/A\",Frame_Height-4.375)","v":"N/A"}]
[{"$f":"IF(ModelNo=B360,12,\"\")","v":""},"0971","Egress Opening Area w/Egress Hinge (sq.ft.)",{"$f":"IF(D349<22.375,\"N/A\",(D358*D359)/144)","v":"N/A"}]
[{"$f":"IF(ModelNo=B361,1,\"\")","v":""},"0972","Sash Width",{"$f":"(Frame_Width/2)-1.375","v":-1.375}]
[{"$f":"IF(ModelNo=B362,2,\"\")","v":""},"0972","Sash Height",{"$f":"Frame_Height-1.625","v":-1.625}]
[{"$f":"IF(ModelNo=B363,3,\"\")","v":""},"0972","Glass Width",{"$f":"(Frame_Width/2)-4.375","v":-4.375}]
[{"$f":"IF(ModelNo=B364,4,\"\")","v":""},"0972","Glass Height",{"$f":"Frame_Height-4.625","v":-4.625}]
[{"$f":"IF(ModelNo=B365,5,\"\")","v":""},"0972","Screen Width",{"$f":"(Frame_Width/2)-3.8125","v":-3.8125}]
[{"$f":"IF(ModelNo=B366,6,\"\")","v":""},"0972","Screen Height",{"$f":"Frame_Height-4","v":-4}]
[{"$f":"IF(ModelNo=B367,7,\"\")","v":""},"0972","Egress Opening Width (Standard Hinge)",{"$f":"(Frame_Width/2)-11","v":-11}]
[{"$f":"IF(ModelNo=B368,8,\"\")","v":""},"0972","Egress Opening Height (Standard Hinge)",{"$f":"Frame_Height-4.375","v":-4.375}]
[{"$f":"IF(ModelNo=B369,9,\"\")","v":""},"0972","Egress Opening Area w/Standard Hinge (sq.ft.)",{"$f":"(D367*D368)/144","v":0.3342013888888889}]
[{"$f":"IF(ModelNo=B370,10,\"\")","v":""},"0972","Egress Opening Width (Egress Hinge)",{"$f":"IF(D361<22.375,\"N/A\",(Frame_Width/2)-6.5625)","v":"N/A"}]
[{"$f":"IF(ModelNo=B371,11,\"\")","v":""},"0972","Egress Opening Height (Egress Hinge)",{"$f":"IF(D361<22.375,\"N/A\",Frame_Height-4.375)","v":"N/A"}]
[{"$f":"IF(ModelNo=B372,12,\"\")","v":""},"0972","Egress Opening Area w/Egress Hinge (sq.ft.)",{"$f":"IF(D361<22.375,\"N/A\",(D370*D371)/144)","v":"N/A"}]
[{"$f":"IF(ModelNo=B373,1,\"\")","v":""},"0973","Operating Sash Width",{"$f":"(Frame_Width/4)-1.375","v":-1.375}]
[{"$f":"IF(ModelNo=B374,2,\"\")","v":""},"0973","Operating Sash Height",{"$f":"Frame_Height-1.625","v":-1.625}]
[{"$f":"IF(ModelNo=B375,3,\"\")","v":""},"0973","Fixed Sash Width",{"$f":"Frame_Height-1.625","v":-1.625}]
[{"$f":"IF(ModelNo=B376,4,\"\")","v":""},"0973","Fixed Sash Height",{"$f":"Frame_Height-1.625","v":-1.625}]
[{"$f":"IF(ModelNo=B377,5,\"\")","v":""},"0973","Operating Sash Glass Width",{"$f":"(Frame_Width/4)-4.375","v":-4.375}]
[{"$f":"IF(ModelNo=B378,6,\"\")","v":""},"0973","Operating Sash Glass Height",{"$f":"Frame_Height-4.625","v":-4.625}]
[{"$f":"IF(ModelNo=B379,7,\"\")","v":""},"0973","Fixed Sash Glass Width",{"$f":"(Frame_Width/2)-4.125","v":-4.125}]
[{"$f":"IF(ModelNo=B380,8,\"\")","v":""},"0973","Fixed Sash Glass Height",{"$f":"Frame_Height-4.625","v":-4.625}]
[{"$f":"IF(ModelNo=B381,9,\"\")","v":""},"0973","Screen Width",{"$f":"(Frame_Width/4)-3.8125","v":-3.8125}]
[{"$f":"IF(ModelNo=B382,10,\"\")","v":""},"0973","Screen Height",{"$f":"Frame_Height-4","v":-4}]
[{"$f":"IF(ModelNo=B383,11,\"\")","v":""},"0973","Egress Opening Width (Standard Hinge)",{"$f":"(Frame_Width/4)-11","v":-11}]
[{"$f":"IF(ModelNo=B384,12,\"\")","v":""},"0973","Egress Opening Height (Standard Hinge)",{"$f":"Frame_Height-4.375","v":-4.375}]
[{"$f":"IF(ModelNo=B385,13,\"\")","v":""},"0973","Egress Opening Area w/Standard Hinge (sq.ft.)",{"$f":"(D383*D384)/144","v":0.3342013888888889}]
[{"$f":"IF(ModelNo=B386,14,\"\")","v":""},"0973","Egress Opening Width (Egress Hinge)",{"$f":"IF(D373<22.375,\"N/A\",(Frame_Width/4)-6.5625)","v":"N/A"}]
[{"$f":"IF(ModelNo=B387,15,\"\")","v":""},"0973","Egress Opening Height (Egress Hinge)",{"$f":"IF(D373<22.375,\"N/A\",Frame_Height-4.375)","v":"N/A"}]
[{"$f":"IF(ModelNo=B388,16,\"\")","v":""},"0973","Egress Opening Area w/Egress Hinge (sq.ft.)",{"$f":"IF(D373<22.375,\"N/A\",(D386*D387)/144)","v":"N/A"}]
[{"$f":"IF(ModelNo=B389,17,\"\")","v":""},"0973","Mull Location From Edge of Frame",{"$f":"Frame_Width/4","v":0}]
[{"$f":"IF(ModelNo=B390,1,\"\")","v":""},"0979","Operating Sash Width",{"$f":"TRUNC(((Frame_Width/3)-1.291)*16+0.5)/16","v":-1.25}]
[{"$f":"IF(ModelNo=B391,2,\"\")","v":""},"0979","Operating Sash Height",{"$f":"Frame_Height-1.625","v":-1.625}]
[{"$f":"IF(ModelNo=B392,3,\"\")","v":""},"0979","Fixed Sash Width",{"$f":"TRUNC(((Frame_Width/3)-1.291)*16+0.5)/16","v":-1.25}]
[{"$f":"IF(ModelNo=B393,4,\"\")","v":""},"0979","Fixed Sash Height",{"$f":"Frame_Height-1.625","v":-1.625}]
[{"$f":"IF(ModelNo=B394,5,\"\")","v":""},"0979","Operating Sash Glass Width",{"$f":"TRUNC(((Frame_Width/3)-4.291)*16+0.5)/16","v":-4.25}]
[{"$f":"IF(ModelNo=B395,6,\"\")","v":""},"0979","Operating Sash Glass Height",{"$f":"Frame_Height-4.625","v":-4.625}]
[{"$f":"IF(ModelNo=B396,7,\"\")","v":""},"0979","Fixed Sash Glass Width",{"$f":"TRUNC(((Frame_Width/3)-4.291)*16+0.5)/16","v":-4.25}]
[{"$f":"IF(ModelNo=B397,8,\"\")","v":""},"0979","Fixed Sash Glass Height",{"$f":"Frame_Height-4.625","v":-4.625}]
[{"$f":"IF(ModelNo=B398,9,\"\")","v":""},"0979","Screen Width",{"$f":"TRUNC(((Frame_Width/3)-3.666)*32+0.5)/32","v":-3.625}]
[{"$f":"IF(ModelNo=B399,10,\"\")","v":""},"0979","Screen Height",{"$f":"Frame_Height-4","v":-4}]
[{"$f":"IF(ModelNo=B400,11,\"\")","v":""},"0979","Egress Opening Width (Standard Hinge)",{"$f":"TRUNC(((Frame_Width/3)-10.916)*16+0.5)/16","v":-10.875}]
[{"$f":"IF(ModelNo=B401,12,\"\")","v":""},"0979","Egress Opening Height (Standard Hinge)",{"$f":"Frame_Height-4.375","v":-4.375}]
[{"$f":"IF(ModelNo=B402,13,\"\")","v":""},"0979","Egress Opening Area w/Standard Hinge (sq.ft.)",{"$f":"(D400*D401)/144","v":0.33040364583333331}]
[{"$f":"IF(ModelNo=B403,14,\"\")","v":""},"0979","Egress Opening Width (Egress Hinge)",{"$f":"IF(D390<22.375,\"N/A\",TRUNC(((Frame_Width/3)-6.4785)*16+0.5)/16)","v":"N/A"}]
[{"$f":"IF(ModelNo=B404,15,\"\")","v":""},"0979","Egress Opening Height (Egress Hinge)",{"$f":"IF(D390<22.375,\"N/A\",Frame_Height-4.375)","v":"N/A"}]
[{"$f":"IF(ModelNo=B405,16,\"\")","v":""},"0979","Egress Opening Area w/Egress Hinge (sq.ft.)",{"$f":"IF(D390<22.375,\"N/A\",(D403*D404)/144)","v":"N/A"}]
[{"$f":"IF(ModelNo=B406,17,\"\")","v":""},"0979","Mull Location From Edge of Frame",{"$f":"(TRUNC((Frame_Width/3)*16+0.5)/16)+0.125","v":0.125}]
[{"$f":"IF(ModelNo=B407,1,\"\")","v":""},"0974","Operating Sash Width",{"$f":"(Frame_Width/4)-1.25","v":-1.25}]
[{"$f":"IF(ModelNo=B408,2,\"\")","v":""},"0974","Operating Sash Height",{"$f":"Frame_Height-1.625","v":-1.625}]
[{"$f":"IF(ModelNo=B409,3,\"\")","v":""},"0974","Fixed Sash Width",{"$f":"(Frame_Width/4)-1.25","v":-1.25}]
[{"$f":"IF(ModelNo=B410,4,\"\")","v":""},"0974","Fixed Sash Height",{"$f":"Frame_Height-1.625","v":-1.625}]
[{"$f":"IF(ModelNo=B411,5,\"\")","v":""},"0974","Operating Sash Glass Width",{"$f":"(Frame_Width/4)-4.25","v":-4.25}]
[{"$f":"IF(ModelNo=B412,6,\"\")","v":""},"0974","Operating Sash Glass Height",{"$f":"Frame_Height-4.625","v":-4.625}]
[{"$f":"IF(ModelNo=B413,7,\"\")","v":""},"0974","Fixed Sash Glass Width",{"$f":"(Frame_Width/4)-4.25","v":-4.25}]
[{"$f":"IF(ModelNo=B414,8,\"\")","v":""},"0974","Fixed Sash Glass Height",{"$f":"Frame_Height-4.625","v":-4.625}]
[{"$f":"IF(ModelNo=B415,9,\"\")","v":""},"0974","Screen Width",{"$f":"(Frame_Width/4)-3.625","v":-3.625}]
[{"$f":"IF(ModelNo=B416,10,\"\")","v":""},"0974","Screen Height",{"$f":"Frame_Height-4","v":-4}]
[{"$f":"IF(ModelNo=B417,11,\"\")","v":""},"0974","Egress Opening Width (Standard Hinge)",{"$f":"(Frame_Width/4)-10.875","v":-10.875}]
[{"$f":"IF(ModelNo=B418,12,\"\")","v":""},"0974","Egress Opening Height (Standard Hinge)",{"$f":"Frame_Height-4.375","v":-4.375}]
[{"$f":"IF(ModelNo=B419,13,\"\")","v":""},"0974","Egress Opening Area w/Standard Hinge (sq.ft.)",{"$f":"(D417*D418)/144","v":0.33040364583333331}]
[{"$f":"IF(ModelNo=B420,14,\"\")","v":""},"0974","Egress Opening Width (Egress Hinge)",{"$f":"IF(D407<22.375,\"N/A\",(Frame_Width/4)-6.4375)","v":"N/A"}]
[{"$f":"IF(ModelNo=B421,15,\"\")","v":""},"0974","Egress Opening Height (Egress Hinge)",{"$f":"IF(D407<22.375,\"N/A\",Frame_Height-4.375)","v":"N/A"}]
[{"$f":"IF(ModelNo=B422,16,\"\")","v":""},"0974","Egress Opening Area w/Egress Hinge (sq.ft.)",{"$f":"IF(D407<22.375,\"N/A\",(D420*D421)/144)","v":"N/A"}]
[{"$f":"IF(ModelNo=B423,17,\"\")","v":""},"0974","Mull Location From Edge of Frame",{"$f":"(Frame_Width/4)+0.125","v":0.125}]
[{"$f":"IF(ModelNo=B424,18,\"\")","v":""},"0974","Distance Between Mulls",{"$f":"(Frame_Width/4)-0.125","v":-0.125}]
[{"$f":"IF(ModelNo=B425,1,\"\")","v":""},"0975","Operating Sash Width",{"$f":"TRUNC(((Frame_Width/5)-1.225)*16+0.5)/16","v":-1.1875}]
[{"$f":"IF(ModelNo=B426,2,\"\")","v":""},"0975","Operating Sash Height",{"$f":"Frame_Height-1.625","v":-1.625}]
[{"$f":"IF(ModelNo=B427,3,\"\")","v":""},"0975","Fixed Sash Width",{"$f":"TRUNC(((Frame_Width/5)-1.225)*16+0.5)/16","v":-1.1875}]
[{"$f":"IF(ModelNo=B428,4,\"\")","v":""},"0975","Fixed Sash Height",{"$f":"Frame_Height-1.625","v":-1.625}]
[{"$f":"IF(ModelNo=B429,5,\"\")","v":""},"0975","Operating Sash Glass Width",{"$f":"TRUNC(((Frame_Width/5)-4.225)*16+0.5)/16","v":-4.1875}]
[{"$f":"IF(ModelNo=B430,6,\"\")","v":""},"0975","Operating Sash Glass Height",{"$f":"Frame_Height-4.625","v":-4.625}]
[{"$f":"IF(ModelNo=B431,7,\"\")","v":""},"0975","Fixed Sash Glass Width",{"$f":"TRUNC(((Frame_Width/5)-4.225)*16+0.5)/16","v":-4.1875}]
[{"$f":"IF(ModelNo=B432,8,\"\")","v":""},"0975","Fixed Sash Glass Height",{"$f":"Frame_Height-4.625","v":-4.625}]
[{"$f":"IF(ModelNo=B433,9,\"\")","v":""},"0975","Screen Width",{"$f":"TRUNC(((Frame_Width/5)-3.7625)*16+0.5)/16","v":-3.6875}]
[{"$f":"IF(ModelNo=B434,10,\"\")","v":""},"0975","Screen Height",{"$f":"Frame_Height-4","v":-4}]
[{"$f":"IF(ModelNo=B435,11,\"\")","v":""},"0975","Egress Opening Width (Standard Hinge)",{"$f":"TRUNC(((Frame_Width/5)-10.875)*16+0.5)/16","v":-10.8125}]
[{"$f":"IF(ModelNo=B436,12,\"\")","v":""},"0975","Egress Opening Height (Standard Hinge)",{"$f":"Frame_Height-4.375","v":-4.375}]
[{"$f":"IF(ModelNo=B437,13,\"\")","v":""},"0975","Egress Opening Area w/Standard Hinge (sq.ft.)",{"$f":"(D435*D436)/144","v":0.32850477430555558}]
[{"$f":"IF(ModelNo=B438,14,\"\")","v":""},"0975","Egress Opening Width (Egress Hinge)",{"$f":"IF(D425<22.375,\"N/A\",TRUNC(((Frame_Width/5)-6.4375)*16+0.5)/16)","v":"N/A"}]
[{"$f":"IF(ModelNo=B439,15,\"\")","v":""},"0975","Egress Opening Height (Egress Hinge)",{"$f":"IF(D425<22.375,\"N/A\",Frame_Height-4.375)","v":"N/A"}]
[{"$f":"IF(ModelNo=B440,16,\"\")","v":""},"0975","Egress Opening Area w/Egress Hinge (sq.ft.)",{"$f":"IF(D425<22.375,\"N/A\",(D438*D439)/144)","v":"N/A"}]
[{"$f":"IF(ModelNo=B441,17,\"\")","v":""},"0975","Mull Location From Edge of Frame",{"$f":"(TRUNC((Frame_Width/5)*16+0.5)/16)+0.125","v":0.125}]
[{"$f":"IF(ModelNo=B442,18,\"\")","v":""},"0975","Distance Between Mulls",{"$f":"(TRUNC((Frame_Width/5)*16+0.5)/16)-0.125","v":-0.125}]
[{"$f":"IF(ModelNo=B443,1,\"\")","v":""},"0970","Glass Width",{"$f":"Frame_Width-4.625","v":-4.625}]
[{"$f":"IF(ModelNo=B444,2,\"\")","v":""},"0970","Glass Height",{"$f":"Frame_Height-4.625","v":-4.625}]
[{"$f":"IF(ModelNo=B445,3,\"\")","v":""},"0970","Glass Area (sq.ft.)",{"$f":"(D443*D444)/144","v":0.14854600694444445}]
[{"$f":"IF(OR(ModelNo=\"1105\",ModelNo=\"1106\",ModelNo=\"1108\"),1,\"\")","v":""},"1100","Sash Width",{"$f":"(Frame_Width/2)+1.0625","v":1.0625}]
[{"$f":"IF(OR(ModelNo=\"1105\",ModelNo=\"1106\",ModelNo=\"1108\"),2,\"\")","v":""},"1100","Sash Height",{"$f":"Frame_Height-2.1875","v":-2.1875}]
[{"$f":"IF(OR(ModelNo=\"1105\",ModelNo=\"1106\",ModelNo=\"1108\"),3,\"\")","v":""},"1100","Roller Track Length",{"$f":"Frame_Width-1.25","v":-1.25}]
[{"$f":"IF(OR(ModelNo=\"1105\",ModelNo=\"1106\",ModelNo=\"1108\"),4,\"\")","v":""},"1100","Glass Width",{"$f":"(Frame_Width/2)-2.8125","v":-2.8125}]
[{"$f":"IF(OR(ModelNo=\"1105\",ModelNo=\"1106\",ModelNo=\"1108\"),5,\"\")","v":""},"1100","Glass Height",{"$f":"Frame_Height-6.125","v":-6.125}]
[{"$f":"IF(OR(ModelNo=\"1105\",ModelNo=\"1106\",ModelNo=\"1108\"),6,\"\")","v":""},"1100","Screen Width",{"$f":"(Frame_Width/2)+0.0625","v":6.25E-2}]
[{"$f":"IF(OR(ModelNo=\"1105\",ModelNo=\"1106\",ModelNo=\"1108\"),7,\"\")","v":""},"1100","Screen Height",{"$f":"Frame_Height-1.625","v":-1.625}]
[{"$f":"IF(OR(ModelNo=\"1105\",ModelNo=\"1106\",ModelNo=\"1108\"),8,\"\")","v":""},"1100","Egress Opening Width",{"$f":"(Frame_Width/2)-5.59375","v":-5.59375}]
[{"$f":"IF(OR(ModelNo=\"1105\",ModelNo=\"1106\",ModelNo=\"1108\"),9,\"\")","v":""},"1100","Egress Opening Height",{"$f":"Frame_Height-3.125","v":-3.125}]
[{"$f":"IF(OR(ModelNo=\"1105\",ModelNo=\"1106\",ModelNo=\"1108\"),10,\"\")","v":""},"1100","Egress Opening Area (sq.ft.)",{"$f":"(D453*D454)/144","v":0.12139214409722222}]
[{"$f":"IF(ModelNo=B456,1,\"\")","v":""},"1109","Sash Width",{"$f":"TRUNC(((Frame_Width/3)+1.5625)*16+0.5)/16","v":1.5625}]
[{"$f":"IF(ModelNo=B457,2,\"\")","v":""},"1109","Sash Height",{"$f":"Frame_Height-2.1875","v":-2.1875}]
[{"$f":"IF(ModelNo=B458,3,\"\")","v":""},"1109","Roller Track Length",{"$f":"TRUNC(((((Frame_Width+0.625)/3)*2)-0.75)*16+0.5)/16","v":-0.25}]
[{"$f":"IF(ModelNo=B459,4,\"\")","v":""},"1109","Glass Width",{"$f":"TRUNC(((Frame_Width/3)-2.3125)*16+0.5)/16","v":-2.25}]
[{"$f":"IF(ModelNo=B460,5,\"\")","v":""},"1109","Glass Height",{"$f":"Frame_Height-6.125","v":-6.125}]
[{"$f":"IF(ModelNo=B461,6,\"\")","v":""},"1109","Screen Width",{"$f":"TRUNC(((Frame_Width/3)-0.0625)*16+0.5)/16","v":0}]
[{"$f":"IF(ModelNo=B462,7,\"\")","v":""},"1109","Screen Height",{"$f":"Frame_Height-1.625","v":-1.625}]
[{"$f":"IF(ModelNo=B463,8,\"\")","v":""},"1109","Egress Opening Width",{"$f":"(Frame_Width/3)-5.25","v":-5.25}]
[{"$f":"IF(ModelNo=B464,9,\"\")","v":""},"1109","Egress Opening Height",{"$f":"Frame_Height-3.125","v":-3.125}]
[{"$f":"IF(ModelNo=B465,10,\"\")","v":""},"1109","Egress Opening Area (sq.ft.)",{"$f":"(D463*D464)/144","v":0.11393229166666667}]
[{"$f":"IF(ModelNo=B466,11,\"\")","v":""},"1109","Center of Meeting Rail (Lock side)",{"$f":"(TRUNC((Frame_Width/3)*16+0.5)/16)+0.375","v":0.375}]
[{"$f":"IF(ModelNo=B467,12,\"\")","v":""},"1109","Center of Meeting Rail (Mullion side)",{"$f":"(TRUNC((Frame_Width/3)*16+0.5)/16)-0.5","v":-0.5}]