{"text_format":"1","workbook":"xlsx","n_sheets":4,"sheets":["Form","Balance","Tables","Data"],"not_rendered":{"charts":0,"images":2,"macros":1,"external_links":0,"defined_names":191,"comments":1,"pivot_tables":0},"unopened":[],"bounds":{"document_bytes":16777216,"sheet_cells":100000,"rows_first":2000,"rows_last":500,"rows_between":2000,"halvings":0,"cell_chars":16384,"cell_head_chars":4096},"cells_cut":0,"cells_raw":0,"read":"whole","date_system":"1900"}

{"sheet":"Form","index":0,"n_rows":25,"n_cols":16,"rows_kept":25,"cut":false,"hidden":false,"merged":[[3,1,3,7],[3,9,3,12],[2,6,2,7],[2,1,2,5],[28,12,28,13],[27,12,27,13],[2,13,2,14],[3,13,3,14],[13,14,13,15],[2,9,2,12],[6,14,6,15],[5,14,5,15]]}
[]
[null,{"$f":"IF(AND(WSIZE>0,HSIZE>0),\"Only Available At\"&\"  \"&WSIZE&\" x \"&HSIZE&IF(HCONTROL=1,\" or \"&HSIZE2,\"\"),\"\")","v":""},null,null,null,null,null,"Select Model",null,{"$f":"IF(ISERROR(SHATERROR),\"\",IF(SHATERROR=1,\"Adjust CMR to Increase Egress Height\",\"\"))","v":""}]
[null,{"$f":"IF(Model_Select=\"Select Model\",\"\",\"(Model\"&\" \"&ModelNo&\")\")","v":""},null,null,null,null,"Select Model",null,null,{"$f":"\"Min. W:\"&\" \"&MINW","v":"Min. W: 0"},null,null,null,{"$f":"\"Max W:\"&\" \"&MAXW","v":"Max W: 0"}]
[null,{"$f":"Description","v":0},null,null,null,null,null,null,null,{"$f":"\"Min. H:\"&\" \"&MINH","v":"Min. H: 0"},null,null,null,{"$f":"\"Max H:\"&\" \"&MAXH","v":"Max H: 0"},null,{"$f":"\"Max UI:\"&\" \"&MAXUI","v":"Max UI: 0"}]
[null,{"$f":"IF(AND(W>0,H>0),(IF(ISERROR(VLOOKUP(1,Data!$A:$D,3,FALSE)),\"\",VLOOKUP(1,Data!$A:$D,3,FALSE))),\"\")","v":""},null,null,null,null,null,{"$f":"IF(AND(W>0,H>0),(IF(ISERROR(VLOOKUP(1,Data!$A:$D,4,FALSE)),\"\",VLOOKUP(1,Data!$A:$D,4,FALSE))),\"\")","v":""},null,null,null,null,null,"Exact Size"]
[null,{"$f":"IF(AND(W>0,H>0),(IF(ISERROR(VLOOKUP(2,Data!$A:$D,3,FALSE)),\"\",VLOOKUP(2,Data!$A:$D,3,FALSE))),\"\")","v":""},null,null,null,null,null,{"$f":"IF(AND(W>0,H>0),(IF(ISERROR(VLOOKUP(2,Data!$A:$D,4,FALSE)),\"\",VLOOKUP(2,Data!$A:$D,4,FALSE))),\"\")","v":""},null,"Width:",null,null,null,{"$f":"IF(AND(RO=2,W>0),W-WCUTBACK,W)","v":0},{"$f":"IF(AND(W>0,WSIZE>0,W<>WSIZE),\"<< Width Not Available\",\"\")","v":""}]
[null,{"$f":"IF(AND(W>0,H>0),(IF(ISERROR(VLOOKUP(3,Data!$A:$D,3,FALSE)),\"\",VLOOKUP(3,Data!$A:$D,3,FALSE))),\"\")","v":""},null,null,null,null,null,{"$f":"IF(AND(W>0,H>0),(IF(ISERROR(VLOOKUP(3,Data!$A:$D,4,FALSE)),\"\",VLOOKUP(3,Data!$A:$D,4,FALSE))),\"\")","v":""},null,"Height:",null,null,null,{"$f":"IF(AND(RO=2,H>0),H-HCUTBACK,H)","v":0},{"$f":"IF(AND(H>0,HSIZE>0,HSIZE2>0,H<>HSIZE,H<>HSIZE2),\"<< Height Not Available\",\"\")","v":""}]
[null,{"$f":"IF(AND(W>0,H>0),(IF(ISERROR(VLOOKUP(4,Data!$A:$D,3,FALSE)),\"\",VLOOKUP(4,Data!$A:$D,3,FALSE))),\"\")","v":""},null,null,null,null,null,{"$f":"IF(AND(W>0,H>0),(IF(ISERROR(VLOOKUP(4,Data!$A:$D,4,FALSE)),\"\",VLOOKUP(4,Data!$A:$D,4,FALSE))),\"\")","v":""},null,{"$f":"IF(OR(ModelNo=\"S140\",ModelNo=\"S144\",ModelNo=\"S146\",ModelNo=\"S140 (HP)\",ModelNo=\"S144 (HP)\",ModelNo=\"S146 (HP)\"),\"Leg:\",\"\")","v":""}]
[null,{"$f":"IF(AND(W>0,H>0),(IF(ISERROR(VLOOKUP(5,Data!$A:$D,3,FALSE)),\"\",VLOOKUP(5,Data!$A:$D,3,FALSE))),\"\")","v":""},null,null,null,null,null,{"$f":"IF(AND(W>0,H>0),(IF(ISERROR(VLOOKUP(5,Data!$A:$D,4,FALSE)),\"\",VLOOKUP(5,Data!$A:$D,4,FALSE))),\"\")","v":""},null,{"$f":"IF(BTYPE=\"Custom\",\"CMR:\",\"\")","v":""},null,null,null,{"$f":"CMR_MESSAGE","v":0}]
[null,{"$f":"IF(AND(W>0,H>0),(IF(ISERROR(VLOOKUP(6,Data!$A:$D,3,FALSE)),\"\",VLOOKUP(6,Data!$A:$D,3,FALSE))),\"\")","v":""},null,null,null,null,null,{"$f":"IF(AND(W>0,H>0),(IF(ISERROR(VLOOKUP(6,Data!$A:$D,4,FALSE)),\"\",VLOOKUP(6,Data!$A:$D,4,FALSE))),\"\")","v":""},null,{"$f":"IF(SELECTEXT=\"Select Extrusion\",\"Ext.\",IF(SELECTEXT=\"Select Reinforcement\",\"Reinforce\",IF(SELECTEXT=\"Standard\",\"HP >>\",\"\")))","v":""},null,null,null,{"$f":"REINF_MESSAGE","v":""}]
{"$rows_left_out":16}
{"sheet":"Balance","index":1,"n_rows":271,"n_cols":44,"rows_kept":271,"cut":false,"hidden":true,"merged":[[1,2,1,4],[31,38,31,39],[31,41,31,42],[0,19,0,23],[1,17,1,20],[1,22,1,25]]}
[null,null,null,null,null,null,null,null,null,null,null,null,null,null,null,null,null,null,null,"BLOCK & TACKLE BALANCE CHART"]
[null,null,"CFB",null,null,null,null,null,null,null,null,null,null,null,null,null,null,"TOP SASH",null,null,null,null,"BOTTOM SASH"]
[null,{"$f":"VLOOKUP(BTM_WGT,CFB_W,3,FALSE)","v":{"$error":"#N/A"}},4,"3/","BN",null,"3M40A","Length","Weight/ft","Weight",null,"8M40A","Length","Weight/ft","Weight",null,null,"Sash Weight","Tube Length","Balance","Weight",null,"Sash Weight","Tube Length","Balance","Weight",null,null,null,null,null,null,null,"Caldwell Balance Chart"]
[null,null,{"$f":"C3+1","v":5},"3/","BN",null,"Bottom Top Rail",{"$f":"BSW_3M40A/12","v":-0.22395833333333334},0.31,{"$f":"H4*I4","v":-6.9427083333333334E-2},null,"Top Top Rail",{"$f":"TSW_8M40A/12","v":-0.31770833333333331},0.28999999999999998,{"$f":"M4*N4","v":-9.213541666666665E-2},null,null,{"$f":"TRUNC(TOP_WGT+GRID)","v":0},{"$f":"$R$9","v":0},"Number","Range",null,{"$f":"TRUNC(BTM_WGT+GRID)","v":0},{"$f":"$W$9","v":0},"Number","Range",null,null,null,null,null,null,null,{"$f":"IF(OR(ModelNo=\"1700\",ModelNo=\"1720\",ModelNo=\"1730\"),1,IF(OR(ModelNo=\"1900\",ModelNo=\"1920\",ModelNo=\"1930\"),2,3))","v":3},{"$f":"IF(OR(ModelNo=\"1700\",ModelNo=\"1720\",ModelNo=\"1730\"),4,IF(OR(ModelNo=\"1900\",ModelNo=\"1920\",ModelNo=\"1930\"),5,6))","v":6},"Bott.","Top",null,1,4,2,5,3,6]
[null,null,6,"3/","BN",null,"Bottom Bottom Rail",{"$f":"BSW_3M40A/12","v":-0.22395833333333334},0.28499999999999998,-6.3828124999999999E-2,null,"Top Bottom Rail",{"$f":"TSW_8M40A/12","v":-0.31770833333333331},0.28499999999999998,-9.0546874999999985E-2,null,null,"Balance Size",{"$f":"IF(AND(T5>0,U5>0),T5,0)","v":0},{"$f":"IF($S$4<=6,6,0)","v":6},{"$f":"IF(AND(T5=6,$R$4>=2,$R$4<=5),T5&\"A\",0)","v":0},null,"Balance Size",{"$f":"IF(AND(Y5>0,Z5>0),Y5,0)","v":0},{"$f":"IF($X$4<=6,6,0)","v":6},{"$f":"IF(AND(Y5=6,$W$4>=2,$W$4<=5),Y5&\"A\",0)","v":0},null,null,null,null,null,null,null,{"$f":"HLOOKUP($AH$4,CALDWELL_LOOKUP,2,FALSE)","v":9},{"$f":"HLOOKUP($AI$4,CALDWELL_LOOKUP,2,FALSE)","v":9.9994999999999994},8,7,null,9.7665000000000006,10.766,9.2185000000000006,10.218,9,9.9994999999999994]
[null,null,7,"4/","RD",null,"Bottom Stile",{"$f":"((BSH_3M40A)*2)/12","v":-9.375E-2},0.25600000000000001,-2.4E-2,null,"Top Stile",{"$f":"IF(AND(TSH_8M40A>33,TSH_8M40A<=44),TSH_8M40A-9,IF(TSH_8M40A>44,TSH_8M40A-12,0))","v":0},0.25600000000000001,0,null,null,{"$f":"VLOOKUP((MAX(S5:S271)),S5:U271,3,FALSE)","v":0},0,6,{"$f":"IF(AND(T6=6,$R$4>=6,$R$4<=9),T6&\"B\",0)","v":0},null,{"$f":"VLOOKUP((MAX(X5:X271)),X5:Z271,3,FALSE)","v":0},0,6,{"$f":"IF(AND(Y6=6,$W$4>=6,$W$4<=9),Y6&\"B\",0)","v":0},null,null,null,null,null,null,null,{"$f":"HLOOKUP($AH$4,CALDWELL_LOOKUP,3,FALSE)","v":10},{"$f":"HLOOKUP($AI$4,CALDWELL_LOOKUP,3,FALSE)","v":10.999499999999999},9,8,null,10.766500000000001,11.766,10.218500000000001,11.218,10,10.999499999999999]
[null,null,8,"4/","RD",null,"Bottom Rail Reinf.",{"$f":"IF(BSW_3M40A>35.25,(BSW_3M40A-8.25)/12,0)","v":0},0.43,0,null,"Top Rail Reinf.",{"$f":"IF(TSW_8M40A>34.125,(TSW_8M40A-7.125)/12,0)","v":0},0.26,0,null,null,null,0,6,{"$f":"IF(AND(T7=6,$R$4>=10,$R$4<=12),T7&\"C\",0)","v":0},null,null,0,6,{"$f":"IF(AND(Y7=6,$W$4>=10,$W$4<=12),Y7&\"C\",0)","v":0},null,null,null,null,null,null,null,{"$f":"HLOOKUP($AH$4,CALDWELL_LOOKUP,4,FALSE)","v":11},{"$f":"HLOOKUP($AI$4,CALDWELL_LOOKUP,4,FALSE)","v":12.999499999999999},10,9,null,11.766500000000001,13.766,11.218500000000001,13.218,11,12.999499999999999]
[null,null,9,"5/","BU",null,"Bottom Stile Reinf.",{"$f":"IF(BSH_3M40A>29.625,BSH_3M40A-10.125,0)","v":0},0.43,0,null,"Keeper Bead",{"$f":"(TGW_8M40A+0.53)/12","v":-0.42979166666666663},5.6000000000000001E-2,{"$f":"M8*N8","v":-2.406833333333333E-2},null,null,"Top Tube length",0,6,{"$f":"IF(AND(T8=6,$R$4>=13,$R$4<=15),T8&\"D\",0)","v":0},null,"Bott. Tube Length",0,6,{"$f":"IF(AND(Y8=6,$W$4>=13,$W$4<=15),Y8&\"D\",0)","v":0},null,null,null,null,null,null,null,{"$f":"HLOOKUP($AH$4,CALDWELL_LOOKUP,5,FALSE)","v":13},{"$f":"HLOOKUP($AI$4,CALDWELL_LOOKUP,5,FALSE)","v":14.999499999999999},12,10,null,13.766500000000002,15.766000000000002,13.218500000000002,15.218000000000002,13,14.999499999999999]
[null,null,10,"5/","BU",null,"Bottom Glass",{"$f":"(BGW_3M40A*BGH_3M40A)/144","v":7.7229817708333329E-2},{"$f":"GLASS_WGT","v":""},{"$f":"IF(AND(Frame_Width=35.5,Frame_Height=59.5),($H$9*$I$9)-2.25,$H$9*$I$9)","v":{"$error":"#VALUE!"}},null,"Top Glass",{"$f":"(TGW_8M40A*TGH_8M40A)/144","v":0.15058051215277779},{"$f":"GLASS_WGT","v":""},{"$error":"#VALUE!"},null,null,{"$f":"IF(OR(ModelNo=\"8001\",ModelNo=\"R601\"),TOPTUBELENGTH,0)","v":0},0,6,{"$f":"IF(AND(T9=6,$R$4>=16,$R$4<=20),T9&\"E\",0)","v":0},null,{"$f":"IF(OR(ModelNo=\"8001\",ModelNo=\"R601\"),BOTTUBELENGTH,0)","v":0},0,6,{"$f":"IF(AND(Y9=6,$W$4>=16,$W$4<=20),Y9&\"E\",0)","v":0},null,null,null,null,null,null,null,{"$f":"HLOOKUP($AH$4,CALDWELL_LOOKUP,6,FALSE)","v":15.000000000000002},{"$f":"HLOOKUP($AI$4,CALDWELL_LOOKUP,6,FALSE)","v":16.999500000000001},14,12,null,15.766500000000001,17.766000000000002,15.218500000000001,17.218,15.000000000000002,16.999500000000001]
[null,null,11,"6/","YW",null,"Bottom Spacer",{"$f":"((BGW_3M40A*2)+(BGH_3M40A*2))/12","v":-1.1666666666666667},0.106,-0.12366666666666667,null,"Top Spacer",{"$f":"((BGW_8M40A*2)+(BGH_8M40A*2))/12","v":-1.2083333333333333},0.106,-0.12808333333333333,null,null,null,0,6,{"$f":"IF(AND(T10=6,$R$4>=21,$R$4<=24),\"Dbl.\"&T10&\"C\",0)","v":0},null,null,0,6,{"$f":"IF(AND(Y10=6,$W$4>=21,$W$4<=24),\"Dbl.\"&Y10&\"C\",0)","v":0},null,null,null,null,null,null,null,{"$f":"HLOOKUP($AH$4,CALDWELL_LOOKUP,7,FALSE)","v":17},{"$f":"HLOOKUP($AI$4,CALDWELL_LOOKUP,7,FALSE)","v":18.999500000000001},16,14,null,17.766500000000001,19.766000000000002,17.218499999999999,19.218,17,18.999500000000001]
{"$rows_left_out":262}
{"sheet":"Tables","index":2,"n_rows":23,"n_cols":15,"rows_kept":23,"cut":false,"hidden":true,"merged":[]}
[]
[null,null,null,null,null,"Glass Strength"]
[null,null,1,{"$f":"IF(F3>\"\",VLOOKUP(F3,GLASSLOOKUP,2,FALSE),\"\")","v":""},{"$f":"IF(F3>\"\",VLOOKUP(D3,WEIGHTCHART,2,FALSE),\"\")","v":""},{"$f":"GLASS1","v":""},null,null,"Extrusion"]
[null,null,2,"","",{"$f":"GLASS2","v":""},null,1,{"$f":"IF(EXT_1=0,\"\",EXT_1)","v":""},0,0,null,null,null,"Type"]
[null,null,3,"","",{"$f":"GLASS3","v":""},null,2,{"$f":"IF(EXT_2=0,\"\",EXT_2)","v":""},2.40625,12.5,null,null,1,{"$f":"IF(TYPE1>\"\",TYPE1,\"\")","v":""}]
[null,null,4,"","",{"$f":"GLASS4","v":""},null,3,{"$f":"IF(EXT_3=0,\"\",EXT_3)","v":""},2.40625,13,null,null,2,{"$f":"IF(TYPE2>\"\",TYPE2,\"\")","v":""}]
[null,null,5,"","",{"$f":"GLASS5","v":""},null,4,{"$f":"IF(EXT_5=0,\"\",EXT_5)","v":""},1,10,null,null,3,{"$f":"IF(TYPE3>\"\",TYPE3,\"\")","v":""}]
[null,null,6,"","",{"$f":"GLASS6","v":""},null,5,{"$f":"IF(EXT_4=0,\"\",EXT_6)","v":""},1.75,11.75,null,null,1,{"$f":"VLOOKUP(TYPE,N5:O8,2,FALSE)","v":""}]
[null,null,7,"","",{"$f":"GLASS7","v":""},null,6,{"$f":"IF(EXT_4=0,\"\",EXT_7)","v":""},1.8125,12]
[null,null,8,"","",{"$f":"GLASS8","v":""},null,7,{"$f":"IF(EXT_5=0,\"\",EXT_8)","v":""},1.8125,12]
{"$rows_left_out":14}
{"sheet":"Data","index":3,"n_rows":467,"n_cols":81,"rows_kept":467,"cut":false,"hidden":true,"merged":[]}
[null,"Model","Description","Value"]
[{"$f":"IF(ModelNo=B2,1,\"\")","v":""},"3M40A","Sash Width",{"$f":"BSW_3M40A","v":-2.6875},null,{"$f":"Model_Select","v":"Select Model"},"Models","Description","W cut-back","H-cut-back","Width","Height","Min W","Min H","Max W","Max H","Max UI","Type1","Type2","Type3","CMR_MSG","Screen1","Screen2","Screen3","Ext./Reinf.","Ext./Reinf.","Ext./Reinf.","Ext./Reinf.","Ext./Reinf.","Ext./Reinf.","Ext./Reinf.","Ext./Reinf.","Glass1","Glass2","Glass3","Glass4","Glass5","Glass6","Glass7","Glass8","Opening","CDIM","DDIM","TSW","TSH","TGW","TGH","TGSF","BSW","BSH","BGW","BGH","BGSF","Bott. Sash Weight","Top Sash Weight","Bot. of Coil From CMR","Head + 4","Sill","EW","EH",null,null,null,null,null,null,null,null,"Triple IG calculation",null,null,null,null,null,null,null,"S140 Limitations"]
[{"$f":"IF(ModelNo=B3,2,\"\")","v":""},"3M40A","Sash Height",{"$f":"BSH_3M40A","v":-0.5625},null,1,"Select Model"]
[{"$f":"IF(ModelNo=B4,3,\"\")","v":""},"3M40A","Top Glass Width",{"$f":"TGW_3M40A","v":-3.0625},null,2,"3M40A","3000 Series Single Hung",0,0,null,null,15.5,25.5,43,75,118,"Standard","Custom",null,{"$f":"IF(AND(W>0,H>0,BTYPE=\"Custom\",CMR=0),\"<< Enter CMR Location\",IF(AND(W>0,H>0,BTYPE=\"Custom\"),\"<< CMR, Bottom-Up\",\"\"))","v":""},"Half Only",null,null,null,null,null,null,null,null,null,null,"Double Strength (3 mm)","M. Strength (4 mm)","Triple Strength (5 mm)","Triple IG Double Strength","Laminated",null,null,null,{"$f":"IF(RO=2,\"<< Exact Size Only\",\"\")","v":""},{"$f":"Frame_Height-DDIM_3M40A","v":0},{"$f":"IF(TYPE=1,(Frame_Height/2),IF(TYPE=2,CMR))","v":0},null,null,{"$f":"Frame_Width-3.0625","v":-3.0625},{"$f":"CDIM_3M40A-2.4375","v":-2.4375},{"$f":"(AT4*AU4)/144","v":5.1839192708333336E-2},{"$f":"Frame_Width-2.6875","v":-2.6875},{"$f":"DDIM_3M40A-0.5625","v":-0.5625},{"$f":"Frame_Width-4.5625","v":-4.5625},{"$f":"DDIM_3M40A-2.4375","v":-2.4375},{"$f":"(AY4*AZ4)/144","v":7.7229817708333329E-2},{"$f":"BWGT_3M40A","v":{"$error":"#VALUE!"}},null,{"$f":"IF(COIL=1,3.5625-0.16875,3.5625+((COIL-1)*1.625)-0.16875)","v":{"$error":"#N/A"}},{"$f":"1.375+4","v":5.375},1.96875,{"$f":"Frame_Width-4","v":-4},{"$f":"IF(AND(AX4>36.0625,(Frame_Height/2)<=CMR),CDIM_3M40A-BF4-BD4-0.125,IF(OR(AND(AX4>36.0625,(Frame_Height/2)<=CMR),(Frame_Height/2)>=CMR),Frame_Height-AX4-BE4-BF4,CDIM_3M40A-BF4-BD4-0.125))","v":-6.78125},null,null,null,1,"Single Strength (2.5 mm)",null,null,null,"SS (2.2)","DS (3.2)","4 mm","TS (5.0)",null,null,null,null,"Min. W","Min. H","Max. W","Max. H","Max. UI"]
[{"$f":"IF(ModelNo=B5,4,\"\")","v":""},"3M40A","Top Glass Height",{"$f":"TGH_3M40A","v":-2.4375},null,3,"8M40A","3000 Series Double Hung",0,0,null,null,16.5,27.5,44,77,121,"Standard","Custom",null,{"$f":"IF(AND(W>0,H>0,BTYPE=\"Custom\",CMR=0),\"<< Enter CMR Location\",IF(AND(W>0,H>0,BTYPE=\"Custom\"),\"<< CMR, Bottom-Up\",\"\"))","v":""},"Full Only",null,null,null,null,null,null,null,null,null,null,"Double Strength (3 mm)","M. Strength (4 mm)","Triple Strength (5 mm)","Triple IG Double Strength","Laminated",null,null,null,"",{"$f":"Frame_Height-DDIM_8M40A","v":0},{"$f":"IF(TYPE=1,(Frame_Height/2),IF(TYPE=2,CMR))","v":0},{"$f":"Frame_Width-3.8125","v":-3.8125},{"$f":"CDIM_8M40A-1.9375","v":-1.9375},{"$f":"Frame_Width-5.6875","v":-5.6875},{"$f":"CDIM_8M40A-3.8125","v":-3.8125},{"$f":"(TGW_8M40A*TGH_8M40A)/144","v":0.15058051215277779},{"$f":"Frame_Width-2.6875","v":-2.6875},{"$f":"DDIM_8M40A-0.8125","v":-0.8125},{"$f":"Frame_Width-4.5625","v":-4.5625},{"$f":"DDIM_8M40A-2.6875","v":-2.6875},{"$f":"(BGW_8M40A*BGH_8M40A)/144","v":8.5150824652777776E-2},{"$f":"BWGT_8M40A","v":{"$error":"#VALUE!"}},{"$f":"TWGT_8M40A","v":{"$error":"#VALUE!"}},{"$f":"IF(COIL=1,3.5625-0.16875,3.5625+((COIL-1)*1.625)-0.16875)","v":{"$error":"#N/A"}},{"$f":"1.375+4","v":5.375},1.96875,{"$f":"Frame_Width-4","v":-4},{"$f":"IF(AND(AX5>36.0625,(Frame_Height/2)<=CMR),CDIM_3M40A-BF5-BD5-0.125,IF(OR(AND(AX5>36.0625,(Frame_Height/2)<=CMR),(Frame_Height/2)>=CMR),Frame_Height-AX5-BE5-BF5,CDIM_3M40A-BF5-BD5-0.125))","v":-6.53125},null,null,null,2,"Double Strength (3 mm)",null,null,"Max. Short",{"$f":"IF(TG2W>41,0,41)","v":41},{"$f":"IF(TG2W>56,0,56)","v":56},{"$f":"IF(TG2W>67,0,67)","v":67},{"$f":"IF(TG2W>70,0,70)","v":70},"Annealed",null,null,"Mezzo",25,40]
[{"$f":"IF(ModelNo=B6,5,\"\")","v":""},"3M40A","Bottom Glass Width",{"$f":"BGW_3M40A","v":-4.5625},null,4,"3M10A","3000 Series Single Slider Lift-Out",0,0,null,null,25.5,15.5,71,55,126,"Standard","Custom",null,{"$f":"IF(AND(W>0,H>0,BTYPE=\"Custom\",CMR=0),\"<< Enter CMR Location\",IF(AND(W>0,H>0,BTYPE=\"Custom\"),\"<< CMR, Left to Right\",\"\"))","v":""},"Half Only",null,null,null,null,null,null,null,null,null,null,"Double Strength (3 mm)","M. Strength (4 mm)","Triple Strength (5 mm)","Triple IG Double Strength","Laminated",null,null,null,"",{"$f":"Frame_Width-DDIM_3M10A","v":0},{"$f":"IF(TYPE=1,(Frame_Width/2),IF(TYPE=2,CMR))","v":0},null,null,null,null,null,null,null,null,null,null,null,null,null,null,null,null,null,null,null,null,3,"Triple Strength (5 mm)",null,null,"Max. Long",{"$f":"IF(TG2H>62,0,62)","v":62},{"$f":"IF(TG2H>76,0,76)","v":76},{"$f":"IF(TG2H>90,0,90)","v":90},{"$f":"IF(TG2H>102,0,102)","v":102},"Annealed",null,null,"Mezzo/N.F",26,41]
[{"$f":"IF(ModelNo=B7,6,\"\")","v":""},"3M40A","Bottom Glass Height",{"$f":"BGH_3M40A","v":-2.4375},null,5,"3M10R","3000 Series Single Slider Lift-Out Reverse",0,0,null,null,25.5,15.5,71,55,126,"Standard","Custom",null,{"$f":"IF(AND(W>0,H>0,BTYPE=\"Custom\",CMR=0),\"<< Enter CMR Location\",IF(AND(W>0,H>0,BTYPE=\"Custom\"),\"<< CMR, Left to Right\",\"\"))","v":""},"Half Only",null,null,null,null,null,null,null,null,null,null,"Double Strength (3 mm)","M. Strength (4 mm)","Triple Strength (5 mm)","Triple IG Double Strength","Laminated",null,null,null,"",{"$f":"IF(TYPE=1,(Frame_Width/2),IF(TYPE=2,CMR))","v":0},{"$f":"Frame_Width-CDIM_3M10R","v":0},null,null,null,null,null,null,null,null,null,null,null,null,null,null,null,null,null,null,null,null,4,"Triple IG Single Strrength",null,null,"Max Sq.Ft.",{"$f":"IF(TG2A>12,0,12)","v":12},{"$f":"IF(TG2A>22,0,22)","v":22},{"$f":"IF(TG2A>32,0,32)","v":32},{"$f":"IF(TG2A>35,0,35)","v":35},"Annealed",null,null,"New Construction",20,36]
[{"$f":"IF(ModelNo=B8,7,\"\")","v":""},"3M40A","Screen Width",{"$f":"Frame_Width-3.5","v":-3.5},null,6,"3M10C13","3000 Series End Vent (1/3-1/3-1/3)",0,0,null,null,36,15.5,87,58,145,"Standard (1/3-1/3-1/3)",null,null,{"$f":"IF(AND(W>0,H>0,BTYPE=\"Custom\",CMR=0),\"<< Enter CMR Location\",IF(AND(W>0,H>0,BTYPE=\"Custom\"),\"<< CMR, Ends to M.R\",\"\"))","v":""},"Half Only",null,null,null,null,null,null,null,null,null,null,"Double Strength (3 mm)","M. Strength (4 mm)","Triple Strength (5 mm)","Triple IG Double Strength","Laminated",null,null,null,"",{"$f":"Frame_Width-(DDIM_3M10C13*2)","v":0},{"$f":"Frame_Width/3","v":0},null,null,null,null,null,null,null,null,null,null,null,null,null,null,null,null,null,null,null,null,5,"Triple IG Double Strength",null,null,"Max. Short",0,{"$f":"IF(TG2W>42,0,42)","v":42},{"$f":"IF(TG2W>70,0,70)","v":70},{"$f":"IF(TG2W>70,0,70)","v":70},"Tempered",null,null,"0700 Series",20,36]
[{"$f":"IF(ModelNo=B9,8,\"\")","v":""},"3M40A","Screen Height",{"$f":"DDIM_3M40A-1.9375","v":-1.9375},null,7,"3M10C14","3000 Series End Vent (1/4-1/2-1/4)",null,null,null,null,45,15.5,113,58,171,"Standard (1/4-1/2-1/4)",null,null,{"$f":"IF(AND(W>0,H>0,BTYPE=\"Custom\",CMR=0),\"<< Enter CMR Location\",IF(AND(W>0,H>0,BTYPE=\"Custom\"),\"<< CMR, Ends to M.R\",\"\"))","v":""},"Half Only",null,null,null,null,null,null,null,null,null,null,"Double Strength (3 mm)","M. Strength (4 mm)","Triple Strength (5 mm)","Triple IG Double Strength","Laminated",null,null,null,"",{"$f":"Frame_Width-(DDIM_3M10C14*2)","v":0},{"$f":"Frame_Width/4","v":0},null,null,null,null,null,null,null,null,null,null,null,null,null,null,null,null,null,null,null,null,6,"Laminated",null,null,"Max. Long",0,{"$f":"IF(TG2H>84,0,84)","v":84},{"$f":"IF(TG2H>129,0,129)","v":129},{"$f":"IF(TG2H>129,0,129)","v":129},"Tempered",null,null,"Fusion",23.5,38]
[{"$f":"IF(ModelNo=B10,9,\"\")","v":""},"3M40A","Bottom Sash Weight",{"$f":"IF(ISERROR(BTM_WGT&\" \"&\"lb\"),\"N/A\",BTM_WGT&\" \"&\"lb\")","v":"0 lb"},null,8,"8M10A","3000 Series Double Slider",null,null,null,null,27.5,16.5,71,56,127,"Standard","Custom",null,{"$f":"IF(AND(W>0,H>0,BTYPE=\"Custom\",CMR=0),\"<< Enter CMR Location\",IF(AND(W>0,H>0,BTYPE=\"Custom\"),\"<< CMR, Left to Right\",\"\"))","v":""},"Full Only",null,null,null,null,null,null,null,null,null,null,"Double Strength (3 mm)","M. Strength (4 mm)","Triple Strength (5 mm)","Triple IG Double Strength","Laminated",null,null,null,"",{"$f":"Frame_Width-DDIM_3M10A","v":0},{"$f":"IF(TYPE=1,(Frame_Width/2),IF(TYPE=2,CMR))","v":0},null,null,null,null,null,null,null,null,null,null,null,null,null,null,null,null,null,null,null,null,7,"HP Package",null,null,"Max Sq.Ft.",0,{"$f":"IF(TG2A>24.5,0,24.5)","v":24.5},{"$f":"IF(TG2A>42,0,42)","v":42},{"$f":"IF(TG2A>42,0,42)","v":42},"Tempered",null,null,1700,24]
{"$rows_left_out":457}